"molecule_id","AMW","C.","H.","Me","Mi","Mp","Mv","MW","N.","nAB","nAT","nB","nBM","nBO","nBR","nBT","nC","nCL","nCsp","nCsp2","nCsp3","nDB","nF","nH","nHet","nHM","nI","nN","nO","nP","nS","nSK","nTB","nX","O.","RBF","RBN","SCBO","Se","Si","Sp","Sv","X.","pXC50"
{1 8.859,2 45,3 35,4 1.037,5 1.119,6 0.683,7 0.687,8 177.17,9 5,10 6,11 20,13 8,14 14,16 21,17 9,20 8,21 1,22 2,24 7,25 4,28 1,29 3,32 13,35 15,38 19,39 20.735,40 22.372,41 13.653,42 13.746,44 6.921}
{0 CHEMBL183852,1 9.377,2 42.1,3 31.6,4 1.05,5 1.129,6 0.679,7 0.697,8 178.16,9 10.5,10 6,11 19,13 8,14 14,16 20,17 8,20 8,22 2,24 6,25 5,28 2,29 3,32 13,35 15.8,38 19,39 19.953,40 21.455,41 12.898,42 13.241,44 5.229}
{0 CHEMBL204900,1 8.794,2 42.9,3 35.7,4 1.037,5 1.125,6 0.674,7 0.679,8 246.24,9 7.1,10 12,11 28,13 13,14 19,16 29,17 12,20 11,21 1,22 1,24 10,25 6,28 2,29 4,32 18,35 14.3,36 0.103,37 3,38 26,39 29.047,40 31.495,41 18.875,42 19.009,44 5.678}
{0 CHEMBL440562,1 9.288,2 44,3 32,4 1.047,5 1.123,6 0.685,7 0.699,8 232.21,9 8,10 12,11 25,13 13,14 18,16 26,17 11,20 11,22 1,24 8,25 6,28 2,29 4,32 17,35 16,36 0.077,37 2,38 25,39 26.164,40 28.08,41 17.114,42 17.482,44 4.943}
{0 CHEMBL522795,1 10.517,2 41.2,3 35.3,4 1.039,5 1.119,6 0.712,7 0.696,8 536.39,9 5.9,10 16,11 51,13 20,14 36,15 1,16 54,17 21,20 15,21 6,22 4,24 18,25 12,26 2,28 3,29 7,31 1,32 33,34 1,35 13.7,36 0.167,37 9,38 48,39 52.971,40 57.044,41 36.29,42 35.494,43 2,44 4.301}
{0 CHEMBL539211,1 8.396,2 41.9,3 38.7,4 1.03,5 1.126,6 0.666,7 0.662,8 260.27,9 6.5,10 12,11 31,13 13,14 20,16 32,17 13,20 11,21 2,22 1,24 12,25 6,28 2,29 4,32 19,35 12.9,36 0.125,37 4,38 27,39 31.931,40 34.91,41 20.636,42 20.536,44 4.155}
{0 CHEMBL550937,1 7.209,2 40,3 48,4 1.011,5 1.125,6 0.637,7 0.612,8 180.22,11 25,13 4,14 13,16 25,17 10,20 7,21 3,22 4,24 12,25 3,29 3,32 13,35 12,36 0.04,37 1,38 17,39 25.284,40 28.119,41 15.932,42 15.305,44 6.222}
{0 CHEMBL551212,1 11.254,2 42.9,3 28.6,4 1.061,5 1.121,6 0.735,7 0.738,8 315.12,9 7.1,10 12,11 28,13 13,14 21,16 29,17 12,18 2,20 11,21 1,22 1,24 8,25 8,26 2,28 2,29 4,32 20,34 2,35 14.3,36 0.103,37 3,38 28,39 29.695,40 31.383,41 20.591,42 20.664,43 7.1,44 5.921}
{0 CHEMBL557770,1 9.616,2 45.5,3 33.3,4 1.037,5 1.107,6 0.719,7 0.71,8 317.34,9 3,10 11,11 33,13 15,14 23,16 34,17 15,20 14,21 1,22 4,24 11,25 7,26 1,28 1,29 5,31 1,32 22,35 15.2,36 0.176,37 6,38 32.5,39 34.233,40 36.541,41 23.733,42 23.417,44 5.187}
{0 CHEMBL559337,1 9.546,2 46.2,3 30.8,4 1.058,5 1.112,6 0.684,7 0.708,8 248.2,10 6,11 26,13 10,14 19,16 27,17 12,20 12,22 4,24 8,25 6,29 6,32 18,35 23.1,36 0.037,37 1,38 26,39 27.498,40 28.917,41 17.773,42 18.396,44 4.65}
{0 CHEMBL561881,1 8.396,2 41.9,3 38.7,4 1.03,5 1.126,6 0.666,7 0.662,8 260.27,9 6.5,10 12,11 31,13 13,14 20,16 32,17 13,20 11,21 2,22 1,24 12,25 6,28 2,29 4,32 19,35 12.9,36 0.125,37 4,38 27,39 31.931,40 34.91,41 20.636,42 20.536,44 5.018}
{0 CHEMBL562080,1 13.408,2 45.2,3 25.8,4 1.054,5 1.103,6 0.798,7 0.776,8 415.66,9 6.5,10 16,11 31,13 17,14 25,15 1,16 33,17 14,18 1,20 13,21 1,22 1,24 8,25 9,26 3,28 2,29 4,31 1,32 23,34 2,35 12.9,36 0.091,37 3,38 34,39 32.676,40 34.201,41 24.733,42 24.049,43 6.5,44 6.77}
{0 CHEMBL572124,1 11.099,2 40.6,3 34.4,4 1.046,5 1.124,6 0.701,7 0.696,8 355.16,9 6.3,10 12,11 32,13 13,14 22,15 1,16 33,17 13,20 11,21 2,22 1,24 11,25 8,26 1,28 2,29 5,32 21,34 1,35 15.6,36 0.121,37 4,38 29,39 33.487,40 35.961,41 22.443,42 22.276,43 3.1,44 6.046}
