"molecule_id","BIC2","AAC","AECC","ALOGP","ALOGP2","AMR","AMW","ARR","ATS1e","ATS1i","ATS1m","ATS1p","ATS1s","ATS1v","ATS2e","ATS2i","ATS2m","ATS2p","ATS2s","ATS2v","ATS3e","ATS3i","ATS3m","ATS3p","ATS3s","ATS3v","ATS4e","ATS4i","ATS4m","ATS4p","ATS4s","ATS4v","ATS5e","ATS5i","ATS5m","ATS5p","ATS5s","ATS5v","ATS6e","ATS6i","ATS6m","ATS6p","ATS6s","ATS6v","ATS7e","ATS7i","ATS7m","ATS7p","ATS7s","ATS7v","ATS8e","ATS8i","ATS8m","ATS8p","ATS8s","ATS8v","ATSC1e","ATSC1i","ATSC1m","ATSC1p","ATSC1s","ATSC1v","ATSC2e","ATSC2i","ATSC2m","ATSC2p","ATSC2s","ATSC2v","ATSC3e","ATSC3i","ATSC3m","ATSC3p","ATSC3s","ATSC3v","ATSC4e","ATSC4i","ATSC4m","ATSC4p","ATSC4s","ATSC4v","ATSC5e","ATSC5i","ATSC5m","ATSC5p","ATSC5s","ATSC5v","ATSC6e","ATSC6i","ATSC6m","ATSC6p","ATSC6s","ATSC6v","ATSC7e","ATSC7i","ATSC7m","ATSC7p","ATSC7s","ATSC7v","ATSC8e","ATSC8i","ATSC8m","ATSC8p","ATSC8s","ATSC8v","BAC","BBI","BIC0","BIC1","BIC3","BIC4","BIC5","BID","BLI","BLTA96","BLTD48","BLTF96","Br.094","C.","C.001","C.005","C.006","C.013","C.016","C.020","C.024","C.025","C.026","C.027","C.028","C.029","C.031","C.033","C.034","C.037","C.039","C.040","C.043","C.044","CATS2D_00_DD","CATS2D_00_DP","CATS2D_00_PP","CATS2D_01_AA","CATS2D_01_DA","CATS2D_01_LL","CATS2D_02_AA","CATS2D_02_AL","CATS2D_02_AP","CATS2D_02_DA","CATS2D_02_DL","CATS2D_02_LL","CATS2D_02_PL","CATS2D_03_AA","CATS2D_03_AL","CATS2D_03_DL","CATS2D_03_LL","CATS2D_03_PL","CATS2D_04_AA","CATS2D_04_AL","CATS2D_04_AP","CATS2D_04_DA","CATS2D_04_DL","CATS2D_04_LL","CATS2D_04_PL","CATS2D_05_AA","CATS2D_05_AL","CATS2D_05_DA","CATS2D_05_DL","CATS2D_05_LL","CATS2D_06_AA","CATS2D_06_AL","CATS2D_06_AP","CATS2D_06_DA","CATS2D_06_DL","CATS2D_06_LL","CATS2D_07_AA","CATS2D_07_AL","CATS2D_07_AP","CATS2D_07_DA","CATS2D_07_DL","CATS2D_07_LL","CATS2D_08_AA","CATS2D_08_AL","CATS2D_08_AP","CATS2D_08_DA","CATS2D_08_DL","CATS2D_08_LL","CATS2D_09_AA","CATS2D_09_AL","CATS2D_09_DA","CATS2D_09_DL","CATS2D_09_LL","CENT","Chi0_AEA.bo.","Chi0_AEA.dm.","Chi0_AEA.ed.","Chi0_AEA.ri.","Chi0_EA","Chi0_EA.bo.","Chi0_EA.dm.","Chi0_EA.ed.","Chi0_EA.ri.","Chi1_AEA.bo.","Chi1_AEA.dm.","Chi1_AEA.ed.","Chi1_AEA.ri.","Chi1_EA","Chi1_EA.bo.","Chi1_EA.dm.","Chi1_EA.ed.","Chi1_EA.ri.","CIC0","CIC1","CIC2","CIC3","CIC4","CIC5","CID","Cl.089","CMC.50","CMC.80","CSI","DBI","D.Dtr05","D.Dtr06","D.Dtr09","D.Dtr10","DECC","DELS","Depressant.50","Depressant.80","DLS_01","DLS_02","DLS_03","DLS_04","DLS_05","DLS_06","pXC50"
{1 0.78,2 2.019,3 10.25,4 4.013,5 16.107,6 102.892,7 10.447,8 0.677,9 3.86,10 3.934,11 3.843,12 3.464,13 5.116,14 3.458,15 4.362,16 4.461,17 4.215,18 3.854,19 5.912,20 3.854,21 4.55,22 4.677,23 4.26,24 3.956,25 5.987,26 3.934,27 4.63,28 4.764,29 4.212,30 3.916,31 6.07,32 3.919,33 4.534,34 4.671,35 4.197,36 3.842,37 5.929,38 3.829,39 4.548,40 4.719,41 4.101,42 3.758,43 6.202,44 3.702,45 4.315,46 4.467,47 3.913,48 3.603,49 5.816,50 3.559,51 4.171,52 4.301,53 3.739,54 3.446,55 5.629,56 3.425,57 0.236,58 0.667,59 4.858,60 3.475,61 23.527,62 2.954,63 0.566,64 1.04,65 7.94,66 5.491,67 80.496,68 5.074,69 0.642,70 1.207,71 17.824,72 7.479,73 56.905,74 6.332,75 0.856,76 1.231,77 18.003,78 7.665,79 114.83,80 5.783,81 0.734,82 1.139,83 14.622,84 6.838,85 87.565,86 5.433,87 1.053,88 1.065,89 17.916,90 7.445,91 163.814,92 7.614,93 0.643,94 0.83,95 24.044,96 7.032,97 70.218,98 6.781,99 0.612,100 0.69,101 16.157,102 5.495,103 94.978,104 4.056,105 38,106 47,107 0.345,108 0.658,109 0.873,110 0.873,111 0.873,112 3.375,113 0.948,114 -4.11,115 -4.06,116 -3.84,118 42.5,119 1,125 7,127 3,129 2,132 2,133 1,137 1,142 3,144 3,145 5,146 7,150 4,152 3,153 16,155 2,157 2,158 12,162 2,164 4,165 9,168 4,169 9,170 4,174 4,175 4,176 7,180 1,182 7,186 2,187 1,188 6,191 3,192 1112,193 18.289,194 18.289,195 18.289,196 18.289,197 18.289,198 15.308,199 11.891,200 10.3,201 18.836,202 15.265,203 15.265,204 15.265,205 15.265,206 15.265,207 10.685,208 9.531,209 4.848,210 16.235,211 3.303,212 1.473,213 0.76,214 0.219,215 0.219,216 0.219,217 4.062,218 1,220 1,221 621,222 3.674,223 132.626,224 169.001,225 114.52,227 1.607,228 48.132,231 1,232 0.83,233 1,234 0.4,236 1,237 6.553}
{0 CHEMBL223071,1 0.798,2 2.019,3 10.25,4 4.301,5 18.499,6 106.159,7 11.558,8 0.677,9 3.858,10 3.932,11 3.919,12 3.479,13 5.104,14 3.464,15 4.359,16 4.46,17 4.317,18 3.879,19 5.894,20 3.866,21 4.541,22 4.661,23 4.393,24 4.002,25 5.951,26 3.956,27 4.653,28 4.782,29 4.336,30 3.966,31 6.088,32 3.938,33 4.603,34 4.768,35 4.349,36 3.828,37 5.969,38 3.808,39 4.429,40 4.562,41 4.212,42 3.707,43 6.196,44 3.688,45 4.36,46 4.512,47 4.021,48 3.61,49 5.86,50 3.565,51 4.09,52 4.236,53 3.947,54 3.451,55 5.465,56 3.398,57 0.227,58 0.664,59 2.563,60 3.517,61 20.828,62 2.938,63 0.551,64 1.041,65 5.073,66 5.632,67 78.577,68 5.04,69 0.567,70 1.214,71 19.649,72 8.002,73 49.19,74 6.644,75 0.779,76 1.284,77 22.264,78 9.317,79 99.264,80 7.099,81 0.921,82 1.183,83 19.738,84 8.243,85 126.842,86 6.465,87 0.921,88 1.005,89 15.665,90 6.352,91 136.654,92 5.178,93 0.721,94 0.873,95 17.825,96 6.759,97 94.589,98 5.833,99 0.436,100 0.681,101 24.119,102 5.931,103 57.375,104 4.884,105 38,106 47,107 0.345,108 0.676,109 0.873,110 0.873,111 0.873,112 3.375,113 0.987,114 -4.23,115 -4.17,116 -3.94,117 1,118 42.5,119 1,125 6,126 1,127 3,128 1,129 1,132 2,133 1,137 1,142 3,144 4,145 5,146 6,150 5,152 3,153 15,155 4,157 2,158 14,164 4,165 10,168 3,169 9,170 6,174 4,175 4,176 5,180 1,182 8,187 1,188 7,191 2,192 1144,193 18.289,194 18.289,195 18.289,196 18.289,197 18.289,198 15.308,199 10.664,200 10.259,201 18.851,202 15.246,203 15.246,204 15.246,205 15.246,206 15.246,207 10.676,208 8.699,209 4.823,210 16.257,211 3.303,212 1.37,213 0.657,214 0.219,215 0.219,216 0.219,217 4.061,220 1,221 621,222 3.674,223 133.573,224 169.928,225 114.362,227 1.607,228 46.171,231 1,232 0.67,233 1,234 0.4,236 1,237 8.745}
{0 CHEMBL224513,1 0.771,2 1.985,3 10.276,4 4.5,5 20.246,6 107.933,7 10.044,8 0.656,9 3.919,10 3.998,11 3.868,12 3.518,13 5.152,14 3.505,15 4.431,16 4.545,17 4.246,18 3.912,19 5.938,20 3.905,21 4.61,22 4.735,23 4.326,24 4.044,25 6.012,26 4.012,27 4.739,28 4.873,29 4.294,30 4.04,31 6.148,32 4.022,33 4.721,34 4.882,35 4.26,36 3.947,37 6.077,38 3.928,39 4.646,40 4.819,41 4.183,42 3.86,43 6.278,44 3.812,45 4.508,46 4.673,47 3.956,48 3.722,49 5.974,50 3.663,51 4.254,52 4.398,53 3.792,54 3.525,55 5.661,56 3.497,57 0.234,58 0.706,59 6.093,60 3.809,61 20.567,62 3.515,63 0.573,64 1.106,65 11.126,66 6.17,67 81.187,68 6.264,69 0.61,70 1.289,71 18.057,72 7.952,73 52.683,74 7.164,75 0.803,76 1.388,77 24.124,78 9.384,79 100.119,80 7.826,81 0.95,82 1.315,83 22.488,84 8.432,85 124.995,86 7.304,87 1.064,88 1.196,89 19.661,90 7.759,91 150.362,92 8.084,93 0.819,94 0.963,95 28.378,96 8.411,97 102.072,98 8.093,99 0.599,100 0.753,101 18.606,102 6.078,103 92.073,104 5.074,105 51,106 49,107 0.335,108 0.669,109 0.864,110 0.864,111 0.864,112 3.409,113 0.957,114 -4.35,115 -4.28,116 -4.04,118 41.9,119 2,125 6,126 1,127 3,129 2,132 2,133 1,137 1,142 3,144 4,145 5,146 7,150 5,152 3,153 16,155 4,157 2,158 15,162 2,164 4,165 11,168 4,169 9,170 6,174 5,175 4,176 7,180 1,182 8,186 2,187 1,188 7,191 4,192 1230,193 18.789,194 18.789,195 18.789,196 18.789,197 18.789,198 15.755,199 13.046,200 10.487,201 19.325,202 15.736,203 15.736,204 15.736,205 15.736,206 15.736,207 11.077,208 10.135,209 4.933,210 16.695,211 3.441,212 1.466,213 0.861,214 0.314,215 0.314,216 0.314,217 4.093,218 1,220 1,221 642,222 3.742,223 137.408,224 175.876,225 118.985,227 1.577,228 49.606,231 1,232 0.83,233 1,234 0.4,236 1,237 8.553}
{0 CHEMBL224656,1 0.763,2 2.019,3 10.893,4 4.013,5 16.107,6 102.892,7 10.447,8 0.677,9 3.86,10 3.934,11 3.843,12 3.464,13 5.116,14 3.458,15 4.362,16 4.461,17 4.215,18 3.854,19 5.912,20 3.854,21 4.55,22 4.677,23 4.26,24 3.956,25 5.988,26 3.934,27 4.63,28 4.764,29 4.17,30 3.91,31 6.093,32 3.91,33 4.522,34 4.674,35 4.065,36 3.815,37 5.866,38 3.786,39 4.443,40 4.63,41 4.076,42 3.752,43 5.634,44 3.662,45 4.37,46 4.505,47 4,48 3.596,49 6.193,50 3.569,51 4.142,52 4.272,53 3.77,54 3.432,55 5.654,56 3.417,57 0.236,58 0.667,59 4.858,60 3.475,61 23.527,62 2.954,63 0.566,64 1.04,65 7.94,66 5.491,67 80.385,68 5.074,69 0.642,70 1.207,71 17.824,72 7.479,73 57.322,74 6.332,75 0.857,76 1.222,77 18.5,78 7.801,79 108.159,80 5.782,81 0.763,82 1.099,83 13.785,84 6.552,85 102.583,86 5.459,87 0.633,88 1.029,89 17.336,90 7.31,91 61.926,92 7.72,93 0.939,94 0.836,95 25.081,96 7.322,97 155.284,98 7.08,99 0.596,100 0.694,101 15.52,102 5.144,103 85.669,104 3.92,105 38,106 47,107 0.345,108 0.658,109 0.839,110 0.839,111 0.839,112 3.375,113 0.948,114 -4.11,115 -4.06,116 -3.84,118 42.5,119 1,125 7,127 3,129 2,132 2,133 1,137 1,142 3,144 3,145 5,146 7,150 3,152 3,153 17,155 3,157 2,158 16,162 2,164 1,165 5,168 4,169 5,170 3,174 5,175 9,176 6,181 2,182 7,186 2,188 8,191 4,192 1142,193 18.289,194 18.289,195 18.289,196 18.289,197 18.289,198 15.308,199 11.891,200 10.254,201 18.836,202 15.248,203 15.248,204 15.248,205 15.248,206 15.248,207 10.679,208 8.611,209 4.811,210 16.223,211 3.303,212 1.473,213 0.86,214 0.419,215 0.419,216 0.419,217 4.062,218 1,220 1,221 661,222 3.674,223 136.892,224 170.637,225 117.153,227 1.765,228 47.29,231 1,232 0.83,233 1,234 0.4,236 1,237 4.523}
{0 CHEMBL224769,1 0.771,2 1.985,3 10.276,4 4.584,5 21.009,6 110.751,7 11.078,8 0.656,9 3.917,10 3.996,11 3.942,12 3.532,13 5.138,14 3.511,15 4.429,16 4.543,17 4.346,18 3.931,19 5.924,20 3.913,21 4.606,22 4.731,23 4.434,24 4.064,25 5.992,26 4.02,27 4.736,28 4.871,29 4.394,30 4.061,31 6.136,32 4.03,33 4.718,34 4.879,35 4.413,36 3.971,37 6.057,38 3.939,39 4.643,40 4.817,41 4.348,42 3.887,43 6.26,44 3.824,45 4.502,46 4.666,47 4.119,48 3.759,49 5.945,50 3.677,51 4.251,52 4.395,53 3.999,54 3.554,55 5.651,56 3.505,57 0.226,58 0.704,59 3.859,60 3.855,61 18.282,62 3.496,63 0.554,64 1.109,65 8.772,66 6.355,67 78.287,68 6.289,69 0.559,70 1.306,71 21.709,72 8.411,73 45.658,74 7.29,75 0.761,76 1.407,77 24.421,78 9.87,79 91.504,80 7.926,81 0.912,82 1.342,83 20.251,84 8.871,85 117.264,86 7.335,87 1.034,88 1.224,89 17.743,90 8.156,91 145.843,92 8.135,93 0.75,94 0.997,95 41.277,96 9.413,97 91.776,98 8.491,99 0.567,100 0.767,101 26.741,102 6.75,103 84.798,104 5.214,105 51,106 49,107 0.335,108 0.669,109 0.864,110 0.864,111 0.864,112 3.409,113 0.996,114 -4.46,115 -4.39,116 -4.14,117 1,118 41.9,119 2,125 6,126 1,127 3,129 2,132 2,133 1,137 1,142 3,144 4,145 5,146 7,150 5,152 3,153 16,155 4,157 2,158 15,162 2,164 4,165 11,168 4,169 9,170 6,174 5,175 4,176 7,180 1,182 8,186 2,187 1,188 7,191 4,192 1230,193 18.789,194 18.789,195 18.789,196 18.789,197 18.789,198 15.755,199 13.089,200 10.487,201 19.353,202 15.736,203 15.736,204 15.736,205 15.736,206 15.736,207 11.077,208 10.169,209 4.933,210 16.753,211 3.441,212 1.466,213 0.861,214 0.314,215 0.314,216 0.314,217 4.093,220 1,221 642,222 3.742,223 137.408,224 175.876,225 118.985,227 1.577,228 47.22,231 1,232 0.67,233 1,234 0.4,236 1,237 8.509}
{0 CHEMBL229046,1 0.792,2 2.018,3 10.407,4 3.284,5 10.786,6 103.468,7 11.032,8 0.552,9 3.855,10 3.941,11 3.879,12 3.448,13 5.095,14 3.423,15 4.35,16 4.471,17 4.237,18 3.819,19 5.888,20 3.797,21 4.529,22 4.66,23 4.317,24 3.942,25 5.922,26 3.896,27 4.643,28 4.797,29 4.271,30 3.924,31 6.006,32 3.864,33 4.656,34 4.848,35 4.301,36 3.782,37 5.999,38 3.729,39 4.488,40 4.649,41 4.141,42 3.61,43 6.26,44 3.586,45 4.32,46 4.468,47 3.859,48 3.569,49 5.806,50 3.507,51 4.176,52 4.338,53 3.947,54 3.569,55 5.392,56 3.475,57 0.23,58 0.673,59 4.084,60 3.714,61 19.759,62 3.435,63 0.553,64 1.017,65 10.235,66 6.122,67 84.563,68 6.176,69 0.57,70 1.188,71 19.887,72 7.647,73 54.055,74 6.98,75 0.721,76 1.269,77 23.107,78 9.033,79 81.08,80 7.755,81 0.94,82 1.181,83 29.91,84 9.303,85 126.386,86 8.3,87 1.117,88 0.96,89 22.836,90 6.789,91 177.353,92 5.919,93 0.712,94 0.813,95 27.088,96 6.756,97 99.936,98 5.949,99 0.362,100 0.771,101 24.392,102 6.584,103 43.582,104 6.42,105 51,106 43,107 0.348,108 0.701,109 0.866,110 0.866,111 0.866,112 3.34,113 1.025,114 -4.07,115 -4.02,116 -3.8,117 1,118 39,119 2,125 5,126 1,127 3,128 1,132 1,133 1,135 1,137 1,142 2,143 1,144 4,145 3,146 5,148 2,150 5,152 3,153 13,154 3,155 4,157 1,158 10,160 1,161 2,164 2,165 11,166 2,167 1,168 1,169 7,170 5,172 2,173 1,174 4,175 4,176 2,179 2,180 2,182 7,186 1,187 1,188 9,191 2,192 1041,193 17.317,194 17.317,195 17.317,196 17.317,197 17.317,198 14.518,199 14.78,200 9.769,201 17.868,202 14.233,203 14.233,204 14.233,205 14.233,206 14.233,207 10.035,208 13.672,209 4.577,210 15.21,211 3.339,212 1.287,213 0.759,214 0.33,215 0.33,216 0.33,217 4.01,220 1,221 593,222 4.183,223 63.852,224 174.205,225 118.678,227 1.503,228 43.459,231 1,232 0.67,233 1,234 0.4,236 1,237 7.77}
{0 CHEMBL229097,1 0.823,2 2.058,3 10.462,4 3.304,5 10.914,6 99.656,7 11.534,8 0.571,9 3.792,10 3.872,11 3.855,12 3.39,13 5.058,14 3.372,15 4.275,16 4.381,17 4.204,18 3.76,19 5.858,20 3.744,21 4.459,22 4.586,23 4.267,24 3.877,25 5.875,26 3.828,27 4.544,28 4.697,29 4.178,30 3.805,31 5.949,32 3.747,33 4.473,34 4.652,35 4.205,36 3.569,37 5.878,38 3.545,39 4.248,40 4.401,41 3.961,42 3.364,43 6.121,44 3.369,45 4.102,46 4.238,47 3.739,48 3.307,49 5.7,50 3.301,51 3.931,52 4.068,53 3.885,54 3.376,55 5.267,56 3.311,57 0.23,58 0.635,59 2.754,60 3.387,61 22.037,62 2.857,63 0.547,64 0.951,65 6.666,66 5.45,67 83.149,68 4.963,69 0.583,70 1.096,71 17.854,72 7.254,73 55.738,74 6.231,75 0.723,76 1.126,77 23.202,78 8.777,79 90.747,80 7.273,81 0.906,82 0.967,83 20.312,84 7.292,85 130.835,86 5.706,87 0.913,88 0.787,89 22.619,90 5.322,91 139.7,92 4.271,93 0.658,94 0.659,95 10.48,96 4.684,97 97.702,98 3.503,99 0.34,100 0.611,101 21.856,102 5.13,103 39.994,104 4.242,105 38,106 41,107 0.359,108 0.712,109 0.876,110 0.876,111 0.876,112 3.304,113 1.016,114 -3.83,115 -3.79,116 -3.6,117 1,118 39.5,119 1,125 5,126 1,127 3,128 1,132 1,133 1,134 1,137 1,142 2,143 1,144 4,145 3,146 4,148 2,150 5,152 3,153 12,154 2,155 4,157 1,158 9,160 1,161 2,164 2,165 9,166 2,167 1,169 7,170 5,172 2,173 1,175 4,176 2,179 2,182 6,187 1,188 7,191 2,192 956,193 16.817,194 16.817,195 16.817,196 16.817,197 16.817,198 14.109,199 12.772,200 9.587,201 17.356,202 13.766,203 13.766,204 13.766,205 13.766,206 13.766,207 9.657,208 9.312,209 4.495,210 14.734,211 3.19,212 1.167,213 0.536,214 0.23,215 0.23,216 0.23,217 3.977,220 1,221 576,222 3.937,223 61.308,224 166.413,225 113.897,227 1.503,228 42.074,231 1,232 0.83,233 1,234 0.4,236 1,237 7.678}
{0 CHEMBL229098,1 0.789,2 1.98,3 10.321,4 3.82,5 14.593,6 108.762,7 10.599,8 0.533,9 3.915,10 4.004,11 3.906,12 3.495,13 5.128,14 3.466,15 4.426,16 4.565,17 4.291,18 3.873,19 5.899,20 3.846,21 4.598,22 4.725,23 4.384,24 4.024,25 5.988,26 3.975,27 4.764,28 4.915,29 4.336,30 4.033,31 6.127,32 3.977,33 4.763,34 4.941,35 4.38,36 3.956,37 6.065,38 3.893,39 4.743,40 4.933,41 4.242,42 3.867,43 6.346,44 3.807,45 4.644,46 4.851,47 3.976,48 3.801,49 5.981,50 3.71,51 4.428,52 4.612,53 4.096,54 3.728,55 5.649,56 3.619,57 0.224,58 0.713,59 5.301,60 4.054,61 15.96,62 4.044,63 0.579,64 1.095,65 12.674,66 6.538,67 79.252,68 6.987,69 0.541,70 1.298,71 25.62,72 8.647,73 43.095,74 7.968,75 0.839,76 1.391,77 27.09,78 10.015,79 102.845,80 8.787,81 0.893,82 1.344,83 29.408,84 10.124,85 110.734,86 9.685,87 1.222,88 1.247,89 30.03,90 9.095,91 177.98,92 9.596,93 0.852,94 1.107,95 37.495,96 9.31,97 103.879,98 10.063,99 0.535,100 0.925,101 27.044,102 8.275,103 75.47,104 8.363,105 66,106 45,107 0.337,108 0.674,109 0.857,110 0.857,111 0.857,112 3.375,113 1.026,114 -4.3,115 -4.24,116 -4,117 1,118 38.6,119 2,120 1,125 5,126 1,127 3,128 1,132 1,133 1,135 1,137 1,142 3,144 4,145 5,146 5,150 5,152 3,153 16,155 4,157 2,158 12,164 4,165 12,168 1,169 9,170 6,174 4,175 4,176 4,180 2,182 7,186 1,187 1,188 9,191 2,192 1172,193 17.841,194 17.841,195 17.841,196 17.841,197 17.841,198 15.117,199 14.567,200 9.984,201 18.393,202 14.703,203 14.703,204 14.703,205 14.703,206 14.703,207 10.523,208 13.281,209 4.66,210 15.701,211 3.479,212 1.495,213 0.815,214 0.415,215 0.415,216 0.415,217 4.043,220 1,221 608,222 4.416,223 66.831,224 182.206,225 124.212,227 1.536,228 45.86,231 1,232 0.67,233 1,234 0.4,236 1,237 7.092}
{0 CHEMBL376533,1 0.766,2 2.024,3 10.077,4 4.325,5 18.701,6 95.783,7 10.286,8 0.724,9 3.799,10 3.876,11 3.783,12 3.436,13 5.001,14 3.42,15 4.312,16 4.422,17 4.16,18 3.816,19 5.772,20 3.807,21 4.505,22 4.642,23 4.195,24 3.904,25 5.936,26 3.871,27 4.533,28 4.677,29 4.084,30 3.846,31 5.942,32 3.831,33 4.439,34 4.597,35 4.03,36 3.768,37 5.726,38 3.732,39 4.423,40 4.618,41 3.977,42 3.704,43 5.894,44 3.611,45 4.242,46 4.408,47 3.813,48 3.543,49 5.687,50 3.471,51 4.061,52 4.204,53 3.65,54 3.358,55 5.495,56 3.322,57 0.162,58 0.676,59 5.002,60 3.443,61 20.168,62 2.997,63 0.447,64 1.081,65 8.213,66 5.368,67 46.657,68 5.135,69 0.625,70 1.27,71 18.79,72 7.542,73 58.632,74 6.43,75 0.697,76 1.22,77 17.963,78 7.417,79 83.571,80 5.834,81 0.579,82 1.097,83 13.52,84 6.293,85 71.565,86 5.488,87 0.778,88 1.074,89 16.57,90 7.027,91 95.61,92 7.731,93 0.555,94 0.846,95 24.155,96 7.092,97 58.574,98 7.094,99 0.512,100 0.726,101 15.791,102 5.216,103 77.013,104 3.969,105 26,106 44,107 0.353,108 0.653,109 0.846,110 0.846,111 0.846,112 3.305,113 0.972,114 -4.38,115 -4.31,116 -4.07,118 44.7,119 1,125 7,127 3,129 2,132 2,133 1,137 1,142 1,144 3,145 4,146 5,150 3,152 3,153 11,155 3,157 2,158 12,162 2,164 1,165 5,168 4,169 2,170 3,174 5,175 2,176 6,182 6,186 2,188 6,191 4,192 904,193 17.082,194 17.082,195 17.082,196 17.082,197 17.082,198 14.353,199 8.565,200 9.619,201 17.635,202 14.28,203 14.28,204 14.28,205 14.28,206 14.28,207 10.109,208 4.13,209 4.553,210 15.301,211 3.224,212 1.498,213 0.853,214 0.388,215 0.388,216 0.388,217 3.993,218 1,220 1,221 573,222 3.24,223 121.504,224 153.9,225 104.488,227 1.544,228 41.92,231 1,232 1,233 1,234 0.4,236 1,237 6.119}
{0 CHEMBL387636,1 0.758,2 1.943,3 10.345,4 4.103,5 16.832,6 113.354,7 10.221,8 0.516,9 3.97,10 4.064,11 3.929,12 3.547,13 5.162,14 3.513,15 4.491,16 4.64,17 4.321,18 3.926,19 5.929,20 3.894,21 4.659,22 4.791,23 4.426,24 4.084,25 6.028,26 4.037,27 4.839,28 4.993,29 4.395,30 4.122,31 6.173,32 4.065,33 4.862,34 5.033,35 4.433,36 4.081,37 6.145,38 4.008,39 4.922,40 5.146,41 4.382,42 4.024,43 6.401,44 3.931,45 4.755,46 4.952,47 4.086,48 3.953,49 6.072,50 3.833,51 4.627,52 4.834,53 4.142,54 3.836,55 5.833,56 3.721,57 0.222,58 0.752,59 6.629,60 4.385,61 13.815,62 4.615,63 0.575,64 1.159,65 15.637,66 7.158,67 78.308,68 8.08,69 0.538,70 1.387,71 27.614,72 9.007,73 41.172,74 8.722,75 0.821,76 1.515,77 29.537,78 10.579,79 95.997,80 9.925,81 0.868,82 1.51,83 29.829,84 10.862,85 99.262,86 10.939,87 1.335,88 1.462,89 35.95,90 11.116,91 189.85,92 13.056,93 0.836,94 1.247,95 55.126,96 11.656,97 92.697,98 12.317,99 0.714,100 1.064,101 35.585,102 9.961,103 109.292,104 10.48,105 83,106 47,107 0.326,108 0.651,109 0.851,110 0.851,111 0.851,112 3.408,113 1.035,114 -4.53,115 -4.46,116 -4.2,117 1,118 38.3,119 3,120 1,125 5,126 1,127 3,129 1,132 1,133 1,135 1,137 1,142 3,144 4,145 5,146 6,150 5,152 3,153 17,155 4,157 2,158 13,162 2,164 4,165 13,168 2,169 9,170 6,174 5,175 4,176 6,180 2,182 7,186 3,187 1,188 9,191 4,192 1259,193 18.341,194 18.341,195 18.341,196 18.341,197 18.341,198 15.564,199 16.993,200 10.21,201 18.896,202 15.193,203 15.193,204 15.193,205 15.193,206 15.193,207 10.924,208 15.717,209 4.767,210 16.197,211 3.611,212 1.679,213 1.04,214 0.49,215 0.49,216 0.49,217 4.075,221 629,222 4.472,223 69.026,224 188.315,225 128.835,227 1.505,228 46.909,231 1,232 0.67,233 1,234 0.6,236 1,237 6.77}
{0 CHEMBL389843,1 0.758,2 1.98,3 10.429,4 3.567,5 12.722,6 108.059,7 10.599,8 0.533,9 3.914,10 4.005,11 3.903,12 3.502,13 5.129,14 3.472,15 4.42,16 4.553,17 4.269,18 3.874,19 5.917,20 3.847,21 4.595,22 4.73,23 4.362,24 4.007,25 5.965,26 3.963,27 4.727,28 4.884,29 4.333,30 4.023,31 6.057,32 3.963,33 4.766,34 4.949,35 4.358,36 3.929,37 6.085,38 3.863,39 4.713,40 4.923,41 4.283,42 3.8,43 6.323,44 3.727,45 4.467,46 4.628,47 3.974,48 3.723,49 5.896,50 3.624,51 4.325,52 4.484,53 3.999,54 3.661,55 5.592,56 3.574,57 0.229,58 0.712,59 5.414,60 4.045,61 17.699,62 4.016,63 0.553,64 1.082,65 13.412,66 6.766,67 85.313,68 7.318,69 0.564,70 1.278,71 22.039,72 8.019,73 51.549,74 7.727,75 0.708,76 1.392,77 25.502,78 9.594,79 75.577,80 8.838,81 0.918,82 1.345,83 29.423,84 9.938,85 114.456,86 9.398,87 1.255,88 1.175,89 28.491,90 8.861,91 193.186,92 9.492,93 0.744,94 0.933,95 48.824,96 9.272,97 97.743,98 8.599,99 0.489,100 0.854,101 27.33,102 7.373,103 70.99,104 6.96,105 66,106 45,107 0.337,108 0.679,109 0.857,110 0.857,111 0.857,112 3.375,113 1.033,114 -4.3,115 -4.24,116 -4,117 1,118 38.6,119 3,125 5,126 1,127 3,129 1,132 1,133 1,135 1,137 1,142 2,143 1,144 4,145 3,146 6,148 2,150 5,152 3,153 14,154 3,155 4,157 1,158 11,160 1,161 2,162 2,164 2,165 11,166 2,167 2,168 2,169 7,170 5,172 2,173 1,174 5,175 4,176 4,179 2,180 2,182 7,186 3,187 1,188 9,191 4,192 1122,193 17.817,194 17.817,195 17.817,196 17.817,197 17.817,198 14.965,199 17.205,200 9.995,201 18.37,202 14.723,203 14.723,204 14.723,205 14.723,206 14.723,207 10.436,208 16.108,209 4.684,210 15.706,211 3.479,212 1.464,213 1.003,214 0.415,215 0.415,216 0.415,217 4.044,220 1,221 614,222 4.243,223 66.047,224 180.314,225 123.301,227 1.469,228 44.508,231 1,232 0.67,233 1,234 0.4,236 1,237 6.398}
{0 CHEMBL427066,1 0.746,2 1.89,3 9.96,4 3.66,5 13.396,6 90.979,7 9.379,8 0.75,9 3.792,10 3.877,11 3.716,12 3.408,13 4.977,14 3.392,15 4.303,16 4.423,17 4.066,18 3.778,19 5.738,20 3.769,21 4.49,22 4.645,23 4.089,24 3.862,25 5.89,26 3.831,27 4.523,28 4.679,29 3.978,30 3.802,31 5.911,32 3.79,33 4.427,34 4.598,35 3.853,36 3.714,37 5.668,38 3.676,39 4.41,40 4.619,41 3.791,42 3.647,43 5.84,44 3.547,45 4.214,46 4.413,47 3.64,48 3.461,49 5.602,50 3.395,51 4.05,52 4.205,53 3.42,54 3.295,55 5.492,56 3.278,57 0.135,58 0.688,59 6.845,60 3.566,61 16.317,62 3.334,63 0.395,64 1.099,65 10.553,66 5.461,67 40.024,68 5.582,69 0.512,70 1.296,71 18.452,72 7.415,73 47.986,74 6.899,75 0.594,76 1.235,77 18.852,78 7.213,79 70.762,80 6.289,81 0.49,82 1.118,83 15.453,84 6.151,85 62.239,86 5.953,87 0.71,88 1.092,89 17.603,90 6.831,91 87.244,92 7.975,93 0.43,94 0.877,95 19.411,96 6.673,97 47.133,98 7.251,99 0.432,100 0.741,101 13.291,102 4.951,103 63.649,104 4.192,105 17,106 42,107 0.329,108 0.612,109 0.846,110 0.846,111 0.846,112 3.268,113 0.955,114 -4.15,115 -4.09,116 -3.87,118 44.7,119 1,125 8,127 2,129 2,132 2,133 1,137 1,142 1,144 4,145 4,146 6,150 3,152 3,153 10,155 2,157 2,158 13,162 2,164 1,165 5,168 6,169 2,170 3,174 3,175 2,176 5,182 8,186 2,188 4,191 6,192 786,193 16.634,194 16.634,195 16.634,196 16.634,197 16.634,198 13.93,199 6.964,200 9.48,201 17.055,202 13.797,203 13.797,204 13.797,205 13.797,206 13.797,207 9.696,208 3.489,209 4.469,210 14.548,211 3.358,212 1.736,213 0.967,214 0.388,215 0.388,216 0.388,217 3.958,219 1,220 1,221 548,222 3.162,223 115.749,224 147.286,225 99.811,227 1.488,228 37.914,230 1,231 1,232 1,233 1,234 0.4,236 1,237 6.174}
{0 CHEMBL535170,1 0.817,2 2.018,3 10.37,4 3.297,5 10.868,6 97.544,7 9.547,8 0.552,9 3.861,10 3.949,11 3.772,12 3.394,13 5.145,14 3.396,15 4.363,16 4.494,17 4.104,18 3.754,19 5.927,20 3.766,21 4.545,22 4.678,23 4.17,24 3.898,25 6.025,26 3.883,27 4.685,28 4.839,29 4.072,30 3.85,31 6.131,32 3.83,33 4.605,34 4.791,35 4.035,36 3.657,37 6.03,38 3.667,39 4.485,40 4.65,41 3.958,42 3.597,43 6.253,44 3.597,45 4.495,46 4.706,47 3.738,48 3.576,49 5.922,50 3.531,51 4.251,52 4.425,53 3.648,54 3.454,55 5.611,56 3.435,57 0.251,58 0.747,59 6.993,60 3.719,61 28.369,62 3.548,63 0.634,64 1.136,65 12.266,66 5.632,67 92.358,68 5.787,69 0.7,70 1.345,71 18.411,72 7.673,73 74.824,74 6.908,75 0.973,76 1.308,77 25.34,78 8.788,79 148.078,80 7.906,81 1.02,82 1.178,83 24.047,84 7.153,85 152.557,86 7.179,87 1.075,88 1.056,89 17.586,90 5.775,91 161.29,92 5.913,93 0.915,94 0.945,95 21.594,96 6.766,97 122.039,98 7.745,99 0.615,100 0.869,101 16.315,102 5.902,103 99.478,104 5.896,105 51,106 43,107 0.348,108 0.691,109 0.866,110 0.866,111 0.866,112 3.34,113 0.936,114 -3.83,115 -3.79,116 -3.6,118 39,119 1,120 1,125 5,126 1,127 3,128 1,132 1,133 1,134 1,137 1,142 3,144 4,145 5,146 4,150 4,152 3,153 13,155 3,157 2,158 11,164 4,165 9,169 9,170 5,175 4,176 3,182 6,187 1,188 5,191 2,192 1083,193 17.341,194 17.341,195 17.341,196 17.341,197 17.341,198 14.708,199 12.543,200 9.769,201 17.777,202 14.219,203 14.219,204 14.219,205 14.219,206 14.219,207 10.136,208 9.123,209 4.562,210 14.998,211 3.339,212 1.344,213 0.613,214 0.33,215 0.33,216 0.33,217 4.011,220 1,221 591,222 4.183,223 64.287,224 174.415,225 119.432,227 1.542,228 53.214,231 1,232 0.83,233 1,234 0.4,236 1,237 8.276}
{0 CHEMBL535171,1 0.828,2 1.873,3 12.452,4 3.295,5 10.86,6 113.603,7 8.91,8 0.485,9 4.039,10 4.127,11 3.877,12 3.548,13 5.277,14 3.545,15 4.555,16 4.694,17 4.203,18 3.901,19 6.042,20 3.903,21 4.717,22 4.856,23 4.285,24 4.049,25 6.118,26 4.033,27 4.862,28 5.005,29 4.229,30 4.034,31 6.294,32 4.017,33 4.81,34 4.983,35 4.182,36 3.917,37 6.148,38 3.913,39 4.753,40 4.92,41 4.179,42 3.885,43 6.403,44 3.876,45 4.789,46 5.011,47 3.934,48 3.849,49 6.129,50 3.791,51 4.53,52 4.719,53 3.805,54 3.755,55 5.782,56 3.693,57 0.265,58 0.792,59 9.834,60 4.567,61 22.405,62 4.824,63 0.78,64 1.19,65 18.032,66 6.964,67 98.393,68 7.915,69 0.687,70 1.387,71 24.381,72 9.126,73 58.799,74 9.411,75 1.078,76 1.434,77 30.713,78 9.999,79 136.185,80 9.87,81 1.07,82 1.331,83 29.136,84 8.674,85 151.216,86 9.399,87 1.144,88 1.303,89 23.969,90 7.691,91 147.209,92 9.168,93 1.107,94 1.238,95 29.964,96 8.799,97 134.778,98 10.961,99 0.674,100 1.041,101 20.541,102 7.469,103 83.415,104 8.829,105 71,106 48,107 0.31,108 0.677,109 0.867,110 0.867,111 0.867,112 3.472,113 0.955,114 -3.7,115 -3.67,116 -3.49,118 38,119 2,120 1,121 1,125 5,126 2,127 2,128 1,132 1,133 1,134 1,136 1,137 1,142 3,144 5,145 6,146 8,150 5,152 3,153 15,155 3,157 4,158 15,162 1,164 4,165 10,168 1,169 11,170 7,174 1,175 6,176 3,181 2,182 9,187 1,188 6,191 4,192 1565,193 20.126,194 20.126,195 20.126,196 20.126,197 20.126,198 17.454,199 15.258,200 11.519,201 20.692,202 16.145,203 16.145,204 16.145,205 16.145,206 16.145,207 11.874,208 11.722,209 5.286,210 16.987,211 3.771,212 1.553,213 0.637,214 0.405,215 0.405,216 0.405,217 4.144,220 1,221 802,222 4.743,223 77.293,224 204.816,225 141.133,227 1.821,228 56.7,231 0.75,232 0.83,233 0.83,234 0.5,236 0.67,237 6.469}
{0 CHEMBL536070,1 0.817,2 2.018,3 10.37,4 3.756,5 14.105,6 102.133,7 9.948,8 0.552,9 3.857,10 3.942,11 3.803,12 3.424,13 5.107,14 3.411,15 4.358,16 4.485,17 4.149,18 3.796,19 5.885,20 3.787,21 4.536,22 4.661,23 4.219,24 3.941,25 5.967,26 3.903,27 4.68,28 4.829,29 4.12,30 3.895,31 6.094,32 3.851,33 4.599,34 4.78,35 4.108,36 3.717,37 5.962,38 3.698,39 4.479,40 4.636,41 3.992,42 3.631,43 6.215,44 3.612,45 4.492,46 4.701,47 3.776,48 3.592,49 5.901,50 3.541,51 4.246,52 4.415,53 3.771,54 3.528,55 5.568,56 3.466,57 0.233,58 0.674,59 6.252,60 3.656,61 20.752,62 3.487,63 0.595,64 1.019,65 11.656,66 5.663,67 82.782,68 5.804,69 0.598,70 1.181,71 19.828,72 7.787,73 51.62,74 7.077,75 0.884,76 1.217,77 25.724,78 9.181,79 120.78,80 8.037,81 0.941,82 1.07,83 24.218,84 7.663,85 130.885,86 7.289,87 1.003,88 0.987,89 18.936,90 6.092,91 141.522,92 6.066,93 0.854,94 0.934,95 21.743,96 7.089,97 109.055,98 7.698,99 0.561,100 0.745,101 18.62,102 6.217,103 80.99,104 6.071,105 51,106 43,107 0.348,108 0.691,109 0.866,110 0.866,111 0.866,112 3.34,113 0.975,114 -3.95,115 -3.9,116 -3.7,118 39,119 1,120 1,125 5,126 1,127 3,128 1,132 1,133 1,134 1,137 1,142 3,144 4,145 5,146 4,150 5,152 3,153 14,155 4,157 2,158 11,164 4,165 10,169 9,170 6,175 4,176 4,182 6,187 1,188 7,191 2,192 1083,193 17.341,194 17.341,195 17.341,196 17.341,197 17.341,198 14.708,199 12.516,200 9.769,201 17.853,202 14.219,203 14.219,204 14.219,205 14.219,206 14.219,207 10.136,208 9.101,209 4.562,210 15.15,211 3.339,212 1.344,213 0.613,214 0.33,215 0.33,216 0.33,217 4.011,218 1,220 1,221 591,222 4.183,223 64.287,224 174.415,225 119.432,227 1.542,228 46.74,231 1,232 0.83,233 1,234 0.4,236 1,237 9.114}
{0 CHEMBL536292,1 0.792,2 1.963,3 10.25,4 4.438,5 19.698,6 104.785,7 10.168,8 0.677,9 3.872,10 3.944,11 3.837,12 3.494,13 5.108,14 3.48,15 4.379,16 4.481,17 4.201,18 3.907,19 5.901,20 3.888,21 4.573,22 4.688,23 4.272,24 4.042,25 5.932,26 3.99,27 4.713,28 4.849,29 4.224,30 4.009,31 6.124,32 3.976,33 4.652,34 4.818,35 4.179,36 3.886,37 5.992,38 3.854,39 4.491,40 4.625,41 4.069,42 3.787,43 6.205,44 3.744,45 4.46,46 4.632,47 3.861,48 3.659,49 5.876,50 3.605,51 4.162,52 4.32,53 3.733,54 3.44,55 5.541,56 3.405,57 0.214,58 0.647,59 5.558,60 3.623,61 20.238,62 3.233,63 0.543,64 1.021,65 8.924,66 5.87,67 77.001,68 5.589,69 0.502,70 1.199,71 18.118,72 8.437,73 44.325,74 7.57,75 0.814,76 1.306,77 24.855,78 9.744,79 111.472,80 8.087,81 0.91,82 1.202,83 23.038,84 8.617,85 126.89,86 7.669,87 0.897,88 1.016,89 16.213,90 7.102,91 137.235,92 7.022,93 0.739,94 0.927,95 21.071,96 7.561,97 96.194,98 7.435,99 0.495,100 0.706,101 17.947,102 5.74,103 72.552,104 5.152,105 38,106 47,107 0.334,108 0.654,109 0.876,110 0.876,111 0.876,112 3.375,113 0.959,114 -4.27,115 -4.21,116 -3.98,118 43.9,119 1,125 6,126 2,127 3,128 1,132 3,133 1,137 1,142 2,144 5,145 5,146 7,150 5,153 16,155 4,157 1,158 14,162 1,164 4,165 7,168 7,169 8,170 3,174 6,175 2,176 6,180 2,182 10,187 1,188 7,191 2,192 1144,193 18.289,194 18.289,195 18.289,196 18.289,197 18.289,198 15.308,199 10.621,200 10.259,201 18.82,202 15.246,203 15.246,204 15.246,205 15.246,206 15.246,207 10.676,208 8.664,209 4.823,210 16.198,211 3.394,212 1.518,213 0.708,214 0.214,215 0.214,216 0.214,217 4.061,218 1,220 1,221 621,222 3.674,223 133.573,224 169.928,225 114.362,227 1.607,228 46.632,231 1,232 1,233 1,234 0.4,236 1,237 7}
{0 CHEMBL536293,1 0.843,2 2.066,3 10.357,4 3.329,5 11.081,6 108.795,7 11.152,8 0.677,9 3.836,10 3.895,11 3.848,12 3.514,13 5.137,14 3.477,15 4.296,16 4.373,17 4.273,18 3.912,19 5.72,20 3.862,21 4.476,22 4.589,23 4.303,24 3.992,25 5.838,26 3.93,27 4.561,28 4.673,29 4.3,30 3.976,31 5.95,32 3.916,33 4.506,34 4.629,35 4.317,36 3.901,37 5.942,38 3.819,39 4.315,40 4.412,41 4.182,42 3.747,43 5.948,44 3.675,45 4.246,46 4.335,47 4.088,48 3.62,49 5.941,50 3.557,51 4.002,52 4.126,53 3.691,54 3.387,55 5.369,56 3.35,57 0.245,58 0.598,59 2.719,60 3.379,61 23.826,62 2.67,63 0.447,64 0.968,65 9.395,66 6.002,67 64.573,68 4.448,69 0.542,70 1.106,71 13.098,72 7.331,73 50.237,74 6.209,75 0.686,76 1.199,77 18.048,78 8.783,79 90.033,80 6.492,81 0.793,82 1.117,83 21.747,84 9.29,85 123.01,86 7.059,87 0.697,88 0.959,89 18.235,90 7.328,91 104.704,92 5.153,93 0.706,94 0.818,95 18.685,96 6.947,97 109.268,98 4.56,99 0.394,100 0.634,101 12.347,102 4.908,103 53.446,104 3.987,105 30,106 45,107 0.357,108 0.728,109 0.894,110 0.894,111 0.894,112 3.375,113 0.994,114 -3.3,115 -3.29,116 -3.15,118 43.6,121 1,125 5,126 1,127 3,128 1,129 1,132 2,133 1,137 1,138 1,142 2,144 3,145 2,146 5,149 1,150 4,152 2,153 11,154 1,155 2,157 1,158 7,161 2,162 2,164 1,165 7,166 1,168 1,169 4,170 4,172 2,173 1,174 2,175 3,176 4,178 2,180 2,182 4,187 1,188 4,189 1,191 2,192 1162,193 18.817,194 18.817,195 18.817,196 18.817,197 18.817,198 16.047,199 13.906,200 10.723,201 19.725,202 15.193,203 15.193,204 15.193,205 15.193,206 15.193,207 10.871,208 13.308,209 4.966,210 16.752,211 3.219,212 1.067,213 0.4,214 0.103,215 0.103,216 0.103,217 4.066,218 1,220 1,221 627,222 3.391,223 132.304,224 169.605,225 113.783,227 1.617,228 44.405,231 1,232 1,233 1,234 0.4,236 0.83,237 7.699}
{0 CHEMBL538346,1 0.781,2 1.643,3 8.038,4 2.634,5 6.936,6 93.122,7 8.295,8 0.7,9 3.901,10 3.993,11 3.57,12 3.427,13 5.053,14 3.451,15 4.429,16 4.567,17 3.953,18 3.814,19 5.57,20 3.831,21 4.632,22 4.81,23 4.004,24 3.906,25 5.74,26 3.897,27 4.601,28 4.8,29 3.93,30 3.856,31 5.661,32 3.843,33 4.552,34 4.727,35 3.948,36 3.85,37 5.691,38 3.845,39 4.563,40 4.716,41 3.948,42 3.915,43 5.647,44 3.901,45 4.608,46 4.774,47 3.86,48 3.933,49 5.677,50 3.88,51 4.659,52 4.872,53 3.658,54 3.843,55 5.7,56 3.738,57 0.093,58 0.64,59 7.051,60 3.599,61 8.919,62 4.003,63 0.347,64 1.055,65 14.419,66 5.833,67 21.708,68 6.641,69 0.537,70 1.241,71 20.054,72 7.233,73 35.14,74 8.985,75 0.401,76 1.234,77 19.844,78 6.951,79 33.285,80 8.821,81 0.525,82 1.162,83 18.373,84 6.593,85 41.881,86 7.998,87 0.434,88 1.193,89 16.823,90 6.549,91 25.389,92 7.574,93 0.383,94 1.212,95 17.722,96 7.482,97 25.34,98 8.996,99 0.443,100 1.167,101 21.923,102 8.885,103 39.839,104 11.593,105 2,106 43,107 0.282,108 0.649,109 0.845,110 0.845,111 0.845,112 3.306,113 0.847,114 -3.61,115 -3.59,116 -3.42,118 45.2,121 4,125 6,126 2,127 1,128 1,129 1,130 1,131 1,133 1,137 1,144 6,145 3,146 6,149 2,150 5,152 4,153 7,154 2,155 2,157 2,158 7,161 1,162 1,164 3,165 7,166 2,168 3,169 1,170 6,174 4,175 1,176 6,178 1,179 1,180 4,181 1,182 5,184 1,185 1,186 2,188 3,189 1,190 1,191 1,192 888,193 18.154,194 18.154,195 18.154,196 18.154,197 18.154,198 15.811,199 12.611,200 10.787,201 18.623,202 14.885,203 14.885,204 14.885,205 14.885,206 14.885,207 11.295,208 16.024,209 5.188,210 15.653,211 3.749,212 1.617,213 0.845,214 0.476,215 0.476,216 0.476,217 4.024,219 1,220 1,221 471,222 2.121,223 37.097,224 226.299,225 148.493,227 1.047,228 26.381,230 1,231 1,232 1,233 1,234 0.8,235 0.5,236 1,237 8.444}
{0 CHEMBL541133,1 0.818,2 2.066,3 10.25,4 4.516,5 20.39,6 106.496,7 11.152,8 0.677,9 3.832,10 3.887,11 3.894,12 3.529,13 5.09,14 3.484,15 4.328,16 4.406,17 4.313,18 3.924,19 5.877,20 3.883,21 4.5,22 4.598,23 4.371,24 4.013,25 5.942,26 3.959,27 4.606,28 4.72,29 4.309,30 4.002,31 6.05,32 3.949,33 4.556,34 4.689,35 4.317,36 3.907,37 5.954,38 3.831,39 4.334,40 4.417,41 4.182,42 3.744,43 6.165,44 3.685,45 4.252,46 4.35,47 4.055,48 3.622,49 5.825,50 3.554,51 3.979,52 4.102,53 3.717,54 3.382,55 5.376,56 3.355,57 0.218,58 0.607,59 3.113,60 3.55,61 24.956,62 2.781,63 0.503,64 0.988,65 10.331,66 6.232,67 86.71,68 4.897,69 0.567,70 1.134,71 12.531,72 7.44,73 57.068,74 5.873,75 0.728,76 1.241,77 19.616,78 9.217,79 99.453,80 6.953,81 0.869,82 1.155,83 22.286,84 9.538,85 139.657,86 7.151,87 0.825,88 0.967,89 18.116,90 7.249,91 142.274,92 4.652,93 0.648,94 0.813,95 17.726,96 6.886,97 96.366,98 4.632,99 0.354,100 0.625,101 12.347,102 4.796,103 49.514,104 4.076,105 38,106 47,107 0.355,108 0.704,109 0.87,110 0.87,111 0.87,112 3.375,113 1.026,114 -4.04,115 -3.99,116 -3.78,118 43.6,119 1,125 5,126 1,127 3,128 1,129 1,132 2,133 1,137 1,138 1,142 2,144 4,145 3,146 5,150 5,152 3,153 14,155 4,157 1,158 10,162 2,164 2,165 10,168 2,169 7,170 6,174 2,175 4,176 4,180 2,182 6,187 1,188 7,191 2,192 1144,193 18.289,194 18.289,195 18.289,196 18.289,197 18.289,198 15.308,199 12.027,200 10.259,201 19.154,202 15.246,203 15.246,204 15.246,205 15.246,206 15.246,207 10.676,208 10.776,209 4.823,210 16.785,211 3.219,212 1.189,213 0.522,214 0.224,215 0.224,216 0.224,217 4.061,218 1,220 1,221 621,222 3.674,223 133.573,224 169.928,225 114.362,227 1.607,228 48.975,231 1,232 1,233 1,234 0.4,236 0.83,237 8.553}
{0 CHEMBL541642,1 0.805,2 2.115,3 11.233,4 4.034,5 16.269,6 103.302,7 10.033,8 0.5,9 3.94,10 4.025,11 3.863,12 3.447,13 5.249,14 3.47,15 4.481,16 4.608,17 4.273,18 3.814,19 6.363,20 3.853,21 4.615,22 4.739,23 4.289,24 3.967,25 6.151,26 3.975,27 4.825,28 4.986,29 4.227,30 3.929,31 6.354,32 3.937,33 4.713,34 4.894,35 4.168,36 3.756,37 6.158,38 3.796,39 4.616,40 4.769,41 4.199,42 3.687,43 6.483,44 3.744,45 4.628,46 4.845,47 3.865,48 3.623,49 6.173,50 3.609,51 4.308,52 4.482,53 3.733,54 3.527,55 5.709,56 3.505,57 0.352,58 0.924,59 6.088,60 4.095,61 61.623,62 3.59,63 1.227,64 1.733,65 12.816,66 6.365,67 216.231,68 5.904,69 0.844,70 1.586,71 16.391,72 8.336,73 109.279,74 7.192,75 1.577,76 1.618,77 27.846,78 9.678,79 249.973,80 8.239,81 1.4,82 1.408,83 25.162,84 7.961,85 243.495,86 7.444,87 1.279,88 1.434,89 16.604,90 6.41,91 192.523,92 6.168,93 1.437,94 1.124,95 25.131,96 7.339,97 211.757,98 7.856,99 0.863,100 0.924,101 15.347,102 5.844,103 133.612,104 6.069,105 86,106 49,107 0.36,108 0.689,109 0.85,110 0.857,111 0.857,112 3.44,113 0.907,114 -4.3,115 -4.24,116 -4,118 38.6,119 1,120 1,122 1,125 5,126 2,127 2,128 1,132 1,133 1,134 1,137 1,142 3,144 5,145 5,146 5,150 5,152 3,153 13,155 3,157 2,158 12,164 4,165 10,169 9,170 6,175 4,176 3,182 8,187 1,188 5,191 4,192 1386,193 18.813,194 18.813,195 18.813,196 18.813,197 18.813,198 16.271,199 15.37,200 10.41,201 19.436,202 15.693,203 15.693,204 15.693,205 15.693,206 15.693,207 11.674,208 12.614,209 4.85,210 16.831,211 3.344,212 1.406,213 0.724,214 0.461,215 0.415,216 0.415,217 4.108,220 1,221 703,222 4.848,223 73.62,224 196.404,225 134.898,227 1.649,228 71.862,231 1,232 0.83,233 1,234 0.4,236 1,237 7.854}
{0 CHEMBL541643,1 0.78,2 1.713,3 7.818,4 3.083,5 9.506,6 85.442,7 8.471,8 0.64,9 3.754,10 3.847,11 3.49,12 3.351,13 4.86,14 3.321,15 4.281,16 4.424,17 3.854,18 3.738,19 5.363,20 3.69,21 4.476,22 4.664,23 3.874,24 3.782,25 5.506,26 3.721,27 4.424,28 4.636,29 3.795,30 3.753,31 5.429,32 3.673,33 4.395,34 4.583,35 3.803,36 3.796,37 5.459,38 3.692,39 4.375,40 4.536,41 3.751,42 3.806,43 5.368,44 3.692,45 4.383,46 4.587,47 3.516,48 3.661,49 5.366,50 3.516,51 4.237,52 4.484,53 3.191,54 3.349,55 5.154,56 3.182,57 0.051,58 0.555,59 6.745,60 3.482,61 6.672,62 3.879,63 0.233,64 0.941,65 14.682,66 5.958,67 16.828,68 6.522,69 0.351,70 1.12,71 20.526,72 6.808,73 26.061,74 8.259,75 0.237,76 1.079,77 17.96,78 6.714,79 23.398,80 8.369,81 0.358,82 1.052,83 21.096,84 7.388,85 31.973,86 8.449,87 0.186,88 1.022,89 19.411,90 7.485,91 13.787,92 8.262,93 0.244,94 0.937,95 18.894,96 7.653,97 21.673,98 9.367,99 0.231,100 0.74,101 19.128,102 6.978,103 24.523,104 8.538,105 2,106 35,107 0.307,108 0.656,109 0.836,110 0.836,111 0.836,112 3.148,113 0.968,114 -3.77,115 -3.74,116 -3.55,118 43.2,121 4,125 5,126 1,127 1,129 1,130 1,131 1,132 1,133 1,144 4,145 2,146 3,149 2,150 5,152 1,153 7,154 2,155 2,157 1,158 5,161 1,162 1,164 1,165 4,166 2,168 3,170 2,174 3,175 1,176 3,178 1,179 1,180 2,182 2,185 1,186 1,188 1,192 568,193 15.292,194 15.292,195 15.292,196 15.292,197 15.292,198 13.474,199 12.611,200 9.15,201 15.895,202 12.397,203 12.397,204 12.397,205 12.397,206 12.397,207 9.636,208 16.024,209 4.385,210 13.381,211 3.496,212 1.544,213 0.854,214 0.541,215 0.541,216 0.541,217 3.85,219 1,220 1,221 382,222 1.871,223 44.14,224 166.126,225 77.868,227 1.124,228 18.621,229 1,230 1,231 1,232 1,233 1,234 0.8,235 0.5,236 1,237 8.602}
{0 CHEMBL553488,1 0.826,2 2.03,3 10.296,4 4.42,5 19.532,6 107.02,7 11.024,8 0.7,9 3.8,10 3.864,11 3.819,12 3.507,13 5.069,14 3.457,15 4.268,16 4.358,17 4.251,18 3.902,19 5.659,20 3.842,21 4.435,22 4.546,23 4.267,24 3.977,25 5.781,26 3.904,27 4.524,28 4.65,29 4.213,30 3.956,31 5.873,32 3.874,33 4.44,34 4.579,35 4.251,36 3.864,37 5.757,38 3.766,39 4.228,40 4.326,41 4.077,42 3.712,43 5.844,44 3.621,45 4.171,46 4.277,47 3.977,48 3.584,49 5.657,50 3.49,51 3.903,52 4.035,53 3.647,54 3.345,55 5.224,56 3.297,57 0.191,58 0.578,59 2.685,60 3.181,61 11.305,62 2.752,63 0.358,64 0.945,65 10.473,66 5.892,67 49.668,68 4.861,69 0.453,70 1.069,71 12.134,72 6.866,73 34.596,74 5.819,75 0.572,76 1.177,77 19.505,78 8.714,79 66.426,80 6.879,81 0.615,82 1.069,83 20.737,84 8.77,85 86.447,86 7.044,87 0.575,88 0.91,89 17.625,90 6.807,91 80.923,92 4.609,93 0.534,94 0.765,95 17.559,96 6.567,97 73.443,98 4.59,99 0.261,100 0.591,101 12.082,102 4.509,103 29.469,104 4.037,105 27,106 44,107 0.352,108 0.707,109 0.879,110 0.879,111 0.879,112 3.34,113 1.01,114 -4.05,115 -4,116 -3.79,118 44.7,119 1,125 5,126 1,127 3,128 1,129 1,132 2,133 1,137 1,138 1,142 2,144 4,145 2,146 5,150 5,152 2,153 11,155 4,157 1,158 8,162 2,164 1,165 9,168 2,169 4,170 6,174 2,175 3,176 4,180 2,182 5,187 1,188 5,191 2,192 1037,193 17.947,194 17.947,195 17.947,196 17.947,197 17.947,198 15.125,199 11.615,200 10.202,201 18.835,202 14.755,203 14.755,204 14.755,205 14.755,206 14.755,207 10.445,208 10.127,209 4.813,210 16.275,211 3.218,212 1.167,213 0.483,214 0.178,215 0.178,216 0.178,217 4.031,218 1,220 1,221 604,222 3.24,223 127.16,224 162.257,225 109.081,227 1.619,228 37.36,231 1,232 1,233 1,234 0.4,236 0.83,237 7.509}
{0 CHEMBL555968,1 0.815,2 1.909,3 11.036,4 2.97,5 8.821,6 103.066,7 9.487,8 0.533,9 3.876,10 3.964,11 3.785,12 3.437,13 5.179,14 3.432,15 4.366,16 4.496,17 4.105,18 3.799,19 5.895,20 3.8,21 4.55,22 4.678,23 4.185,24 3.954,25 6.003,26 3.929,27 4.715,28 4.872,29 4.097,30 3.914,31 6.158,32 3.883,33 4.624,34 4.81,35 4.045,36 3.738,37 5.999,38 3.734,39 4.51,40 4.671,41 4.012,42 3.665,43 6.28,44 3.664,45 4.528,46 4.742,47 3.759,48 3.611,49 5.972,50 3.567,51 4.257,52 4.432,53 3.627,54 3.521,55 5.596,56 3.477,57 0.224,58 0.709,59 7.099,60 3.65,61 23.782,62 3.49,63 0.57,64 1.067,65 12.267,66 5.572,67 88.255,68 5.782,69 0.516,70 1.27,71 17.606,72 7.614,73 54.845,74 7.02,75 0.855,76 1.324,77 25.602,78 8.966,79 137.75,80 8.035,81 0.893,82 1.167,83 24.124,84 7.44,85 147.01,86 7.301,87 0.958,88 1.087,89 17.018,90 5.905,91 144.808,92 6.034,93 0.84,94 1.002,95 22.096,96 7.018,97 127.427,98 7.754,99 0.532,100 0.807,101 15.309,102 5.896,103 86.097,104 6.011,105 54,106 44,107 0.325,108 0.694,109 0.862,110 0.862,111 0.862,112 3.375,113 0.933,114 -3.15,115 -3.14,116 -3.02,118 40.5,119 1,120 1,125 5,126 2,127 2,128 1,132 1,133 1,134 1,136 1,137 1,142 3,144 5,145 5,146 6,150 5,152 3,153 14,155 3,157 3,158 13,164 4,165 10,169 10,170 6,175 5,176 3,181 1,182 8,187 1,188 5,191 4,192 1196,193 18.212,194 18.212,195 18.212,196 18.212,197 18.212,198 15.539,199 14.24,200 10.272,201 18.593,202 14.646,203 14.646,204 14.646,205 14.646,206 14.646,207 10.375,208 10.804,209 4.709,210 15.32,211 3.483,212 1.312,213 0.598,214 0.322,215 0.322,216 0.322,217 4.047,220 1,221 649,222 4.301,223 67.398,224 181.744,225 124.587,227 1.541,228 49.139,231 1,232 0.83,233 1,234 0.4,236 0.83,237 9.585}
{0 CHEMBL556399,1 0.817,2 2.018,3 10.37,4 3.84,5 14.743,6 104.951,7 11.032,8 0.552,9 3.855,10 3.94,11 3.882,12 3.44,13 5.093,14 3.417,15 4.356,16 4.483,17 4.259,18 3.818,19 5.87,20 3.796,21 4.532,22 4.656,23 4.338,24 3.964,25 5.946,26 3.912,27 4.677,28 4.826,29 4.238,30 3.919,31 6.081,32 3.861,33 4.596,34 4.777,35 4.285,36 3.748,37 5.937,38 3.711,39 4.475,40 4.632,41 4.079,42 3.649,43 6.201,44 3.619,45 4.491,46 4.7,47 3.87,48 3.6,49 5.893,50 3.546,51 4.243,52 4.413,53 4.043,54 3.566,55 5.553,56 3.479,57 0.225,58 0.675,59 3.958,60 3.726,61 18.367,62 3.469,63 0.577,64 1.03,65 9.394,66 5.896,67 79.945,68 5.83,69 0.549,70 1.206,71 23.757,72 8.272,73 44.353,74 7.197,75 0.841,76 1.246,77 26.213,78 9.739,79 111.86,80 8.13,81 0.902,82 1.107,83 23.394,84 8.195,85 123.584,86 7.354,87 0.967,88 1.016,89 23.021,90 6.586,91 134.923,92 6.17,93 0.823,94 0.956,95 21.768,96 7.312,97 104.859,98 7.677,99 0.534,100 0.767,101 24.013,102 6.86,103 74.991,104 6.172,105 51,106 43,107 0.348,108 0.691,109 0.866,110 0.866,111 0.866,112 3.34,113 1.018,114 -4.07,115 -4.02,116 -3.8,117 1,118 39,119 1,120 1,125 5,126 1,127 3,128 1,132 1,133 1,134 1,137 1,142 3,144 4,145 5,146 4,150 5,152 3,153 14,155 4,157 2,158 11,164 4,165 10,169 9,170 6,175 4,176 4,182 6,187 1,188 7,191 2,192 1083,193 17.341,194 17.341,195 17.341,196 17.341,197 17.341,198 14.708,199 12.559,200 9.769,201 17.882,202 14.219,203 14.219,204 14.219,205 14.219,206 14.219,207 10.136,208 9.136,209 4.562,210 15.208,211 3.339,212 1.344,213 0.613,214 0.33,215 0.33,216 0.33,217 4.011,220 1,221 591,222 4.183,223 64.287,224 174.415,225 119.432,227 1.542,228 44.474,231 1,232 0.67,233 1,234 0.4,236 1,237 9.523}
{0 CHEMBL558174,1 0.824,2 1.923,3 11.138,4 2.093,5 4.382,6 105.908,7 9.255,8 0.516,9 3.946,10 4.043,11 3.819,12 3.466,13 5.233,14 3.468,15 4.436,16 4.568,17 4.154,18 3.836,19 5.993,20 3.84,21 4.621,22 4.748,23 4.231,24 3.992,25 6.08,26 3.974,27 4.794,28 4.95,29 4.153,30 3.965,31 6.228,32 3.937,33 4.732,34 4.927,35 4.099,36 3.805,37 6.066,38 3.799,39 4.612,40 4.775,41 4.092,42 3.739,43 6.352,44 3.742,45 4.63,46 4.845,47 3.812,48 3.68,49 6.063,50 3.632,51 4.355,52 4.55,53 3.673,54 3.56,55 5.659,56 3.514,57 0.263,58 0.754,59 8.355,60 3.852,61 30.2,62 3.88,63 0.643,64 1.122,65 14.051,66 6,67 100.35,68 6.61,69 0.619,70 1.322,71 19.748,72 8.141,73 68.365,74 7.843,75 0.997,76 1.372,77 28.011,78 9.342,79 145.146,80 9.069,81 1.033,82 1.228,83 27.957,84 7.886,85 158.6,86 8.629,87 1.056,88 1.145,89 19.783,90 6.459,91 153.766,92 7.272,93 0.989,94 1.057,95 24.469,96 7.304,97 137.976,98 8.53,99 0.647,100 0.857,101 18.223,102 6.224,103 93.426,104 6.979,105 69,106 46,107 0.324,108 0.712,109 0.868,110 0.868,111 0.868,112 3.408,113 0.929,114 -2.83,115 -2.84,116 -2.75,118 37.8,119 1,120 1,125 5,126 2,127 2,128 1,132 1,133 1,134 1,136 1,137 1,139 1,140 1,141 1,142 3,144 5,145 5,146 6,147 1,148 1,149 1,150 5,151 1,152 3,153 14,154 1,155 3,156 1,157 3,158 13,159 1,160 1,161 1,163 1,164 4,165 10,169 10,170 6,171 1,172 1,175 5,176 3,177 1,178 1,181 1,182 8,183 1,184 1,187 1,188 5,191 4,192 1297,193 18.548,194 18.548,195 18.548,196 18.548,197 18.548,198 15.824,199 13.739,200 10.412,201 18.899,202 15.187,203 15.187,204 15.187,205 15.187,206 15.187,207 10.899,208 10.812,209 4.836,210 15.805,211 3.569,212 1.269,213 0.603,214 0.345,215 0.345,216 0.345,217 4.078,220 1,221 676,222 4.528,223 70.509,224 189.074,225 129.743,227 1.6,228 54.469,231 0.75,232 0.83,233 0.83,234 0.3,236 0.67,237 6.108}
{0 CHEMBL558973,1 0.825,2 1.979,3 10.346,4 5.531,5 30.595,6 105.648,7 10.889,8 0.724,9 3.768,10 3.841,11 3.738,12 3.484,13 5.028,14 3.43,15 4.23,16 4.326,17 4.213,18 3.883,19 5.594,20 3.811,21 4.366,22 4.49,23 4.152,24 3.94,25 5.602,26 3.845,27 4.435,28 4.576,29 4.108,30 3.908,31 5.668,32 3.792,33 4.309,34 4.456,35 4.181,36 3.82,37 5.534,38 3.696,39 4.11,40 4.227,41 3.959,42 3.68,43 5.38,44 3.552,45 4.084,46 4.199,47 3.893,48 3.546,49 5.462,50 3.422,51 3.821,52 3.964,53 3.572,54 3.306,55 5.059,56 3.236,57 0.16,58 0.547,59 2.23,60 2.797,61 2.192,62 2.722,63 0.301,64 0.912,65 10.783,66 5.651,67 38.224,68 4.825,69 0.335,70 1,71 11.682,72 6.272,73 15.176,74 5.763,75 0.434,76 1.111,77 19.353,78 8.204,79 39.741,80 6.801,81 0.376,82 0.976,83 19.128,84 7.938,85 38.52,86 6.931,87 0.308,88 0.848,89 17.082,90 6.325,91 18.333,92 4.564,93 0.424,94 0.715,95 17.364,96 6.23,97 52.786,98 4.545,99 0.178,100 0.556,101 11.796,102 4.21,103 12.408,104 3.995,105 18,106 42,107 0.346,108 0.702,109 0.88,110 0.88,111 0.88,112 3.304,113 0.993,114 -4.88,115 -4.79,116 -4.5,118 45.9,119 1,125 5,126 1,127 3,128 1,129 1,132 2,133 1,137 1,138 1,142 2,144 4,145 2,146 6,150 8,152 1,153 8,155 6,157 1,158 7,162 3,165 11,168 2,169 1,170 7,174 2,175 2,176 4,180 3,182 4,186 2,187 1,188 3,191 2,192 930,193 17.394,194 17.394,195 17.394,196 17.394,197 17.394,198 14.601,199 11.203,200 9.997,201 18.187,202 14.304,203 14.304,204 14.304,205 14.304,206 14.304,207 10.129,208 9.647,209 4.76,210 15.729,211 3.231,212 1.199,213 0.496,214 0.183,215 0.183,216 0.183,217 3.998,218 1,220 1,221 587,222 2.915,223 120.748,224 154.585,225 103.8,227 1.627,228 25.928,231 1,232 1,233 1,234 0.4,236 1,237 7.086}
{0 CHEMBL559361,1 0.774,2 1.855,3 10.37,4 3.577,5 12.798,6 102.369,7 8.806,8 0.552,9 3.91,10 4.007,11 3.764,12 3.453,13 5.122,14 3.433,15 4.42,16 4.569,17 4.09,18 3.821,19 5.884,20 3.805,21 4.584,22 4.721,23 4.157,24 3.974,25 5.965,26 3.931,27 4.774,28 4.953,29 4.061,30 3.938,31 6.114,32 3.885,33 4.671,34 4.869,35 4.011,36 3.767,37 5.957,38 3.735,39 4.567,40 4.74,41 3.958,42 3.699,43 6.235,44 3.667,45 4.581,46 4.814,47 3.73,48 3.63,49 5.93,50 3.568,51 4.284,52 4.467,53 3.598,54 3.53,55 5.568,56 3.478,57 0.213,58 0.722,59 9.249,60 4.014,61 13.714,62 4.38,63 0.555,64 1.097,65 15.892,66 6.175,67 78.047,68 7.266,69 0.454,70 1.289,71 20.778,72 8.205,73 33.336,74 8.592,75 0.791,76 1.348,77 30.539,78 9.563,79 100.819,80 10.153,81 0.826,82 1.182,83 27.244,84 7.866,85 112.565,86 8.938,87 0.958,88 1.109,89 20.576,90 6.318,91 130.074,92 7.429,93 0.8,94 1.014,95 25.333,96 7.292,97 103.557,98 8.992,99 0.472,100 0.816,101 16.753,102 5.856,103 63.133,104 6.462,105 51,106 43,107 0.315,108 0.649,109 0.827,110 0.857,111 0.857,112 3.34,113 0.968,114 -3.68,115 -3.65,116 -3.47,118 38.6,119 2,120 1,125 5,126 2,127 2,128 1,132 1,133 1,134 1,137 1,142 3,144 6,145 5,146 5,150 6,152 3,153 14,155 4,157 2,158 12,164 4,165 11,169 9,170 7,175 4,176 4,182 8,187 1,188 7,191 4,192 1083,193 17.341,194 17.341,195 17.341,196 17.341,197 17.341,198 14.708,199 13.34,200 9.769,201 17.713,202 14.219,203 14.219,204 14.219,205 14.219,206 14.219,207 10.136,208 9.931,209 4.562,210 14.873,211 3.604,212 1.64,213 0.906,214 0.597,215 0.415,216 0.415,217 4.011,219 1,220 1,221 591,222 4.183,223 64.287,224 174.415,225 119.432,227 1.542,228 43.361,231 1,232 0.83,233 1,234 0.6,236 1,237 8.222}
{0 CHEMBL98350,1 0.674,2 1.448,3 8.478,4 3.342,5 11.171,6 88.664,7 7.684,8 0.462,9 3.809,10 3.901,11 3.421,12 3.388,13 4.896,14 3.378,15 4.353,16 4.491,17 3.771,18 3.772,19 5.416,20 3.749,21 4.598,22 4.778,23 3.848,24 3.901,25 5.624,26 3.856,27 4.577,28 4.75,29 3.795,30 3.857,31 5.68,32 3.802,33 4.561,34 4.748,35 3.749,36 3.83,37 5.62,38 3.771,39 4.486,40 4.663,41 3.64,42 3.768,43 5.593,44 3.703,45 4.4,46 4.581,47 3.461,48 3.661,49 5.54,50 3.569,51 4.307,52 4.542,53 3.115,54 3.501,55 5.198,56 3.345,57 0.012,58 0.519,59 7.554,60 3.82,61 4.461,62 4.574,63 0.202,64 0.886,65 15.072,66 6.264,67 15.71,68 7.514,69 0.294,70 1.104,71 21.062,72 8.255,73 25.461,74 10.23,75 0.366,76 1.044,77 20.717,78 8.4,79 37.582,80 10.346,81 0.349,82 1.029,83 20.912,84 8.298,85 33.004,86 10.33,87 0.234,88 0.974,89 18.758,90 7.527,91 36.023,92 9.207,93 0.313,94 0.895,95 17.292,96 6.907,97 45.021,98 8.588,99 0.125,100 0.824,101 16.391,102 6.813,103 24.181,104 9.21,105 2,106 36,107 0.255,108 0.562,109 0.762,110 0.815,111 0.815,112 3.19,113 0.897,114 -3.71,115 -3.68,116 -3.5,118 47.5,121 4,123 1,124 1,125 8,126 3,127 1,135 1,144 11,145 1,146 6,150 14,152 1,153 4,155 12,157 2,158 7,162 10,164 1,165 8,168 9,170 6,174 6,175 1,176 6,180 3,182 5,186 1,188 3,192 696,193 16.052,194 16.052,195 16.052,196 16.052,197 16.052,198 14.337,199 13.258,200 9.684,201 16.394,202 12.881,203 12.881,204 12.881,205 12.881,206 12.881,207 10.246,208 16.375,209 4.62,210 13.421,211 3.874,212 2.132,213 1.5,214 1,215 0.7,216 0.7,217 3.894,219 1,220 1,221 432,222 1.871,224 226.251,226 87.589,227 1.195,228 20.252,229 1,230 1,231 1,232 1,233 1,234 0.8,235 0.5,236 1,237 5}
