{
  "data_set_description": {
    "collection_date": "November 2013",
    "creator": "Dr Jeremy Besnard, Dr Ivan Olier, Dr Noureddin Sadawi, Dr Larisa Soldatova, Dr Crina Grosan, Prof Ross King, Dr Richard Bickerton, Prof Andrew Hopkins and Dr Willem van Hoorn",
    "default_target_attribute": "pXC50",
    "description": "This dataset contains QSAR data (from ChEMBL version 17) showing activity values (unit is pseudo-pCI50) of several compounds on drug target ChEMBL_ID: CHEMBL3222 (TID: 10315), and it has 1086 rows and 1375 features (not including molecule IDs and class feature: molecule_id and pXC50). The features represent Molecular Descriptors which were generated from SMILES strings. Missing value imputation was applied to this dataset (By choosing the Median).",
    "description_version": "1",
    "file_id": "3655335",
    "format": "ARFF",
    "id": "38862",
    "licence": "Public",
    "md5_checksum": "031e4416719eb98cba0adc89c6e5ed6f",
    "minio_url": "https://data.openml.org/datasets/0003/38862/dataset_38862.pq",
    "name": "QSAR-DATASET-FOR-DRUG-TARGET-CHEMBL3222",
    "original_data_url": "https://www.ebi.ac.uk/chembl/target/inspect/CHEMBL3222",
    "parquet_url": "https://data.openml.org/datasets/0003/38862/dataset_38862.pq",
    "processing_date": "2018-10-04 06:08:22",
    "row_id_attribute": "molecule_id",
    "status": "deactivated",
    "tag": [
      "MetaQSAR",
      "study_13"
    ],
    "upload_date": "2016-07-16T05:47:12",
    "url": "https://api.openml.org/data/v1/download/3655335/QSAR-DATASET-FOR-DRUG-TARGET-CHEMBL3222.arff",
    "version": "10",
    "visibility": "public"
  }
}