"molecule_id","AMW","C.","pXC50"
{1 9.756,2 40.6,3 5.87}
{0 CHEMBL442902,1 7.761,2 38.9,3 5.77}
{0 CHEMBL444924,1 7.852,2 40.6,3 5.569}
{0 CHEMBL450689,1 11.224,2 40.6,3 6.409}
{0 CHEMBL456052,1 8.041,2 39.4,3 5.678}
{0 CHEMBL456719,1 7.066,2 40,3 5.658}
{0 CHEMBL457057,1 7.29,2 40.6,3 5.699}
{0 CHEMBL457113,1 8.367,2 40.6,3 6.013}
{0 CHEMBL457115,1 9.756,2 40.6,3 6.276}
{0 CHEMBL458226,1 8.041,2 39.4,3 5.824}
{0 CHEMBL458227,1 9.677,2 39.4,3 5.886}
{0 CHEMBL458672,1 8.758,2 37.5,3 5.62}
{0 CHEMBL459083,1 7.554,2 39.4,3 5.602}
{0 CHEMBL459084,1 8.977,2 40.6,3 5.854}
{0 CHEMBL459085,1 8.142,2 43.3,3 5.523}
{0 CHEMBL463121,1 8.185,2 38.2,3 6.056}
{0 CHEMBL467396,1 8.608,2 40,3 5.658}
{0 CHEMBL467397,1 11.224,2 40.6,3 6.362}
{0 CHEMBL468624,1 8.977,2 40.6,3 6.215}
{0 CHEMBL468790,1 11.902,2 41.4,3 6.066}
{0 CHEMBL468791,1 8.525,2 38.7,3 6.018}
{0 CHEMBL499747,1 7.923,2 40,3 6.432}
{0 CHEMBL502197,1 7.695,2 45.7,3 6.027}
{0 CHEMBL502443,1 12.038,2 40,3 5.721}
{0 CHEMBL503238,1 8.185,2 38.2,3 6.004}
{0 CHEMBL506438,1 7.066,2 40,3 5.678}
{0 CHEMBL508553,1 7.695,2 45.7,3 5.886}
{0 CHEMBL511677,1 9.539,2 40.6,3 6}
{0 CHEMBL512914,1 10.472,2 40,3 5.523}
{0 CHEMBL513503,1 8.608,2 40,3 6.301}
