{
  "data_set_description": {
    "collection_date": "November 2013",
    "creator": "Dr Jeremy Besnard, Dr Ivan Olier, Dr Noureddin Sadawi, Dr Larisa Soldatova, Dr Crina Grosan, Prof Ross King, Dr Richard Bickerton, Prof Andrew Hopkins and Dr Willem van Hoorn",
    "default_target_attribute": "pXC50",
    "description": "This dataset contains QSAR data (from ChEMBL version 17) showing activity values (unit is pseudo-pCI50) of several compounds on drug target ChEMBL_ID: CHEMBL2146303 (TID: 105131), and it has 128 rows and 1306 features (not including molecule IDs and class feature: molecule_id and pXC50). The features represent Molecular Descriptors which were generated from SMILES strings. Missing value imputation was applied to this dataset (By choosing the Median).",
    "description_version": "1",
    "file_id": "3654842",
    "format": "ARFF",
    "id": "38855",
    "licence": "Public",
    "md5_checksum": "94746ebe0623b21d25eaebbee62ab091",
    "minio_url": "https://data.openml.org/datasets/0003/38855/dataset_38855.pq",
    "name": "QSAR-DATASET-FOR-DRUG-TARGET-CHEMBL2146303",
    "original_data_url": "https://www.ebi.ac.uk/chembl/target/inspect/CHEMBL2146303",
    "parquet_url": "https://data.openml.org/datasets/0003/38855/dataset_38855.pq",
    "processing_date": "2018-10-04 06:50:33",
    "row_id_attribute": "molecule_id",
    "status": "deactivated",
    "tag": [
      "MetaQSAR",
      "study_13"
    ],
    "upload_date": "2016-07-16T05:45:14",
    "url": "https://api.openml.org/data/v1/download/3654842/QSAR-DATASET-FOR-DRUG-TARGET-CHEMBL2146303.arff",
    "version": "12",
    "visibility": "public"
  }
}