"molecule_id","AMW","C.","H.","Me","Mi","Mp","Mv","MW","N.","nAB","nAT","nB","nBM","nBO","nBR","nBT","nC","nCL","nCsp","nCsp2","nCsp3","nDB","nF","nH","nHet","nHM","nI","nN","nO","nP","nS","nSK","nTB","nX","O.","RBF","RBN","SCBO","Se","Si","Sp","Sv","X.","pXC50"
{1 8.326,2 46.3,3 39,4 1.024,5 1.122,6 0.679,7 0.67,8 341.36,9 2.4,10 17,11 41,13 18,14 27,16 43,17 19,20 16,21 3,22 1,23 1,24 16,25 6,28 1,29 4,32 25,34 1,35 9.8,36 0.116,37 5,38 36.5,39 41.993,40 45.997,41 27.852,42 27.478,43 2.4,44 4.523}
{0 CHEMBL141732,1 9.258,2 43.8,3 34.4,4 1.053,5 1.154,6 0.666,7 0.681,8 296.27,9 6.3,10 6,11 32,13 9,14 22,16 33,17 14,19 1,20 9,21 4,22 2,23 3,24 11,25 7,28 2,29 2,32 21,33 1,34 3,35 6.3,36 0.091,37 3,38 29,39 33.698,40 36.926,41 21.301,42 21.783,43 9.4,44 4.497}
{0 CHEMBL142996,1 7.804,2 48.7,3 41,4 1.001,5 1.111,6 0.699,7 0.671,8 304.37,9 5.1,10 12,11 39,13 15,14 25,16 41,17 19,19 1,20 15,21 3,22 2,24 16,25 4,28 2,29 2,32 23,33 1,35 5.1,36 0.098,37 4,38 35,39 39.043,40 43.322,41 27.25,42 26.16,44 4.585}
{0 CHEMBL1450,1 8.152,2 48.9,3 42.2,4 1.003,5 1.105,6 0.707,7 0.672,8 366.86,10 12,11 45,13 15,14 29,16 48,17 22,18 1,20 16,21 6,22 3,24 19,25 4,26 1,29 3,32 26,34 1,35 6.7,36 0.042,37 2,38 38,39 45.142,40 49.724,41 31.835,42 30.24,43 2.2,44 5}
{0 CHEMBL1529387,1 7.72,2 41.9,3 41.9,4 1.001,5 1.134,6 0.68,7 0.652,8 239.31,9 16.1,10 16,11 31,13 16,14 20,16 33,17 13,20 11,21 2,24 13,25 5,28 5,32 18,36 0.091,37 3,38 28,39 31.043,40 35.152,41 21.074,42 20.214,44 4}
{0 CHEMBL1714424,1 7.451,2 41.2,3 44.1,4 0.998,5 1.134,6 0.672,7 0.639,8 253.34,9 14.7,10 16,11 34,13 16,14 21,16 36,17 14,20 11,21 3,24 15,25 5,28 5,32 19,36 0.083,37 3,38 29,39 33.927,40 38.568,41 22.836,42 21.741,44 6.215}
{0 CHEMBL1784555,1 7.226,2 40.5,3 45.9,4 0.995,5 1.135,6 0.665,7 0.629,8 267.37,9 13.5,10 16,11 37,13 16,14 22,16 39,17 15,20 11,21 4,24 17,25 5,28 5,32 20,36 0.103,37 4,38 30,39 36.811,40 41.983,41 24.597,42 23.268,44 6.004}
{0 CHEMBL1784556,1 7.035,2 40,3 47.5,4 0.992,5 1.135,6 0.659,7 0.62,8 281.4,9 12.5,10 16,11 40,13 16,14 23,16 42,17 16,20 11,21 5,24 19,25 5,28 5,32 21,36 0.119,37 5,38 31,39 39.694,40 45.398,41 26.358,42 24.795,44 6.553}
{0 CHEMBL1784557,1 6.87,2 39.5,3 48.8,4 0.99,5 1.135,6 0.654,7 0.612,8 295.43,9 11.6,10 16,11 43,13 16,14 24,16 45,17 17,20 11,21 6,24 21,25 5,28 5,32 22,36 0.133,37 6,38 32,39 42.578,40 48.813,41 28.12,42 26.321,44 6.086}
{0 CHEMBL1784558,1 6.727,2 39.1,3 50,4 0.988,5 1.135,6 0.65,7 0.605,8 309.46,9 10.9,10 16,11 46,13 16,14 25,16 48,17 18,20 11,21 7,24 23,25 5,28 5,32 23,36 0.146,37 7,38 33,39 45.461,40 52.228,41 29.881,42 27.848,44 5.377}
{0 CHEMBL1784559,1 6.602,2 38.8,3 51,4 0.987,5 1.136,6 0.646,7 0.599,8 323.49,9 10.2,10 16,11 49,13 16,14 26,16 51,17 19,20 11,21 8,24 25,25 5,28 5,32 24,36 0.157,37 8,38 34,39 48.345,40 55.644,41 31.643,42 29.375,44 4.62}
{0 CHEMBL1784560,1 6.491,2 38.5,3 51.9,4 0.985,5 1.136,6 0.642,7 0.594,8 337.52,9 9.6,10 16,11 52,13 16,14 27,16 54,17 20,20 11,21 9,24 27,25 5,28 5,32 25,36 0.167,37 9,38 35,39 51.229,40 59.059,41 33.404,42 30.902,44 4.301}
{0 CHEMBL1784561,1 7.035,2 40,3 47.5,4 0.992,5 1.135,6 0.659,7 0.62,8 281.4,9 12.5,10 16,11 40,13 16,14 23,16 42,17 16,20 11,21 5,24 19,25 5,28 5,32 21,36 0.071,37 3,38 31,39 39.694,40 45.398,41 26.358,42 24.795,44 7.108}
{0 CHEMBL1784562,1 7.581,2 42.9,3 42.9,4 0.998,5 1.131,6 0.681,7 0.65,8 265.35,9 14.3,10 16,11 35,13 16,14 23,16 38,17 15,20 11,21 4,24 15,25 5,28 5,32 20,36 0.079,37 3,38 31,39 34.927,40 39.568,41 23.836,42 22.741,44 6.377}
{0 CHEMBL1784563,1 7.854,2 43.8,3 40.6,4 1.001,5 1.13,6 0.69,7 0.663,8 251.32,9 15.6,10 16,11 32,13 17,14 21,16 34,17 14,20 13,21 1,22 1,24 13,25 5,28 5,32 19,36 0.088,37 3,38 30,39 32.043,40 36.152,41 22.074,42 21.214,44 6.097}
{0 CHEMBL1784564,1 8.31,2 46.7,3 36.7,4 1.005,5 1.125,6 0.71,7 0.69,8 249.3,9 16.7,10 16,11 30,13 17,14 21,16 32,17 14,19 2,20 11,21 1,24 11,25 5,28 5,32 19,33 1,36 0.063,37 2,38 31,39 30.16,40 33.737,41 21.313,42 20.687,44 5.959}
{0 CHEMBL1784565,1 9.039,2 41.2,3 35.3,4 1.043,5 1.164,6 0.666,7 0.673,8 307.31,9 14.7,10 16,11 34,13 16,14 24,16 36,17 14,20 11,21 3,23 3,24 12,25 8,28 5,32 22,34 3,36 0.083,37 3,38 32,39 35.465,40 39.587,41 22.648,42 22.891,43 8.8,44 5.602}
{0 CHEMBL1784566,1 10.167,2 40.6,3 31.3,4 1.052,5 1.159,6 0.704,7 0.705,8 325.35,9 15.6,10 16,11 32,13 16,14 24,16 34,17 13,20 11,21 2,23 3,24 10,25 9,26 1,28 5,31 1,32 22,34 3,36 0.088,37 3,38 32,39 33.658,40 37.091,41 22.534,42 22.551,43 9.4,44 6.215}
{0 CHEMBL1784567,1 10.647,2 36.4,3 30.3,4 1.078,5 1.187,6 0.672,7 0.692,8 351.34,9 15.2,10 16,11 33,13 16,14 25,16 35,17 12,20 11,21 1,23 5,24 10,25 11,26 1,28 5,31 1,32 23,34 5,36 0.057,37 2,38 33,39 35.567,40 39.186,41 22.171,42 22.845,43 15.2,44 6.886}
{0 CHEMBL1784568,1 7.891,2 45.2,3 40.5,4 1.003,5 1.124,6 0.692,7 0.666,8 331.41,9 11.9,10 22,11 42,13 22,14 28,16 45,17 19,20 17,21 2,24 17,25 6,28 5,29 1,32 25,35 2.4,36 0.111,37 5,38 39,39 42.138,40 47.192,41 29.051,42 27.983,44 5.268}
{0 CHEMBL1784569,1 7.36,2 40,3 45,4 0.998,5 1.137,6 0.665,7 0.632,8 294.4,9 15,10 16,11 40,13 16,14 25,16 43,17 16,20 11,21 5,24 18,25 6,28 6,32 22,36 0.07,37 3,38 33,39 39.912,40 45.481,41 26.603,42 25.289,44 5.456}
{0 CHEMBL1784570,1 7.571,2 39,3 43.9,4 1.006,5 1.139,6 0.66,7 0.634,8 310.4,9 14.6,10 16,11 41,13 16,14 26,16 44,17 16,20 11,21 5,24 18,25 7,28 6,29 1,32 23,35 2.4,36 0.068,37 3,38 34,39 41.24,40 46.69,41 27.057,42 26.004,44 4}
{0 CHEMBL1784571,1 7.058,2 38.1,3 47.6,4 0.995,5 1.14,6 0.652,7 0.615,8 296.42,9 14.3,10 16,11 42,13 16,14 24,16 44,17 16,20 11,21 5,24 20,25 6,28 6,32 22,36 0.091,37 4,38 32,39 41.796,40 47.896,41 27.364,42 25.816,44 4.301}
{0 CHEMBL1784572,1 7.254,2 39,3 46.3,4 1.001,5 1.137,6 0.654,7 0.622,8 297.4,9 12.2,10 16,11 41,13 16,14 24,16 43,17 16,20 11,21 5,24 19,25 6,28 5,29 1,32 22,35 2.4,36 0.093,37 4,38 32,39 41.022,40 46.607,41 26.813,42 25.509,44 4.357}
{0 CHEMBL1784573,1 7.694,2 42.1,3 42.1,4 1.001,5 1.133,6 0.68,7 0.652,8 292.38,9 15.8,10 16,11 38,13 17,14 24,16 40,17 16,19 1,20 11,21 4,24 16,25 6,28 6,32 22,33 1,36 0.075,37 3,38 34,39 38.029,40 43.066,41 25.841,42 24.762,44 6}
{0 CHEMBL1784574,1 7.485,2 40,3 45,4 1.005,5 1.143,6 0.657,7 0.629,8 299.39,9 12.5,10 16,11 40,13 16,14 24,16 42,17 16,20 11,21 5,23 1,24 18,25 6,28 5,32 22,34 1,36 0.071,37 3,38 32,39 40.207,40 45.738,41 26.296,42 25.178,43 2.5,44 7.456}
{0 CHEMBL1784575,1 9.918,2 42.9,3 32.1,4 1.036,5 1.144,6 0.718,7 0.711,8 277.71,9 17.9,10 16,11 28,13 16,14 21,16 30,17 12,18 1,20 11,21 1,23 1,24 9,25 7,26 1,28 5,32 19,34 2,36 0.067,37 2,38 29,39 28.996,40 32.021,41 20.108,42 19.898,43 7.1,44 6.26}
{0 CHEMBL1784576,1 10.626,2 41.2,3 26.5,4 1.088,5 1.194,6 0.661,7 0.707,8 361.28,9 14.7,10 16,11 34,13 16,14 27,16 36,17 14,20 11,21 3,23 6,24 9,25 11,28 5,32 25,34 6,36 0.056,37 2,38 35,39 37.003,40 40.606,41 22.461,42 24.041,43 17.6,44 6.268}
{0 CHEMBL1784577,1 10.621,2 41.9,3 25.8,4 1.084,5 1.189,6 0.67,7 0.714,8 329.26,9 16.1,10 16,11 31,13 16,14 25,16 33,17 13,20 11,21 2,23 5,24 8,25 10,28 5,32 23,34 5,36 0.061,37 2,38 33,39 33.607,40 36.851,41 20.762,42 22.131,43 16.1,44 6.721}
{0 CHEMBL1784578,1 7.352,2 42.1,3 44.7,4 0.995,5 1.131,6 0.674,7 0.639,8 279.38,9 13.2,10 16,11 38,13 16,14 24,16 41,17 16,20 11,21 5,24 17,25 5,28 5,32 21,36 0.049,37 2,38 32,39 37.811,40 42.983,41 25.597,42 24.268,44 7.194}
{0 CHEMBL1784579,1 8.687,2 41.9,3 35.5,4 1.026,5 1.134,6 0.685,7 0.681,8 269.29,9 16.1,10 16,11 31,13 16,14 23,16 34,17 13,20 11,21 2,24 11,25 7,28 5,29 2,32 20,35 6.5,36 0.059,37 2,38 31,39 31.814,40 35.156,41 21.222,42 21.117,44 5.796}
{0 CHEMBL1784580,1 9.076,2 45.2,3 35.5,4 1.008,5 1.118,6 0.741,7 0.706,8 281.37,9 16.1,10 20,11 31,13 20,14 23,16 34,17 14,20 13,21 1,24 11,25 6,26 1,28 5,31 1,32 20,36 0.059,37 2,38 33,39 31.236,40 34.657,41 22.96,42 21.875,44 7.046}
{0 CHEMBL1784581,1 9.803,2 41.2,3 29.4,4 1.056,5 1.169,6 0.68,7 0.702,8 333.31,9 20.6,10 20,11 34,13 20,14 27,16 37,17 14,20 12,21 2,23 3,24 10,25 10,28 7,32 24,34 3,36 0.054,37 2,38 37,39 35.902,40 39.753,41 23.137,42 23.88,43 8.8,44 4.678}
{0 CHEMBL1784582,1 7.57,2 36,3 44,4 1.006,5 1.149,6 0.653,7 0.627,8 189.25,9 20,10 10,11 25,13 10,14 16,16 27,17 9,20 5,21 4,24 11,25 5,28 5,32 14,36 0.074,37 2,38 21,39 25.16,40 28.737,41 16.313,42 15.687,44 4}
{0 CHEMBL1784583,1 7.26,2 35.7,3 46.4,4 1.002,5 1.148,6 0.646,7 0.615,8 203.28,9 17.9,10 10,11 28,13 10,14 17,16 30,17 10,20 5,21 5,24 13,25 5,28 5,32 15,36 0.067,37 2,38 22,39 28.043,40 32.152,41 18.074,42 17.214,44 4}
{0 CHEMBL1784584,1 7.01,2 35.5,3 48.4,4 0.998,5 1.147,6 0.64,7 0.605,8 217.31,9 16.1,10 10,11 31,13 10,14 18,16 33,17 11,20 5,21 6,24 15,25 5,28 5,32 16,36 0.061,37 2,38 23,39 30.927,40 35.568,41 19.836,42 18.741,44 4}
{0 CHEMBL1784585,1 6.804,2 35.3,3 50,4 0.994,5 1.147,6 0.635,7 0.596,8 231.34,9 14.7,10 10,11 34,13 10,14 19,16 36,17 12,20 5,21 7,24 17,25 5,28 5,32 17,36 0.056,37 2,38 24,39 33.811,40 38.983,41 21.597,42 20.268,44 4}
{0 CHEMBL1784586,1 6.632,2 35.1,3 51.4,4 0.992,5 1.146,6 0.631,7 0.589,8 245.37,9 13.5,10 10,11 37,13 10,14 20,16 39,17 13,20 5,21 8,24 19,25 5,28 5,32 18,36 0.051,37 2,38 25,39 36.694,40 42.398,41 23.358,42 21.795,44 4}
{0 CHEMBL1784587,1 6.485,2 35,3 52.5,4 0.989,5 1.145,6 0.628,7 0.583,8 259.4,9 12.5,10 10,11 40,13 10,14 21,16 42,17 14,20 5,21 9,24 21,25 5,28 5,32 19,36 0.048,37 2,38 26,39 39.578,40 45.813,41 25.12,42 23.321,44 4}
{0 CHEMBL1784588,1 6.068,2 34.6,3 55.8,4 0.983,5 1.144,6 0.619,7 0.566,8 315.52,9 9.6,10 10,11 52,13 10,14 25,16 54,17 18,20 5,21 13,24 29,25 5,28 5,32 23,36 0.037,37 2,38 30,39 51.112,40 59.474,41 32.165,42 29.429,44 4.237}
{0 CHEMBL1784589,1 7.581,2 42.9,3 42.9,4 0.998,5 1.131,6 0.681,7 0.65,8 265.35,9 14.3,10 16,11 35,13 16,14 23,16 38,17 15,20 11,21 4,24 15,25 5,28 5,32 20,36 0.053,37 2,38 31,39 34.927,40 39.568,41 23.836,42 22.741,44 6.301}
{0 CHEMBL1784590,1 8.095,2 42.9,3 40,4 1.013,5 1.14,6 0.679,7 0.661,8 283.34,9 14.3,10 16,11 35,13 16,14 24,16 38,17 15,20 11,21 4,23 1,24 14,25 6,28 5,32 21,34 1,36 0.053,37 2,38 32,39 35.44,40 39.907,41 23.773,42 23.124,43 2.9,44 6.215}
{0 CHEMBL1784591,1 9.835,2 42.9,3 40,4 1.004,5 1.126,6 0.72,7 0.679,8 344.24,9 14.3,10 16,11 35,13 16,14 24,15 1,16 38,17 15,20 11,21 4,24 14,25 6,26 1,28 5,32 21,34 1,36 0.053,37 2,38 32,39 35.156,40 39.409,41 25.188,42 23.766,43 2.9,44 5.921}
{0 CHEMBL1784592,1 7.568,2 39.5,3 44.2,4 1.008,5 1.135,6 0.657,7 0.633,8 325.41,9 11.6,10 16,11 43,13 16,14 27,16 46,17 17,20 11,21 6,24 19,25 7,28 5,29 2,32 24,35 4.7,36 0.087,37 4,38 35,39 43.349,40 48.817,41 28.267,42 27.224,44 5.337}
{0 CHEMBL1784593,1 7.352,2 42.1,3 44.7,4 0.995,5 1.131,6 0.674,7 0.639,8 279.38,9 13.2,10 16,11 38,13 16,14 24,16 41,17 16,20 11,21 5,24 17,25 5,28 5,32 21,36 0.049,37 2,38 32,39 37.811,40 42.983,41 25.597,42 24.268,44 6.268}
{0 CHEMBL1784594,1 7.826,2 42.1,3 42.1,4 1.009,5 1.14,6 0.672,7 0.649,8 297.37,9 13.2,10 16,11 38,13 16,14 25,16 41,17 16,20 11,21 5,23 1,24 16,25 6,28 5,32 22,34 1,36 0.049,37 2,38 33,39 38.323,40 43.322,41 25.534,42 24.651,43 2.6,44 6.201}
{0 CHEMBL1784595,1 8.258,2 42.1,3 42.1,4 1.004,5 1.13,6 0.696,7 0.66,8 313.82,9 13.2,10 16,11 38,13 16,14 25,16 41,17 16,18 1,20 11,21 5,24 16,25 6,26 1,28 5,32 22,34 1,36 0.049,37 2,38 33,39 38.134,40 42.927,41 26.455,42 25.095,43 2.6,44 6.174}
{0 CHEMBL1784596,1 8.32,2 41.4,3 37.9,4 1.017,5 1.136,6 0.682,7 0.669,8 241.28,9 17.2,10 16,11 29,13 16,14 20,16 31,17 12,20 11,21 1,24 11,25 6,28 5,29 1,32 18,35 3.4,36 0.097,37 3,38 28,39 29.487,40 32.947,41 19.767,42 19.402,44 4}
{0 CHEMBL1784706,1 8.3,2 41.9,3 38.7,4 1.018,5 1.145,6 0.678,7 0.664,8 257.3,9 16.1,10 16,11 31,13 16,14 21,16 33,17 13,20 11,21 2,23 1,24 12,25 6,28 5,32 19,34 1,36 0.091,37 3,38 29,39 31.556,40 35.492,41 21.012,42 20.598,43 3.2,44 4}
{0 CHEMBL1784707,1 9.039,2 41.2,3 35.3,4 1.043,5 1.164,6 0.666,7 0.673,8 307.31,9 14.7,10 16,11 34,13 16,14 24,16 36,17 14,20 11,21 3,23 3,24 12,25 8,28 5,32 22,34 3,36 0.083,37 3,38 32,39 35.465,40 39.587,41 22.648,42 22.891,43 8.8,44 4}
{0 CHEMBL1784708,1 7.451,2 41.2,3 44.1,4 0.998,5 1.134,6 0.672,7 0.639,8 253.34,9 14.7,10 16,11 34,13 16,14 21,16 36,17 14,20 11,21 3,24 15,25 5,28 5,32 19,36 0.111,37 4,38 29,39 33.927,40 38.568,41 22.836,42 21.741,44 4.824}
{0 CHEMBL1784709,1 7.226,2 40.5,3 45.9,4 0.995,5 1.135,6 0.665,7 0.629,8 267.37,9 13.5,10 16,11 37,13 16,14 22,16 39,17 15,20 11,21 4,24 17,25 5,28 5,32 20,36 0.128,37 5,38 30,39 36.811,40 41.983,41 24.597,42 23.268,44 4.585}
{0 CHEMBL1784710,1 6.343,2 33.3,3 53.8,4 0.989,5 1.149,6 0.618,7 0.572,8 247.39,9 12.8,10 10,11 39,13 10,14 19,16 40,17 13,20 5,21 8,24 21,25 5,28 5,32 18,36 0.175,37 7,38 24,39 38.578,40 44.813,41 24.12,42 22.321,44 5.066}
{0 CHEMBL1784711,1 9.039,2 41.2,3 35.3,4 1.043,5 1.164,6 0.666,7 0.673,8 307.31,9 14.7,10 16,11 34,13 16,14 24,16 36,17 14,20 11,21 3,23 3,24 12,25 8,28 5,32 22,34 3,36 0.083,37 3,38 32,39 35.465,40 39.587,41 22.648,42 22.891,43 8.8,44 6.108}
{0 CHEMBL1784712,1 11.202,2 41.9,3 22.6,4 1.101,5 1.2,6 0.668,7 0.726,8 347.25,9 16.1,10 16,11 31,13 16,14 26,16 33,17 13,20 11,21 2,23 6,24 7,25 11,28 5,32 24,34 6,36 0.061,37 2,38 34,39 34.12,40 37.191,41 20.699,42 22.514,43 19.4,44 5.77}
{0 CHEMBL1784713,1 11.203,2 42.9,3 25,4 1.072,5 1.168,6 0.714,7 0.738,8 313.69,9 17.9,10 16,11 28,13 16,14 23,16 30,17 12,18 1,20 11,21 1,23 3,24 7,25 9,26 1,28 5,32 21,34 4,36 0.067,37 2,38 31,39 30.022,40 32.7,41 19.983,42 20.665,43 14.3,44 6.77}
{0 CHEMBL1784714,1 6.87,2 39.5,3 48.8,4 0.99,5 1.135,6 0.654,7 0.612,8 295.43,9 11.6,10 16,11 43,13 16,14 24,16 45,17 17,20 11,21 6,24 21,25 5,28 5,32 22,36 0.089,37 4,38 32,39 42.578,40 48.813,41 28.12,42 26.321,44 5.77}
{0 CHEMBL1784715,1 8.877,2 39.5,3 36.8,4 1.044,5 1.163,6 0.654,7 0.661,8 337.34,9 13.2,10 16,11 38,13 16,14 26,16 40,17 15,20 11,21 4,23 3,24 14,25 9,28 5,29 1,32 24,34 3,35 2.6,36 0.1,37 4,38 34,39 39.676,40 44.211,41 24.864,42 25.133,43 7.9,44 5.495}
{0 CHEMBL1784716,1 7.035,2 40,3 47.5,4 0.992,5 1.135,6 0.659,7 0.62,8 281.4,9 12.5,10 16,11 40,13 16,14 23,16 42,17 16,20 11,21 5,24 19,25 5,28 5,32 21,36 0.095,37 4,38 31,39 39.694,40 45.398,41 26.358,42 24.795,44 4}
{0 CHEMBL1784717,1 8.095,2 42.9,3 40,4 1.013,5 1.14,6 0.679,7 0.661,8 283.34,9 14.3,10 16,11 35,13 16,14 24,16 38,17 15,20 11,21 4,23 1,24 14,25 6,28 5,32 21,34 1,36 0.053,37 2,38 32,39 35.44,40 39.907,41 23.773,42 23.124,43 2.9,44 5.854}
{0 CHEMBL199572,1 7.89,2 50,3 40.5,4 1.004,5 1.106,6 0.701,7 0.676,8 331.39,9 2.4,10 18,11 42,13 20,14 27,16 44,17 21,20 20,21 1,22 2,24 17,25 4,28 1,29 3,32 25,35 7.1,36 0.091,37 4,38 38,39 42.153,40 46.448,41 29.46,42 28.38,44 4.371}
{0 CHEMBL199574,1 10.577,2 51.4,3 34.3,4 1.018,5 1.099,6 0.751,7 0.724,8 370.21,9 2.9,10 17,11 35,13 19,14 25,15 1,16 37,17 18,20 18,22 2,24 12,25 5,26 1,28 1,29 3,32 23,34 1,35 8.6,36 0.081,37 3,38 35.5,39 35.614,40 38.459,41 26.29,42 25.352,43 2.9,44 4.785}
{0 CHEMBL211501,1 6.946,2 35.4,3 50.6,4 1.012,5 1.136,6 0.615,7 0.588,8 548.7,9 2.5,10 6,11 79,13 11,14 40,16 80,17 28,20 11,21 17,22 5,24 40,25 11,28 2,29 9,32 39,35 11.4,36 0.15,37 12,38 48,39 79.938,40 89.77,41 48.568,42 46.485,44 5}
{0 CHEMBL2170881,1 8.758,2 45.5,3 36.4,4 1.037,5 1.123,6 0.676,7 0.68,8 385.37,9 2.3,10 17,11 44,13 18,14 31,16 47,17 20,20 16,21 4,22 1,23 1,24 16,25 8,28 1,29 6,32 28,34 1,35 13.6,36 0.106,37 5,38 40.5,39 45.647,40 49.416,41 29.761,42 29.908,43 2.3,44 4.523}
{0 CHEMBL2170884,1 8.336,2 48.1,3 38.5,4 1.021,5 1.116,6 0.689,7 0.678,8 433.46,9 1.9,10 23,11 52,13 24,14 35,16 55,17 25,20 22,21 3,22 1,23 1,24 20,25 7,28 1,29 5,32 32,34 1,35 9.6,36 0.127,37 7,38 47.5,39 53.087,40 58.037,41 35.83,42 35.247,43 1.9,44 4.523}
{0 CHEMBL2170887,1 9.166,2 46.3,3 36.6,4 1.032,5 1.121,6 0.7,7 0.69,8 375.8,9 2.4,10 17,11 41,13 18,14 28,16 43,17 19,18 1,20 16,21 3,22 1,23 1,24 15,25 7,26 1,28 1,29 4,32 26,34 2,35 9.8,36 0.116,37 5,38 37.5,39 42.316,40 45.941,41 28.71,42 28.306,43 4.9,44 4.523}
{0 CHEMBL2178105,1 11.99,2 48.4,3 29,4 1.032,5 1.098,6 0.822,7 0.776,8 371.68,9 6.5,10 16,11 31,13 17,14 24,16 33,17 15,18 3,20 14,21 1,22 1,24 9,25 7,26 4,28 2,29 1,31 1,32 22,34 3,35 3.2,36 0.061,37 2,38 33,39 31.996,40 34.034,41 25.494,42 24.061,43 9.7,44 5.714}
{0 CHEMBL2178108,1 9.058,2 41.9,3 41.9,4 1.008,5 1.115,6 0.727,7 0.675,8 280.8,9 6.5,10 11,11 31,13 12,14 19,16 32,17 13,18 1,20 10,21 3,22 1,24 13,25 5,26 2,28 2,29 1,31 1,32 18,34 1,35 3.2,36 0.094,37 3,38 25.5,39 31.233,40 34.561,41 22.54,42 20.933,43 3.2,44 6.119}
{0 CHEMBL2178109,1 11.543,2 50,3 28.6,4 1.028,5 1.096,6 0.817,7 0.775,8 323.21,9 7.1,10 16,11 28,13 17,14 22,16 30,17 14,18 2,20 14,22 1,24 8,25 6,26 3,28 2,29 1,31 1,32 20,34 2,35 3.6,36 0.067,37 2,38 31,39 28.789,40 30.675,41 22.875,42 21.707,43 7.1,44 5.331}
{0 CHEMBL217893,1 10.489,2 45.2,3 32.3,4 1.04,5 1.116,6 0.739,7 0.725,8 325.16,9 6.5,10 12,11 31,13 15,14 22,16 32,17 14,18 2,20 13,21 1,22 3,24 10,25 7,26 2,28 2,29 3,32 21,34 2,35 9.7,36 0.094,37 3,38 31,39 32.251,40 34.589,41 22.898,42 22.476,43 6.5,44 6.638}
{0 CHEMBL217897,1 7.379,2 43.5,3 45.7,4 1.005,5 1.119,6 0.662,7 0.634,8 339.42,9 2.2,10 12,11 46,13 15,14 26,16 47,17 20,20 16,21 4,22 3,24 21,25 5,28 1,29 4,32 25,35 8.7,36 0.17,37 8,38 35,39 46.247,40 51.488,41 30.438,42 29.149,44 4.062}
{0 CHEMBL217951,1 9.721,2 51.4,3 40,4 0.996,5 1.099,6 0.747,7 0.699,8 340.23,9 2.9,10 17,11 35,13 18,14 23,15 1,16 37,17 18,20 17,21 1,22 1,24 14,25 3,26 1,28 1,29 1,32 21,34 1,35 2.9,36 0.054,37 2,38 32.5,39 34.843,40 38.456,41 26.142,42 24.449,43 2.9,44 6.745}
{0 CHEMBL218467,1 8.21,2 44.4,3 42.2,4 1.01,5 1.111,6 0.696,7 0.662,8 369.47,9 2.2,10 15,11 45,13 18,14 28,16 47,17 20,20 16,21 4,22 3,24 19,25 6,26 1,28 1,29 4,31 1,32 26,35 8.9,36 0.149,37 7,38 38.5,39 45.44,40 49.993,41 31.324,42 29.809,44 6.796}
{0 CHEMBL218703,1 7.578,2 45.5,3 43.2,4 1.001,5 1.119,6 0.682,7 0.652,8 333.42,9 6.8,10 15,11 44,13 18,14 27,16 46,17 20,19 1,20 15,21 4,22 2,24 19,25 5,28 3,29 2,32 25,33 1,35 4.5,36 0.109,37 5,38 38.5,39 44.029,40 49.235,41 30.017,42 28.708,44 6.357}
{0 CHEMBL219855,1 7.778,2 38.5,3 43.6,4 1.021,5 1.134,6 0.645,7 0.631,8 303.35,9 7.7,10 10,11 39,13 13,14 23,16 40,17 15,20 11,21 4,22 3,24 17,25 7,28 3,29 4,32 22,35 10.3,36 0.175,37 7,38 31,39 39.8,40 44.239,41 25.165,42 24.611,44 4.396}
{0 CHEMBL219856,1 7.112,2 38.5,3 48.7,4 1.009,5 1.13,6 0.633,7 0.606,8 277.35,9 2.6,10 6,11 39,13 9,14 20,16 39,17 15,20 10,21 5,22 3,24 19,25 5,28 1,29 4,32 20,35 10.3,36 0.179,37 7,38 26,39 39.363,40 44.073,41 24.676,42 23.622,44 4.398}
{0 CHEMBL222556,1 8.767,2 51.7,3 34.5,4 1.025,5 1.1,6 0.711,7 0.707,8 254.25,10 12,11 29,13 14,14 21,16 31,17 15,20 15,22 2,24 10,25 4,29 4,32 19,35 13.8,36 0.032,37 1,38 29,39 29.727,40 31.914,41 20.625,42 20.493,44 5.023}
{0 CHEMBL224182,1 5.991,2 38.2,3 56.4,4 0.982,5 1.13,6 0.624,7 0.57,8 329.53,9 1.8,10 6,11 55,13 8,14 25,16 56,17 21,20 9,21 12,22 2,24 31,25 3,28 1,29 2,32 24,35 3.6,36 0.196,37 11,38 30,39 54.01,40 62.145,41 34.336,42 31.353,44 5.398}
{0 CHEMBL269671,1 6.723,2 35.7,3 52.4,4 1.008,5 1.134,6 0.611,7 0.58,8 282.37,11 42,13 1,14 23,16 45,17 15,20 1,21 14,22 1,24 22,25 5,29 5,32 20,35 11.9,38 24,39 42.356,40 47.614,41 25.648,42 24.369,44 5}
{0 CHEMBL275638,1 8.231,2 55.6,3 37,4 1.003,5 1.092,6 0.73,7 0.706,8 222.25,10 12,11 27,13 14,14 19,16 29,17 15,20 15,22 2,24 10,25 2,29 2,32 17,35 7.4,36 0.034,37 1,38 27,39 27.073,40 29.495,41 19.716,42 19.064,44 5}
{0 CHEMBL370865,1 8.137,2 51.3,3 38.5,4 1.007,5 1.103,6 0.71,7 0.689,8 317.36,9 2.6,10 18,11 39,13 20,14 26,16 41,17 20,20 20,22 2,24 15,25 4,28 1,29 3,32 24,35 7.7,36 0.098,37 4,38 37,39 39.269,40 43.033,41 27.699,42 26.853,44 4.752}
{0 CHEMBL372561,1 10.112,2 50,3 36.8,4 1.013,5 1.102,6 0.738,7 0.707,8 384.24,9 2.6,10 17,11 38,13 19,14 26,15 1,16 40,17 19,20 18,21 1,22 2,24 14,25 5,26 1,28 1,29 3,32 24,34 1,35 7.9,36 0.075,37 3,38 36.5,39 38.498,40 41.875,41 28.051,42 26.879,43 2.6,44 4.499}
{0 CHEMBL387254,1 7.694,2 47.4,3 42.1,4 1.001,5 1.114,6 0.691,7 0.662,8 292.36,9 5.3,10 12,11 38,13 15,14 23,16 39,17 18,19 1,20 15,21 2,22 2,24 16,25 4,28 2,29 2,32 22,33 1,35 5.3,36 0.128,37 5,38 33,39 38.043,40 42.322,41 26.25,42 25.16,44 4.672}
{0 CHEMBL397686,1 13.29,2 57.1,3 38.1,4 0.978,5 1.076,6 0.861,7 0.747,8 279.1,10 12,11 21,13 12,14 15,16 23,17 12,20 12,24 8,25 1,26 1,27 1,32 13,34 1,38 21,39 20.545,40 22.589,41 18.085,42 15.687,43 4.8,44 5}
{0 CHEMBL413583,1 7.112,2 38.5,3 48.7,4 1.009,5 1.13,6 0.633,7 0.606,8 277.35,9 2.6,10 6,11 39,13 9,14 20,16 39,17 15,20 10,21 5,22 3,24 19,25 5,28 1,29 4,32 20,35 10.3,36 0.179,37 7,38 26,39 39.363,40 44.073,41 24.676,42 23.622,44 4.401}
{0 CHEMBL429023,1 7.734,2 45.1,3 43.1,4 1.013,5 1.114,6 0.669,7 0.649,8 394.45,10 12,11 51,13 14,14 33,16 55,17 23,20 15,21 8,22 2,24 22,25 6,29 6,32 29,35 11.8,36 0.055,37 3,38 41,39 51.683,40 56.824,41 34.102,42 33.084,44 5}
{0 CHEMBL435137,1 7.778,2 38.5,3 43.6,4 1.021,5 1.134,6 0.645,7 0.631,8 303.35,9 7.7,10 10,11 39,13 13,14 23,16 40,17 15,20 11,21 4,22 3,24 17,25 7,28 3,29 4,32 22,35 10.3,36 0.175,37 7,38 31,39 39.8,40 44.239,41 25.165,42 24.611,44 4.556}
{0 CHEMBL446825,1 8.046,2 42.9,3 39.3,4 1.006,5 1.133,6 0.69,7 0.667,8 225.28,9 17.9,10 16,11 28,13 16,14 19,16 30,17 12,20 11,21 1,24 11,25 5,28 5,32 17,36 0.067,37 2,38 27,39 28.16,40 31.737,41 19.313,42 18.687,44 4}
{0 CHEMBL449358,1 8.098,2 47.1,3 38.2,4 1.001,5 1.122,6 0.708,7 0.683,8 275.34,9 14.7,10 21,11 34,13 21,14 24,16 37,17 16,20 15,21 1,24 13,25 5,28 5,32 21,36 0.054,37 2,38 34.5,39 34.043,40 38.152,41 24.074,42 23.214,44 4.347}
{0 CHEMBL451880,1 8.374,2 45.5,3 36.4,4 1.008,5 1.128,6 0.707,7 0.688,8 276.33,9 18.2,10 21,11 33,13 21,14 24,16 36,17 15,20 14,21 1,24 12,25 6,28 6,32 21,36 0.056,37 2,38 34.5,39 33.262,40 37.235,41 23.318,42 22.709,44 5.921}
{0 CHEMBL475813,1 8.098,2 47.1,3 38.2,4 1.001,5 1.122,6 0.708,7 0.683,8 275.34,9 14.7,10 21,11 34,13 21,14 24,16 37,17 16,20 15,21 1,24 13,25 5,28 5,32 21,36 0.054,37 2,38 34.5,39 34.043,40 38.152,41 24.074,42 23.214,44 7.328}
{0 CHEMBL475814,1 8.135,2 50,3 37.5,4 0.998,5 1.114,6 0.721,7 0.694,8 325.4,9 12.5,10 26,11 40,13 26,14 29,16 44,17 20,20 19,21 1,24 15,25 5,28 5,32 25,36 0.045,37 2,38 42,39 39.927,40 44.568,41 28.836,42 27.741,44 7.252}
{0 CHEMBL481680,1 12.223,2 52.2,3 43.5,4 0.975,5 1.087,6 0.819,7 0.705,8 281.12,10 12,11 23,13 12,14 14,16 24,17 12,20 12,24 10,25 1,26 1,27 1,32 13,34 1,36 0.083,37 2,38 20,39 22.429,40 25.004,41 18.847,42 16.214,43 4.3,44 5}
{0 CHEMBL483161,1 8.79,2 46.2,3 38.5,4 1.018,5 1.115,6 0.707,7 0.685,8 342.8,9 5.1,10 12,11 39,13 15,14 25,16 40,17 18,18 1,19 1,20 15,21 2,22 2,24 15,25 6,26 1,28 2,29 3,32 24,33 1,34 1,35 7.7,36 0.1,37 4,38 35,39 39.694,40 43.475,41 27.563,42 26.702,43 2.6,44 5.066}
{0 CHEMBL483552,1 9.92,2 48.6,3 34.3,4 1.023,5 1.108,6 0.749,7 0.723,8 347.21,9 5.7,10 12,11 35,13 15,14 24,16 36,17 17,18 2,19 1,20 15,21 1,22 2,24 12,25 6,26 2,28 2,29 2,32 23,33 1,34 2,35 5.7,36 0.083,37 3,38 34,39 35.807,40 38.795,41 26.205,42 25.288,43 5.7,44 5.398}
{0 CHEMBL483994,1 8.936,2 48.6,3 37.1,4 1.014,5 1.11,6 0.724,7 0.699,8 312.77,9 5.7,10 12,11 35,13 15,14 23,16 36,17 17,18 1,19 1,20 15,21 1,22 2,24 13,25 5,26 1,28 2,29 2,32 22,33 1,34 1,35 5.7,36 0.083,37 3,38 33,39 35.484,40 38.851,41 25.347,42 24.461,43 2.9,44 4.292}
{0 CHEMBL483995,1 7.676,2 45.2,3 42.9,4 1.006,5 1.118,6 0.678,7 0.652,8 322.39,9 4.8,10 12,11 42,13 15,14 25,16 43,17 19,19 1,20 15,21 3,22 2,24 18,25 5,28 2,29 3,32 24,33 1,35 7.1,36 0.116,37 5,38 35,39 42.254,40 46.946,41 28.466,42 27.402,44 4.668}
{0 CHEMBL484294,1 7.821,2 45.9,3 40.5,4 0.998,5 1.123,6 0.698,7 0.669,8 289.37,9 13.5,10 21,11 37,13 21,14 25,16 40,17 17,20 15,21 2,24 15,25 5,28 5,32 22,36 0.075,37 3,38 35.5,39 36.927,40 41.568,41 25.836,42 24.741,44 6.721}
{0 CHEMBL484305,1 8.537,2 44.4,3 36.1,4 1.019,5 1.127,6 0.694,7 0.685,8 307.34,9 13.9,10 16,11 36,13 18,14 26,16 39,17 16,20 14,21 2,22 2,24 13,25 7,28 5,29 2,32 23,35 5.6,36 0.051,37 2,38 36,39 36.698,40 40.571,41 24.983,42 24.644,44 5.699}
{0 CHEMBL484531,1 8.936,2 48.6,3 37.1,4 1.014,5 1.11,6 0.724,7 0.699,8 312.77,9 5.7,10 12,11 35,13 15,14 23,16 36,17 17,18 1,19 1,20 15,21 1,22 2,24 13,25 5,26 1,28 2,29 2,32 22,33 1,34 1,35 5.7,36 0.083,37 3,38 33,39 35.484,40 38.851,41 25.347,42 24.461,43 2.9,44 4.324}
{0 CHEMBL484594,1 10.904,2 48.6,3 31.4,4 1.032,5 1.107,6 0.773,7 0.746,8 381.65,9 5.7,10 12,11 35,13 15,14 25,16 36,17 17,18 3,19 1,20 15,21 1,22 2,24 11,25 7,26 3,28 2,29 2,32 24,33 1,34 3,35 5.7,36 0.083,37 3,38 35,39 36.131,40 38.739,41 27.063,42 26.116,43 8.6,44 4.991}
{0 CHEMBL484595,1 9.92,2 48.6,3 34.3,4 1.023,5 1.108,6 0.749,7 0.723,8 347.21,9 5.7,10 12,11 35,13 15,14 24,16 36,17 17,18 2,19 1,20 15,21 1,22 2,24 12,25 6,26 2,28 2,29 2,32 23,33 1,34 2,35 5.7,36 0.083,37 3,38 34,39 35.807,40 38.795,41 26.205,42 25.288,43 5.7,44 4.309}
{0 CHEMBL484602,1 10.02,2 47.4,3 31.6,4 1.05,5 1.139,6 0.708,7 0.714,8 380.77,9 5.3,10 12,11 38,13 15,14 27,16 39,17 18,18 1,19 1,20 15,21 2,22 2,23 3,24 12,25 8,26 1,28 2,29 2,32 26,33 1,34 4,35 5.3,36 0.077,37 3,38 37,39 39.905,40 43.285,41 26.921,42 27.137,43 10.5,44 4.243}
{0 CHEMBL484780,1 9.92,2 48.6,3 34.3,4 1.023,5 1.108,6 0.749,7 0.723,8 347.21,9 5.7,10 12,11 35,13 15,14 24,16 36,17 17,18 2,19 1,20 15,21 1,22 2,24 12,25 6,26 2,28 2,29 2,32 23,33 1,34 2,35 5.7,36 0.083,37 3,38 34,39 35.807,40 38.795,41 26.205,42 25.288,43 5.7,44 4.688}
{0 CHEMBL486489,1 7.821,2 45.9,3 40.5,4 0.998,5 1.123,6 0.698,7 0.669,8 289.37,9 13.5,10 21,11 37,13 21,14 25,16 40,17 17,20 15,21 2,24 15,25 5,28 5,32 22,36 0.05,37 2,38 35.5,39 36.927,40 41.568,41 25.836,42 24.741,44 6.796}
{0 CHEMBL486490,1 7.821,2 45.9,3 40.5,4 0.998,5 1.123,6 0.698,7 0.669,8 289.37,9 13.5,10 21,11 37,13 21,14 25,16 40,17 17,20 15,21 2,24 15,25 5,28 5,32 22,36 0.05,37 2,38 35.5,39 36.927,40 41.568,41 25.836,42 24.741,44 5.523}
{0 CHEMBL486697,1 7.776,2 48.9,3 40.4,4 0.993,5 1.115,6 0.71,7 0.676,8 365.47,9 10.6,10 27,11 47,13 27,14 32,16 51,17 23,20 21,21 2,24 19,25 5,28 5,32 28,36 0.078,37 4,38 45.5,39 46.694,40 52.398,41 33.358,42 31.795,44 4.032}
{0 CHEMBL487518,1 8.324,2 45.7,3 37.1,4 1.011,5 1.125,6 0.701,7 0.684,8 291.34,9 14.3,10 21,11 35,13 21,14 25,16 38,17 16,20 15,21 1,24 13,25 6,28 5,29 1,32 22,35 2.9,36 0.053,37 2,38 35.5,39 35.371,40 39.362,41 24.529,42 23.929,44 6.481}
{0 CHEMBL503135,1 8.374,2 45.5,3 36.4,4 1.008,5 1.128,6 0.707,7 0.688,8 276.33,9 18.2,10 21,11 33,13 21,14 24,16 36,17 15,20 14,21 1,24 12,25 6,28 6,32 21,36 0.056,37 2,38 34.5,39 33.262,40 37.235,41 23.318,42 22.709,44 5.77}
{0 CHEMBL505315,1 9.92,2 48.6,3 34.3,4 1.023,5 1.108,6 0.749,7 0.723,8 347.21,9 5.7,10 12,11 35,13 15,14 24,16 36,17 17,18 2,19 1,20 15,21 1,22 2,24 12,25 6,26 2,28 2,29 2,32 23,33 1,34 2,35 5.7,36 0.083,37 3,38 34,39 35.807,40 38.795,41 26.205,42 25.288,43 5.7,44 4.565}
{0 CHEMBL519160,1 7.952,2 48.6,3 40,4 1.005,5 1.112,6 0.7,7 0.675,8 278.33,9 5.7,10 12,11 35,13 15,14 22,16 36,17 17,19 1,20 15,21 1,22 2,24 14,25 4,28 2,29 2,32 21,33 1,35 5.7,36 0.083,37 3,38 32,39 35.16,40 38.907,41 24.489,42 23.633,44 4.59}
{0 CHEMBL519836,1 9.686,2 47.1,3 29.4,4 1.047,5 1.152,6 0.703,7 0.717,8 329.31,9 14.7,10 21,11 34,13 21,14 27,16 37,17 16,20 15,21 1,23 3,24 10,25 8,28 5,32 24,34 3,36 0.054,37 2,38 37.5,39 35.582,40 39.171,41 23.887,42 24.364,43 8.8,44 6.678}
{0 CHEMBL520008,1 9.92,2 48.6,3 34.3,4 1.023,5 1.108,6 0.749,7 0.723,8 347.21,9 5.7,10 12,11 35,13 15,14 24,16 36,17 17,18 2,19 1,20 15,21 1,22 2,24 12,25 6,26 2,28 2,29 2,32 23,33 1,34 2,35 5.7,36 0.083,37 3,38 34,39 35.807,40 38.795,41 26.205,42 25.288,43 5.7,44 4.553}
{0 CHEMBL520306,1 10.02,2 47.4,3 31.6,4 1.05,5 1.139,6 0.708,7 0.714,8 380.77,9 5.3,10 12,11 38,13 15,14 27,16 39,17 18,18 1,19 1,20 15,21 2,22 2,23 3,24 12,25 8,26 1,28 2,29 2,32 26,33 1,34 4,35 5.3,36 0.077,37 3,38 37,39 39.905,40 43.285,41 26.921,42 27.137,43 10.5,44 5.208}
{0 CHEMBL520999,1 10.904,2 48.6,3 31.4,4 1.032,5 1.107,6 0.773,7 0.746,8 381.65,9 5.7,10 12,11 35,13 15,14 25,16 36,17 17,18 3,19 1,20 15,21 1,22 2,24 11,25 7,26 3,28 2,29 2,32 24,33 1,34 3,35 5.7,36 0.083,37 3,38 35,39 36.131,40 38.739,41 27.063,42 26.116,43 8.6,44 5.463}
{0 CHEMBL582694,1 7.454,2 38.9,3 44.4,4 1.001,5 1.141,6 0.662,7 0.632,8 268.36,9 16.7,10 16,11 36,13 16,14 22,16 38,17 14,20 11,21 3,24 16,25 6,28 6,32 20,36 0.079,37 3,38 30,39 36.029,40 41.066,41 23.841,42 22.762,44 6.086}
{0 CHEMBL586157,1 7.581,2 42.9,3 42.9,4 0.998,5 1.131,6 0.681,7 0.65,8 265.35,9 14.3,10 16,11 35,13 16,14 23,16 38,17 15,20 11,21 4,24 15,25 5,28 5,32 20,36 0.053,37 2,38 31,39 34.927,40 39.568,41 23.836,42 22.741,44 6.658}
{0 CHEMBL600255,1 7.226,2 40.5,3 45.9,4 0.995,5 1.135,6 0.665,7 0.629,8 267.37,9 13.5,10 16,11 37,13 16,14 22,16 39,17 15,20 11,21 4,24 17,25 5,28 5,32 20,36 0.077,37 3,38 30,39 36.811,40 41.983,41 24.597,42 23.268,44 6.658}
{0 CHEMBL973,1 9.651,2 42.9,3 32.1,4 1.065,5 1.161,6 0.662,7 0.688,8 270.23,9 7.1,10 6,11 28,13 9,14 19,16 28,17 12,19 1,20 9,21 2,22 2,23 3,24 9,25 7,28 2,29 2,32 19,33 1,34 3,35 7.1,36 0.071,37 2,38 26,39 29.814,40 32.511,41 18.54,42 19.256,43 10.7,44 4.658}
