{
  "data_set_description": {
    "collection_date": "November 2013",
    "creator": "Dr Jeremy Besnard, Dr Ivan Olier, Dr Noureddin Sadawi, Dr Larisa Soldatova, Dr Crina Grosan, Prof Ross King, Dr Richard Bickerton, Prof Andrew Hopkins and Dr Willem van Hoorn",
    "default_target_attribute": "pXC50",
    "description": "This dataset contains QSAR data (from ChEMBL version 17) showing activity values (unit is pseudo-pCI50) of several compounds on drug target ChEMBL_ID: CHEMBL3208 (TID: 13028), and it has 14 rows and 43 features (not including molecule IDs and class feature: molecule_id and pXC50). The features represent Basic Molecular Descriptors which were generated from SMILES strings.  Missing value imputation was applied to this dataset (By choosing the Median).",
    "description_version": "1",
    "file_id": "3653210",
    "format": "ARFF",
    "id": "38803",
    "licence": "Public",
    "md5_checksum": "151b1737b4b3656e09250c2f8558df33",
    "minio_url": "https://data.openml.org/datasets/0003/38803/dataset_38803.pq",
    "name": "QSAR-DATASET-FOR-DRUG-TARGET-CHEMBL3208",
    "original_data_url": "https://www.ebi.ac.uk/chembl/target/inspect/CHEMBL3208",
    "parquet_url": "https://data.openml.org/datasets/0003/38803/dataset_38803.pq",
    "processing_date": "2018-10-04 06:04:46",
    "row_id_attribute": "molecule_id",
    "status": "deactivated",
    "tag": [
      "MetaQSAR",
      "study_13"
    ],
    "upload_date": "2016-07-16T05:33:47",
    "url": "https://api.openml.org/data/v1/download/3653210/QSAR-DATASET-FOR-DRUG-TARGET-CHEMBL3208.arff",
    "version": "12",
    "visibility": "public"
  }
}