{
  "data_set_description": {
    "collection_date": "November 2013",
    "creator": "Dr Jeremy Besnard, Dr Ivan Olier, Dr Noureddin Sadawi, Dr Larisa Soldatova, Dr Crina Grosan, Prof Ross King, Dr Richard Bickerton, Prof Andrew Hopkins and Dr Willem van Hoorn",
    "default_target_attribute": "pXC50",
    "description": "This dataset contains QSAR data (from ChEMBL version 17) showing activity values (unit is pseudo-pCI50) of several compounds on drug target ChEMBL_ID: CHEMBL1770032 (TID: 104124), and it has 35 rows and 1238 features (not including molecule IDs and class feature: molecule_id and pXC50). The features represent Molecular Descriptors which were generated from SMILES strings. Missing value imputation was applied to this dataset (By choosing the Median).",
    "description_version": "1",
    "file_id": "3652774",
    "format": "ARFF",
    "id": "38791",
    "licence": "Public",
    "md5_checksum": "90fa70df3100e7ed1233c937edcb8e1b",
    "minio_url": "https://data.openml.org/datasets/0003/38791/dataset_38791.pq",
    "name": "QSAR-DATASET-FOR-DRUG-TARGET-CHEMBL1770032",
    "original_data_url": "https://www.ebi.ac.uk/chembl/target/inspect/CHEMBL1770032",
    "parquet_url": "https://data.openml.org/datasets/0003/38791/dataset_38791.pq",
    "processing_date": "2018-10-04 06:05:02",
    "row_id_attribute": "molecule_id",
    "status": "deactivated",
    "tag": [
      "MetaQSAR",
      "study_13"
    ],
    "upload_date": "2016-07-16T05:31:07",
    "url": "https://api.openml.org/data/v1/download/3652774/QSAR-DATASET-FOR-DRUG-TARGET-CHEMBL1770032.arff",
    "version": "12",
    "visibility": "public"
  }
}