{
  "data_set_description": {
    "collection_date": "November 2013",
    "creator": "Dr Jeremy Besnard, Dr Ivan Olier, Dr Noureddin Sadawi, Dr Larisa Soldatova, Dr Crina Grosan, Prof Ross King, Dr Richard Bickerton, Prof Andrew Hopkins and Dr Willem van Hoorn",
    "default_target_attribute": "pXC50",
    "description": "This dataset contains QSAR data (from ChEMBL version 17) showing activity values (unit is pseudo-pCI50) of several compounds on drug target ChEMBL_ID: CHEMBL2609 (TID: 10984), and it has 20 rows and 43 features (not including molecule IDs and class feature: molecule_id and pXC50). The features represent Basic Molecular Descriptors which were generated from SMILES strings.  Missing value imputation was applied to this dataset (By choosing the Median).",
    "description_version": "1",
    "file_id": "3652012",
    "format": "ARFF",
    "id": "38777",
    "licence": "Public",
    "md5_checksum": "ce0e52b2a2694af28e2e474224993e58",
    "minio_url": "https://data.openml.org/datasets/0003/38777/dataset_38777.pq",
    "name": "QSAR-DATASET-FOR-DRUG-TARGET-CHEMBL2609",
    "original_data_url": "https://www.ebi.ac.uk/chembl/target/inspect/CHEMBL2609",
    "parquet_url": "https://data.openml.org/datasets/0003/38777/dataset_38777.pq",
    "processing_date": "2018-10-04 06:10:52",
    "row_id_attribute": "molecule_id",
    "status": "deactivated",
    "tag": [
      "MetaQSAR",
      "study_13"
    ],
    "upload_date": "2016-07-16T05:27:38",
    "url": "https://api.openml.org/data/v1/download/3652012/QSAR-DATASET-FOR-DRUG-TARGET-CHEMBL2609.arff",
    "version": "12",
    "visibility": "public"
  }
}