"molecule_id","nH","nCsp3","Si","Se","nAT","nBT","Mp","Sp","Sv","Mv","MW","nC","Mi","nDB","nAB","nBM","SCBO","H.","AMW","nSK","nBO","C.","Me","N.","nB","nBR","nCL","nCsp","pXC50"
{1 31,2 8,3 75.647,4 67.381,5 67,6 70,7 0.663,8 44.392,9 42.002,10 0.627,11 509.69,12 26,13 1.129,14 4,15 17,16 21,17 51.5,18 46.3,19 7.607,20 36,21 39,22 38.8,23 1.006,24 7.5,29 4.409}
{0 CHEMBL104192,1 29,2 7,3 74.361,4 66.902,5 66,6 69,7 0.678,8 44.733,9 42.377,10 0.642,11 543.73,12 25,13 1.127,14 6,15 17,16 23,17 54.5,18 43.9,19 8.238,20 37,21 40,22 37.9,23 1.014,24 7.6,29 6.721}
{0 CHEMBL104241,1 28,2 7,3 68.524,4 61.069,5 61,6 64,7 0.675,8 41.171,9 38.739,10 0.635,11 464.64,12 25,13 1.123,14 4,15 17,16 21,17 48.5,18 45.9,19 7.617,20 33,21 36,22 41,23 1.001,24 6.6,29 6.481}
{0 CHEMBL104426,1 31,2 6,3 80.647,4 72.381,5 72,6 76,7 0.686,8 49.392,9 47.002,10 0.653,11 569.74,12 31,13 1.12,14 5,15 23,16 28,17 61.5,18 43.1,19 7.913,20 41,21 45,22 43.1,23 1.005,24 6.9,29 6.854}
{0 CHEMBL104815,1 29,2 7,3 73.232,4 65.498,5 65,6 68,7 0.671,8 43.631,9 41.475,10 0.638,11 507.67,12 26,13 1.127,14 5,15 17,16 22,17 52.5,18 44.6,19 7.81,20 36,21 39,22 40,23 1.008,24 7.7,29 4.77}
{0 CHEMBL104872,1 31,2 8,3 75.647,4 67.381,5 67,6 70,7 0.663,8 44.392,9 42.002,10 0.627,11 509.69,12 26,13 1.129,14 4,15 17,16 21,17 51.5,18 46.3,19 7.607,20 36,21 39,22 38.8,23 1.006,24 7.5,29 5.959}
{0 CHEMBL104930,1 27,2 7,3 67.946,4 61.018,5 60,6 62,7 0.666,8 39.972,9 37.85,10 0.631,11 493.67,12 21,13 1.132,14 6,15 12,16 18,17 47,18 45,19 8.228,20 33,21 35,22 35,23 1.017,24 8.3,29 6}
{0 CHEMBL104970,1 31,2 6,3 78.437,4 70.054,5 70,6 74,7 0.685,8 47.938,9 45.287,10 0.647,11 541.73,12 30,13 1.121,14 4,15 23,16 27,17 58.5,18 44.3,19 7.739,20 39,21 43,22 42.9,23 1.001,24 7.1,29 7.569}
{0 CHEMBL105439,1 35,2 11,3 82.816,4 73.88,5 73,6 75,7 0.65,8 47.472,9 44.672,10 0.612,11 565.79,12 25,13 1.134,14 6,15 12,16 18,17 52,18 47.9,19 7.751,20 38,21 40,22 34.2,23 1.012,24 6.8,29 5.745}
{0 CHEMBL105569,1 33,2 6,3 87.062,4 78.265,5 78,6 83,7 0.694,8 54.154,9 51.528,10 0.661,11 619.8,12 35,13 1.116,14 5,15 28,16 33,17 69,18 42.3,19 7.946,20 45,21 50,22 44.9,23 1.003,24 6.4,29 6.721}
{0 CHEMBL105875,1 46,2 17,3 99.679,4 87.676,5 88,6 90,7 0.636,8 55.932,9 51.909,10 0.59,11 598.89,12 32,13 1.133,14 5,15 12,16 17,17 55,18 52.3,19 6.806,20 42,21 44,22 36.4,23 0.996,24 4.5,29 5.854}
{0 CHEMBL105935,1 45,2 16,3 95.344,4 83.239,5 84,6 86,7 0.634,8 53.268,9 48.974,10 0.583,11 555.87,12 30,13 1.135,14 4,15 12,16 16,17 51,18 53.6,19 6.617,20 39,21 41,22 35.7,23 0.991,24 6,29 5.523}
{0 CHEMBL106035,1 43,2 15,3 91.929,4 80.356,5 81,6 83,7 0.636,8 51.506,9 47.448,10 0.586,11 541.84,12 29,13 1.135,14 4,15 12,16 16,17 50,18 53.1,19 6.689,20 38,21 40,22 35.8,23 0.992,24 6.2,29 6.009}
{0 CHEMBL106079,1 46,2 17,3 96.261,4 84.021,5 85,6 87,7 0.636,8 54.023,9 49.48,10 0.582,11 554.88,12 31,13 1.132,14 4,15 12,16 16,17 51,18 54.1,19 6.528,20 39,21 41,22 36.5,23 0.988,24 4.7,29 6.161}
{0 CHEMBL106111,1 27,2 6,3 69.816,4 62.614,5 62,6 65,7 0.675,8 41.87,9 39.948,10 0.644,11 493.64,12 25,13 1.126,14 5,15 17,16 22,17 51.5,18 43.5,19 7.962,20 35,21 38,22 40.3,23 1.01,24 8.1,29 4.955}
{0 CHEMBL106395,1 44,2 16,3 96.264,4 84.792,5 85,6 87,7 0.637,8 54.171,9 50.383,10 0.593,11 584.86,12 31,13 1.133,14 5,15 12,16 17,17 54,18 51.8,19 6.881,20 41,21 43,22 36.5,23 0.998,24 4.7,29 6.301}
{0 CHEMBL106412,1 42,2 15,3 90.64,4 79.581,5 80,6 82,7 0.637,8 50.955,9 47.141,10 0.589,11 542.82,12 29,13 1.133,14 4,15 12,16 16,17 50,18 52.5,19 6.785,20 38,21 40,22 36.3,23 0.995,24 5,29 6.31}
{0 CHEMBL106718,1 33,2 7,3 85.191,4 76.669,5 76,6 80,7 0.688,8 52.256,9 49.43,10 0.65,11 619.83,12 31,13 1.121,14 6,15 23,16 29,17 64.5,18 43.4,19 8.156,20 43,21 47,22 40.8,23 1.009,24 6.6,29 6.658}
{0 CHEMBL106869,1 26,2 6,3 65.109,4 58.185,5 58,6 61,7 0.679,8 39.409,9 37.212,10 0.642,11 450.61,12 24,13 1.123,14 4,15 17,16 21,17 47.5,18 44.8,19 7.769,20 32,21 35,22 41.4,23 1.003,24 6.9,29 6.357}
{0 CHEMBL107132,1 33,2 9,3 81.191,4 72.669,5 72,6 75,7 0.67,8 48.256,9 45.43,10 0.631,11 571.79,12 27,13 1.128,14 6,15 17,16 23,17 56.5,18 45.8,19 7.942,20 39,21 42,22 37.5,23 1.009,24 6.9,29 6.678}
{0 CHEMBL107140,1 42,2 15,3 89.43,4 78.254,5 79,6 81,7 0.639,8 50.501,9 46.426,10 0.588,11 526.82,12 29,13 1.132,14 4,15 12,16 16,17 49,18 53.2,19 6.669,20 37,21 39,22 36.7,23 0.991,24 5.1,29 5.409}
{0 CHEMBL107188,1 29,2 7,3 73.232,4 65.498,5 65,6 68,7 0.671,8 43.631,9 41.475,10 0.638,11 507.67,12 26,13 1.127,14 5,15 17,16 22,17 52.5,18 44.6,19 7.81,20 36,21 39,22 40,23 1.008,24 7.7,29 6.854}
{0 CHEMBL107203,1 46,2 17,3 96.261,4 84.021,5 85,6 87,7 0.636,8 54.023,9 49.48,10 0.582,11 554.88,12 31,13 1.132,14 4,15 12,16 16,17 51,18 54.1,19 6.528,20 39,21 41,22 36.5,23 0.988,24 4.7,29 6.022}
{0 CHEMBL107210,1 26,2 6,3 66.318,4 59.512,5 59,6 62,7 0.676,8 39.864,9 37.927,10 0.643,11 466.61,12 24,13 1.124,14 4,15 17,16 21,17 48.5,18 44.1,19 7.909,20 33,21 36,22 40.7,23 1.009,24 6.8,29 6.678}
{0 CHEMBL107256,1 32,2 9,3 75.354,4 66.836,5 67,6 70,7 0.667,8 44.694,9 41.792,10 0.624,11 492.7,12 27,13 1.125,14 4,15 17,16 21,17 50.5,18 47.8,19 7.354,20 35,21 38,22 40.3,23 0.998,24 6,29 6.215}
{0 CHEMBL107282,1 31,2 8,3 75.647,4 67.381,5 67,6 70,7 0.663,8 44.392,9 42.002,10 0.627,11 509.69,12 26,13 1.129,14 4,15 17,16 21,17 51.5,18 46.3,19 7.607,20 36,21 39,22 38.8,23 1.006,24 7.5,29 6.222}
{0 CHEMBL107392,1 29,2 7,3 74.361,4 66.902,5 66,6 69,7 0.678,8 44.733,9 42.377,10 0.642,11 543.73,12 25,13 1.127,14 6,15 17,16 23,17 54.5,18 43.9,19 8.238,20 37,21 40,22 37.9,23 1.014,24 7.6,29 7.174}
{0 CHEMBL107429,1 29,2 7,3 71.022,4 63.171,5 63,6 66,7 0.669,8 42.176,9 39.76,10 0.631,11 479.66,12 25,13 1.127,14 4,15 17,16 21,17 49.5,18 46,19 7.614,20 34,21 37,22 39.7,23 1.003,24 7.9,29 5.886}
{0 CHEMBL107522,1 36,2 10,3 85.975,4 76.25,5 76,6 79,7 0.657,8 49.921,9 47.077,10 0.619,11 564.78,12 29,13 1.131,14 5,15 17,16 22,17 56.5,18 47.4,19 7.431,20 40,21 43,22 38.2,23 1.003,24 7.9,29 6.658}
{0 CHEMBL107592,1 30,2 8,3 71.939,4 63.952,5 64,6 67,7 0.671,8 42.932,9 40.265,10 0.629,11 478.67,12 26,13 1.124,14 4,15 17,16 21,17 49.5,18 46.9,19 7.479,20 34,21 37,22 40.6,23 0.999,24 6.3,29 6.131}
{0 CHEMBL107627,1 32,2 8,3 79.145,4 70.483,5 70,6 73,7 0.663,8 46.398,9 44.023,10 0.629,11 536.72,12 27,13 1.131,14 5,15 17,16 22,17 54.5,18 45.7,19 7.667,20 38,21 41,22 38.6,23 1.007,24 8.6,29 7.013}
{0 CHEMBL107743,1 41,2 15,3 94.062,4 83.53,5 83,6 86,7 0.648,8 53.756,9 50.252,10 0.605,11 619.89,12 29,13 1.133,14 6,15 12,16 18,17 57,18 49.4,19 7.469,20 42,21 45,22 34.9,23 1.006,24 6,29 6.495}
{0 CHEMBL107911,1 29,2 7,3 71.022,4 63.171,5 63,6 66,7 0.669,8 42.176,9 39.76,10 0.631,11 479.66,12 25,13 1.127,14 4,15 17,16 21,17 49.5,18 46,19 7.614,20 34,21 37,22 39.7,23 1.003,24 7.9,29 6.328}
{0 CHEMBL108058,1 46,2 17,3 99.679,4 87.676,5 88,6 90,7 0.636,8 55.932,9 51.909,10 0.59,11 598.89,12 32,13 1.133,14 5,15 12,16 17,17 55,18 52.3,19 6.806,20 42,21 44,22 36.4,23 0.996,24 4.5,29 6.444}
{0 CHEMBL108354,1 47,2 17,3 100.968,4 88.45,5 89,6 91,7 0.635,8 56.484,9 52.216,10 0.587,11 597.91,12 32,13 1.134,14 5,15 12,16 17,17 55,18 52.8,19 6.718,20 42,21 44,22 36,23 0.994,24 5.6,29 6.444}
{0 CHEMBL108468,1 47,2 17,3 102.178,4 89.778,5 90,6 92,7 0.633,8 56.938,9 52.931,10 0.588,11 613.91,12 32,13 1.135,14 5,15 12,16 17,17 56,18 52.2,19 6.821,20 43,21 45,22 35.6,23 0.998,24 5.6,29 6.921}
{0 CHEMBL109999,1 25,2 7,3 68.159,4 61.422,5 60,6 63,7 0.678,8 40.699,9 39.013,10 0.65,11 520.67,12 22,13 1.136,14 8,15 6,16 14,17 49,18 41.7,19 8.678,20 35,21 38,22 36.7,23 1.024,24 10,29 5.094}
{0 CHEMBL110419,1 30,2 6,3 72.019,4 63.876,5 64,6 66,7 0.661,8 42.284,9 40.078,10 0.626,11 458.61,12 27,13 1.125,14 3,15 18,16 21,17 48,18 46.9,19 7.166,20 34,21 36,22 42.2,23 0.998,24 6.3,29 7.161}
{0 CHEMBL110628,1 47,2 17,3 100.968,4 88.45,5 89,6 91,7 0.635,8 56.484,9 52.216,10 0.587,11 597.91,12 32,13 1.134,14 5,15 12,16 17,17 55,18 52.8,19 6.718,20 42,21 44,22 36,23 0.994,24 5.6,29 6.102}
{0 CHEMBL110753,1 17,2 4,3 51.451,4 46.945,5 46,6 50,7 0.723,8 33.256,9 31.786,10 0.691,11 427.55,12 19,13 1.118,14 3,15 20,16 23,17 46,18 37,19 9.295,20 29,21 33,22 41.3,23 1.021,24 10.9,29 5.538}
{0 CHEMBL110903,1 19,2 4,3 55.076,4 50.156,5 49,6 52,7 0.704,8 34.472,9 33.028,10 0.674,11 445.57,12 19,13 1.124,14 4,15 16,16 20,17 45,18 38.8,19 9.093,20 30,21 33,22 38.8,23 1.024,24 10.2,29 6}
{0 CHEMBL111013,1 25,2 9,3 61.321,4 54.807,5 54,6 56,7 0.662,8 35.756,9 33.608,10 0.622,11 439.62,12 18,13 1.136,14 6,15 5,16 11,17 39.5,18 46.3,19 8.141,20 29,21 31,22 33.3,23 1.015,24 9.3,29 4.192}
{0 CHEMBL111122,1 26,2 7,3 67.819,4 60.909,5 60,6 63,7 0.679,8 40.762,9 38.63,10 0.644,11 502.68,12 22,13 1.13,14 8,15 6,16 14,17 48,18 43.3,19 8.378,20 34,21 37,22 36.7,23 1.015,24 10,29 5.567}
{0 CHEMBL11391,1 26,2 7,3 72.959,4 65.967,5 64,6 66,7 0.656,8 42,9 41.636,10 0.651,11 529.56,12 27,13 1.14,14 6,15 12,16 18,17 52,18 40.6,19 8.274,20 38,21 40,22 42.2,23 1.031,24 4.7,29 5.319}
{0 CHEMBL116378,1 28,2 6,3 73.653,4 66.472,5 66,6 70,7 0.701,8 46.273,9 43.641,10 0.661,11 548.74,12 28,13 1.116,14 4,15 22,16 26,17 57,18 42.4,19 8.314,20 38,21 42,22 42.4,23 1.007,24 6.1,29 5.712}
{0 CHEMBL117156,1 20,2 2,3 53.863,4 48.534,5 48,6 50,7 0.69,8 33.125,9 31.632,10 0.659,11 396.51,12 20,13 1.122,14 4,15 17,16 21,17 42.5,18 41.7,19 8.261,20 28,21 30,22 41.7,23 1.011,24 8.3,29 7.097}
{0 CHEMBL118156,1 29,2 6,3 76.232,4 68.498,5 68,6 72,7 0.686,8 46.631,9 44.475,10 0.654,11 543.7,12 29,13 1.121,14 4,15 23,16 27,17 58.5,18 42.6,19 7.996,20 39,21 43,22 42.6,23 1.007,24 7.4,29 5.712}
{0 CHEMBL118304,1 24,2 5,3 64.112,4 57.956,5 57,6 60,7 0.676,8 38.557,9 37.115,10 0.651,11 468.58,12 23,13 1.125,14 4,15 17,16 21,17 48.5,18 42.1,19 8.221,20 33,21 36,22 40.4,23 1.017,24 7,29 5.538}
{0 CHEMBL118334,1 22,2 4,3 59.488,4 53.745,5 53,6 56,7 0.686,8 36.341,9 34.873,10 0.658,11 438.55,12 22,13 1.122,14 4,15 17,16 21,17 46.5,18 41.5,19 8.275,20 31,21 34,22 41.5,23 1.014,24 7.5,29 5.538}
{0 CHEMBL118361,1 22,2 5,3 59.408,4 53.822,5 53,6 56,7 0.698,8 36.989,9 35.06,10 0.662,11 458.61,12 21,13 1.121,14 4,15 16,16 20,17 46,18 41.5,19 8.653,20 31,21 34,22 39.6,23 1.016,24 7.5,29 6.301}
{0 CHEMBL118392,1 21,2 4,3 58.281,4 52.713,5 52,6 55,7 0.707,8 36.779,9 34.84,10 0.67,11 455.61,12 21,13 1.121,14 4,15 17,16 21,17 46.5,18 40.4,19 8.762,20 31,21 34,22 40.4,23 1.014,24 9.6,29 5.678}
{0 CHEMBL118799,1 26,2 6,3 65.109,4 58.185,5 58,6 61,7 0.679,8 39.409,9 37.212,10 0.642,11 450.61,12 24,13 1.123,14 4,15 17,16 21,17 47.5,18 44.8,19 7.769,20 32,21 35,22 41.4,23 1.003,24 6.9,29 5.796}
{0 CHEMBL118836,1 24,2 5,3 61.693,4 55.302,5 55,6 58,7 0.685,8 37.648,9 35.685,10 0.649,11 436.58,12 23,13 1.122,14 4,15 17,16 21,17 46.5,18 43.6,19 7.938,20 31,21 34,22 41.8,23 1.005,24 7.3,29 5.538}
{0 CHEMBL118906,1 25,2 3,3 62.062,4 55.025,5 56,6 60,7 0.703,8 39.392,9 36.859,10 0.658,11 403.56,12 28,13 1.108,14 1,15 27,16 28,17 49.5,18 44.6,19 7.206,20 31,21 35,22 50,23 0.983,24 5.4,29 5.538}
{0 CHEMBL118989,1 26,2 6,3 70.946,4 64.494,5 63,6 66,7 0.67,8 42.227,9 41.071,10 0.652,11 526.62,12 25,13 1.126,14 5,15 17,16 22,17 53.5,18 41.3,19 8.359,20 37,21 40,22 39.7,23 1.024,24 6.3,29 5.538}
{0 CHEMBL119249,1 24,2 4,3 63.903,4 57.629,5 57,6 60,7 0.686,8 39.102,9 37.4,10 0.656,11 464.59,12 24,13 1.121,14 4,15 18,16 22,17 49,18 42.1,19 8.151,20 33,21 36,22 42.1,23 1.011,24 7,29 5.538}
{0 CHEMBL119456,1 28,2 6,3 73.653,4 66.472,5 66,6 70,7 0.701,8 46.273,9 43.641,10 0.661,11 548.74,12 28,13 1.116,14 4,15 22,16 26,17 57,18 42.4,19 8.314,20 38,21 42,22 42.4,23 1.007,24 6.1,29 5.967}
{0 CHEMBL119773,1 19,2 4,3 55.076,4 50.156,5 49,6 52,7 0.704,8 34.472,9 33.028,10 0.674,11 445.57,12 19,13 1.124,14 4,15 16,16 20,17 45,18 38.8,19 9.093,20 30,21 33,22 38.8,23 1.024,24 10.2,29 5.721}
{0 CHEMBL119881,1 23,2 4,3 61.777,4 55.52,5 55,6 58,7 0.689,8 37.892,9 36.18,10 0.658,11 449.58,12 23,13 1.123,14 4,15 18,16 22,17 48,18 41.8,19 8.174,20 32,21 35,22 41.8,23 1.009,24 9.1,29 5.538}
{0 CHEMBL119913,1 26,2 5,3 67.318,4 60.512,5 60,6 63,7 0.681,8 40.864,9 38.927,10 0.649,11 478.62,12 25,13 1.122,14 4,15 18,16 22,17 50,18 43.3,19 7.977,20 34,21 37,22 41.7,23 1.009,24 6.7,29 5.538}
{0 CHEMBL119964,1 28,2 6,3 74.315,4 66.716,5 66,6 70,7 0.68,8 44.875,9 42.969,10 0.651,11 532.68,12 27,13 1.126,14 4,15 22,16 26,17 57,18 42.4,19 8.071,20 38,21 42,22 40.9,23 1.011,24 9.1,29 5.857}
{0 CHEMBL119966,1 19,2 4,3 56.285,4 51.484,5 50,6 53,7 0.699,8 34.926,9 33.743,10 0.675,11 461.57,12 19,13 1.126,14 4,15 16,16 20,17 46,18 38,19 9.231,20 31,21 34,22 38,23 1.03,24 10,29 5.538}
{0 CHEMBL120341,1 26,2 5,3 66.109,4 59.185,5 59,6 62,7 0.685,8 40.409,9 38.212,10 0.648,11 462.62,12 25,13 1.12,14 4,15 18,16 22,17 49,18 44.1,19 7.841,20 33,21 36,22 42.4,23 1.003,24 6.8,29 5.538}
{0 CHEMBL120384,1 21,2 4,3 58.281,4 52.713,5 52,6 55,7 0.707,8 36.779,9 34.84,10 0.67,11 455.61,12 21,13 1.121,14 4,15 17,16 21,17 46.5,18 40.4,19 8.762,20 31,21 34,22 40.4,23 1.014,24 9.6,29 5.538}
{0 CHEMBL120387,1 22,2 4,3 58.278,4 52.418,5 52,6 55,7 0.69,8 35.887,9 34.158,10 0.657,11 422.55,12 22,13 1.121,14 4,15 17,16 21,17 45.5,18 42.3,19 8.126,20 30,21 33,22 42.3,23 1.008,24 7.7,29 5.538}
{0 CHEMBL120413,1 21,2 4,3 58.281,4 52.713,5 52,6 55,7 0.707,8 36.779,9 34.84,10 0.67,11 455.61,12 21,13 1.121,14 4,15 17,16 21,17 46.5,18 40.4,19 8.762,20 31,21 34,22 40.4,23 1.014,24 9.6,29 5.538}
{0 CHEMBL120629,1 20,2 4,3 57.574,4 52.258,5 51,6 54,7 0.696,8 35.477,9 34.049,10 0.668,11 460.59,12 19,13 1.129,14 4,15 16,16 20,17 46,18 39.2,19 9.031,20 31,21 34,22 37.3,23 1.025,24 11.8,29 5.77}
{0 CHEMBL120749,1 22,2 5,3 59.697,4 54.073,5 53,6 56,7 0.675,8 35.796,9 34.588,10 0.653,11 442.54,12 21,13 1.126,14 4,15 16,16 20,17 46,18 41.5,19 8.35,20 31,21 34,22 39.6,23 1.02,24 7.5,29 5.538}
{0 CHEMBL120765,1 20,2 3,3 54.863,4 49.534,5 49,6 52,7 0.696,8 34.125,9 32.632,10 0.666,11 408.52,12 21,13 1.12,14 4,15 17,16 21,17 44.5,18 40.8,19 8.337,20 29,21 32,22 42.9,23 1.011,24 8.2,29 5.538}
{0 CHEMBL121032,1 26,2 6,3 65.109,4 58.185,5 58,6 61,7 0.679,8 39.409,9 37.212,10 0.642,11 450.61,12 24,13 1.123,14 4,15 17,16 21,17 47.5,18 44.8,19 7.769,20 32,21 35,22 41.4,23 1.003,24 6.9,29 5.538}
{0 CHEMBL121575,1 23,2 4,3 61.777,4 55.52,5 55,6 58,7 0.689,8 37.892,9 36.18,10 0.658,11 449.58,12 23,13 1.123,14 4,15 18,16 22,17 48,18 41.8,19 8.174,20 32,21 35,22 41.8,23 1.009,24 9.1,29 5.538}
{0 CHEMBL133027,1 22,2 3,3 60.278,4 54.393,5 53,6 54,7 0.661,8 35.046,9 34.104,10 0.643,11 446.54,12 19,13 1.137,14 6,15 12,16 18,17 44,18 41.5,19 8.425,20 31,21 32,22 35.8,23 1.026,24 11.3,29 4.699}
{0 CHEMBL135041,1 26,2 6,3 64.527,4 57.84,5 57,6 58,7 0.655,8 37.318,9 35.641,10 0.625,11 446.58,12 21,13 1.132,14 5,15 12,16 17,17 43,18 45.6,19 7.835,20 31,21 32,22 36.8,23 1.015,24 7,29 4.77}
{0 CHEMBL135198,1 23,2 5,3 62.195,4 56.174,5 55,6 56,7 0.669,8 36.801,9 35.609,10 0.647,11 457.56,12 21,13 1.131,14 5,15 12,16 18,17 46,18 41.8,19 8.319,20 32,21 33,22 38.2,23 1.021,24 9.1,28 1,29 4.699}
{0 CHEMBL135815,1 26,2 5,3 67.109,4 60.16,5 59,6 60,7 0.654,8 38.568,9 37.157,10 0.63,11 474.6,12 21,13 1.137,14 6,15 12,16 18,17 46,18 44.1,19 8.044,20 33,21 34,22 35.6,23 1.02,24 10.2,29 5.377}
{0 CHEMBL135998,1 23,2 5,3 62.195,4 56.174,5 55,6 56,7 0.669,8 36.801,9 35.609,10 0.647,11 457.56,12 21,13 1.131,14 5,15 12,16 18,17 46,18 41.8,19 8.319,20 32,21 33,22 38.2,23 1.021,24 9.1,28 1,29 4.854}
{0 CHEMBL137311,1 25,2 5,3 65.531,4 59.134,5 58,6 59,7 0.676,8 39.21,9 37.323,10 0.644,11 491.65,12 21,13 1.13,14 6,15 12,16 18,17 46,18 43.1,19 8.477,20 33,21 34,22 36.2,23 1.02,24 8.6,29 4.721}
{0 CHEMBL137780,1 26,2 5,3 67.109,4 60.16,5 59,6 60,7 0.654,8 38.568,9 37.157,10 0.63,11 474.6,12 21,13 1.137,14 6,15 12,16 18,17 46,18 44.1,19 8.044,20 33,21 34,22 35.6,23 1.02,24 10.2,29 5.444}
{0 CHEMBL138441,1 30,2 10,3 70.939,4 62.927,5 62,6 63,7 0.631,8 39.091,9 37.211,10 0.6,11 466.63,12 20,13 1.144,14 6,15 6,16 12,17 42,18 48.4,19 7.526,20 32,21 33,22 32.3,23 1.015,24 9.7,29 5.81}
{0 CHEMBL140545,1 33,2 15,3 71.271,4 62.592,5 62,6 63,7 0.607,8 37.608,9 35.243,10 0.568,11 431.63,12 18,13 1.15,14 5,16 5,17 35,18 53.2,19 6.962,20 29,21 30,22 29,23 1.01,24 8.1,29 5.602}
{0 CHEMBL141043,1 31,2 12,3 70.727,4 62.305,5 62,6 64,7 0.625,8 38.745,9 36.815,10 0.594,11 429.58,12 22,13 1.141,14 4,15 6,16 10,17 40,18 50,19 6.929,20 31,21 33,22 35.5,23 1.005,24 8.1,29 5.602}
{0 CHEMBL141424,1 34,2 13,3 78.77,4 69.694,5 69,6 71,7 0.632,8 43.614,9 41.265,10 0.598,11 506.7,12 23,13 1.142,14 6,15 6,16 12,17 46,18 49.3,19 7.343,20 35,21 37,22 33.3,23 1.01,24 8.7,29 4.188}
{0 CHEMBL141676,1 42,2 18,3 89.72,4 78.479,5 78,6 78,7 0.596,8 46.466,9 43.9,10 0.563,11 510.72,12 24,13 1.15,14 6,16 6,17 42,18 53.8,19 6.548,20 36,21 36,22 30.8,23 1.006,24 7.7,29 8.921}
{0 CHEMBL19365,1 28,2 7,3 68.604,4 60.992,5 61,6 64,7 0.664,8 40.523,9 38.552,10 0.632,11 444.58,12 26,13 1.125,14 3,15 17,16 20,17 47.5,18 45.9,19 7.288,20 33,21 36,22 42.6,23 1,24 6.6,29 6.208}
{0 CHEMBL20936,1 8,3 19.242,4 16.854,5 17,6 17,7 0.664,8 11.296,9 10.623,10 0.625,11 120.17,12 7,13 1.132,14 1,15 6,16 7,17 13,18 47.1,19 7.069,20 9,21 9,22 41.2,23 0.991,24 11.8,29 -1.83}
{0 CHEMBL262805,1 32,2 8,3 79.145,4 70.483,5 70,6 73,7 0.663,8 46.398,9 44.023,10 0.629,11 536.72,12 27,13 1.131,14 5,15 17,16 22,17 54.5,18 45.7,19 7.667,20 38,21 41,22 38.6,23 1.007,24 8.6,29 6.77}
{0 CHEMBL263924,1 31,2 11,3 74.856,4 66.709,5 66,6 69,7 0.649,8 42.847,9 40.716,10 0.617,11 501.67,12 24,13 1.134,14 5,15 11,16 16,17 48.5,18 47,19 7.601,20 35,21 38,22 36.4,23 1.011,24 7.6,29 5.991}
{0 CHEMBL317199,1 41,2 15,3 94.062,4 83.53,5 83,6 86,7 0.648,8 53.756,9 50.252,10 0.605,11 619.89,12 29,13 1.133,14 6,15 12,16 18,17 57,18 49.4,19 7.469,20 42,21 45,22 34.9,23 1.006,24 6,29 6.119}
{0 CHEMBL317271,1 37,2 12,3 87.892,4 78.032,5 78,6 82,7 0.663,8 51.677,9 48.582,10 0.623,11 575.8,12 31,13 1.127,14 5,15 17,16 22,17 58.5,18 47.4,19 7.382,20 41,21 45,22 39.7,23 1,24 6.4,29 7.143}
{0 CHEMBL318175,1 31,2 6,3 81.776,4 73.785,5 73,6 77,7 0.692,8 50.495,9 47.904,10 0.656,11 605.8,12 30,13 1.12,14 6,15 23,16 29,17 63.5,18 42.5,19 8.299,20 42,21 46,22 41.1,23 1.011,24 6.8,29 6.481}
{0 CHEMBL318177,1 39,2 17,3 88.646,4 78.647,5 78,6 81,7 0.641,8 49.995,9 46.726,10 0.599,11 581.84,12 26,13 1.136,14 7,15 6,16 13,17 52,18 50,19 7.459,20 39,21 42,22 33.3,23 1.008,24 6.4,29 6.508}
{0 CHEMBL318304,1 45,2 16,3 98.683,4 86.97,5 87,6 89,7 0.642,8 55.824,9 51.591,10 0.593,11 619.94,12 30,13 1.134,14 6,15 12,16 18,17 56,18 51.7,19 7.126,20 42,21 44,22 34.5,23 1,24 5.7,29 6.109}
{0 CHEMBL318352,1 32,2 8,3 79.145,4 70.483,5 70,6 73,7 0.663,8 46.398,9 44.023,10 0.629,11 536.72,12 27,13 1.131,14 5,15 17,16 22,17 54.5,18 45.7,19 7.667,20 38,21 41,22 38.6,23 1.007,24 8.6,29 5.071}
{0 CHEMBL318773,1 46,2 17,3 99.679,4 87.676,5 88,6 90,7 0.636,8 55.932,9 51.909,10 0.59,11 598.89,12 32,13 1.133,14 5,15 12,16 17,17 55,18 52.3,19 6.806,20 42,21 44,22 36.4,23 0.996,24 4.5,29 6.569}
{0 CHEMBL319035,1 39,2 17,3 88.646,4 78.647,5 78,6 81,7 0.641,8 49.995,9 46.726,10 0.599,11 581.84,12 26,13 1.136,14 7,15 6,16 13,17 52,18 50,19 7.459,20 39,21 42,22 33.3,23 1.008,24 6.4,29 6.658}
{0 CHEMBL319227,1 29,2 10,3 67.312,4 59.421,5 59,6 60,7 0.627,8 36.983,9 35.288,10 0.598,11 415.55,12 21,13 1.141,14 5,15 6,16 11,17 39,18 49.2,19 7.043,20 30,21 31,22 35.6,23 1.007,24 8.5,29 7.585}
{0 CHEMBL319396,1 30,2 10,3 71.019,4 62.851,5 62,6 63,7 0.62,8 38.443,9 37.024,10 0.597,11 446.57,12 21,13 1.145,14 5,15 6,16 11,17 41,18 48.4,19 7.203,20 32,21 33,22 33.9,23 1.014,24 9.7,29 6.658}
{0 CHEMBL319868,1 27,2 6,3 67.607,4 60.287,5 60,6 63,7 0.674,8 40.415,9 38.233,10 0.637,11 465.63,12 24,13 1.127,14 4,15 17,16 21,17 48.5,18 45,19 7.76,20 33,21 36,22 40,23 1.005,24 8.3,29 6.658}
{0 CHEMBL320257,1 44,2 16,3 96.264,4 84.792,5 85,6 87,7 0.637,8 54.171,9 50.383,10 0.593,11 584.86,12 31,13 1.133,14 5,15 12,16 17,17 54,18 51.8,19 6.881,20 41,21 43,22 36.5,23 0.998,24 4.7,29 5.62}
{0 CHEMBL320285,1 48,2 18,3 99.676,4 86.905,5 88,6 90,7 0.634,8 55.785,9 51.007,10 0.58,11 568.91,12 32,13 1.133,14 4,15 12,16 16,17 52,18 54.5,19 6.465,20 40,21 42,22 36.4,23 0.988,24 4.5,29 6.081}
{0 CHEMBL320393,1 29,2 7,3 74.441,4 66.825,5 66,6 69,7 0.668,8 44.085,9 42.19,10 0.639,11 523.67,12 26,13 1.128,14 5,15 17,16 22,17 53.5,18 43.9,19 7.934,20 37,21 40,22 39.4,23 1.013,24 7.6,29 7.699}
{0 CHEMBL320512,1 29,2 7,3 71.022,4 63.171,5 63,6 66,7 0.669,8 42.176,9 39.76,10 0.631,11 479.66,12 25,13 1.127,14 4,15 17,16 21,17 49.5,18 46,19 7.614,20 34,21 37,22 39.7,23 1.003,24 7.9,29 4.137}
{0 CHEMBL320937,1 33,2 6,3 88.191,4 79.669,5 79,6 84,7 0.699,8 55.256,9 52.43,10 0.664,11 655.86,12 34,13 1.116,14 6,15 28,16 34,17 71,18 41.8,19 8.302,20 46,21 51,22 43,23 1.008,24 6.3,29 6.398}
{0 CHEMBL321162,1 29,2 7,3 74.361,4 66.902,5 66,6 69,7 0.678,8 44.733,9 42.377,10 0.642,11 543.73,12 25,13 1.127,14 6,15 17,16 23,17 54.5,18 43.9,19 8.238,20 37,21 40,22 37.9,23 1.014,24 7.6,29 6.495}
{0 CHEMBL322165,1 27,2 6,3 69.816,4 62.614,5 62,6 65,7 0.675,8 41.87,9 39.948,10 0.644,11 493.64,12 25,13 1.126,14 5,15 17,16 22,17 51.5,18 43.5,19 7.962,20 35,21 38,22 40.3,23 1.01,24 8.1,29 7.137}
{0 CHEMBL322404,1 35,2 10,3 84.607,4 75.552,5 75,6 78,7 0.667,8 50.017,9 46.957,10 0.626,11 585.82,12 28,13 1.128,14 6,15 17,16 23,17 57.5,18 46.7,19 7.811,20 40,21 43,22 37.3,23 1.007,24 6.7,29 6.745}
{0 CHEMBL322437,1 31,2 8,3 77.856,4 69.709,5 69,6 72,7 0.664,8 45.847,9 43.716,10 0.634,11 537.7,12 27,13 1.128,14 5,15 17,16 22,17 54.5,18 44.9,19 7.793,20 38,21 41,22 39.1,23 1.01,24 7.2,29 7.658}
{0 CHEMBL322542,1 27,2 10,3 64.736,4 57.691,5 57,6 59,7 0.658,8 37.517,9 35.135,10 0.616,11 453.65,12 19,13 1.136,14 6,15 5,16 11,17 40.5,18 47.4,19 7.959,20 30,21 32,22 33.3,23 1.012,24 8.8,29 4.299}
{0 CHEMBL322622,1 31,2 6,3 81.856,4 73.709,5 73,6 77,7 0.683,8 49.847,9 47.716,10 0.654,11 585.74,12 31,13 1.121,14 5,15 23,16 28,17 62.5,18 42.5,19 8.024,20 42,21 46,22 42.5,23 1.01,24 6.8,29 7.553}
{0 CHEMBL322830,1 45,2 16,3 97.553,4 85.567,5 86,6 88,7 0.636,8 54.722,9 50.689,10 0.589,11 583.88,12 31,13 1.134,14 5,15 12,16 17,17 54,18 52.3,19 6.789,20 41,21 43,22 36,23 0.995,24 5.8,29 6.658}
{0 CHEMBL322901,1 29,2 7,3 73.232,4 65.498,5 65,6 68,7 0.671,8 43.631,9 41.475,10 0.638,11 507.67,12 26,13 1.127,14 5,15 17,16 22,17 52.5,18 44.6,19 7.81,20 36,21 39,22 40,23 1.008,24 7.7,29 7.357}
{0 CHEMBL323101,1 29,2 7,3 74.361,4 66.902,5 66,6 69,7 0.678,8 44.733,9 42.377,10 0.642,11 543.73,12 25,13 1.127,14 6,15 17,16 23,17 54.5,18 43.9,19 8.238,20 37,21 40,22 37.9,23 1.014,24 7.6,29 4.886}
{0 CHEMBL323304,1 31,2 8,3 77.776,4 69.785,5 69,6 72,7 0.674,8 46.495,9 43.904,10 0.636,11 557.76,12 26,13 1.127,14 6,15 17,16 23,17 55.5,18 44.9,19 8.083,20 38,21 41,22 37.7,23 1.011,24 7.2,29 6.721}
{0 CHEMBL323452,1 44,2 16,3 96.264,4 84.792,5 85,6 87,7 0.637,8 54.171,9 50.383,10 0.593,11 584.86,12 31,13 1.133,14 5,15 12,16 17,17 54,18 51.8,19 6.881,20 41,21 43,22 36.5,23 0.998,24 4.7,29 5.194}
{0 CHEMBL324188,1 44,2 16,3 92.845,4 81.138,5 82,6 84,7 0.637,8 52.262,9 47.953,10 0.585,11 540.85,12 30,13 1.132,14 4,15 12,16 16,17 50,18 53.7,19 6.596,20 38,21 40,22 36.6,23 0.989,24 4.9,29 5.886}
{0 CHEMBL324337,1 26,2 6,3 69.737,4 63.167,5 62,6 65,7 0.674,8 41.773,9 40.356,10 0.651,11 510.62,12 25,13 1.125,14 5,15 17,16 22,17 52.5,18 41.9,19 8.236,20 36,21 39,22 40.3,23 1.019,24 6.5,29 5.538}
{0 CHEMBL324569,1 28,2 7,3 69.733,4 62.396,5 62,6 65,7 0.671,8 41.625,9 39.453,10 0.636,11 480.64,12 25,13 1.125,14 4,15 17,16 21,17 49.5,18 45.2,19 7.752,20 34,21 37,22 40.3,23 1.006,24 6.5,29 5.854}
{0 CHEMBL324673,1 19,2 4,3 55.866,4 50.829,5 50,6 54,7 0.72,8 36.017,9 34.313,10 0.686,11 453.59,12 21,13 1.117,14 3,15 21,16 24,17 48.5,18 38,19 9.072,20 31,21 35,22 42,23 1.017,24 10,29 5.538}
{0 CHEMBL324793,1 20,2 4,3 58.621,4 53.225,5 52,6 55,7 0.706,8 36.716,9 35.223,10 0.677,11 473.6,12 21,13 1.127,14 4,15 17,16 21,17 47.5,18 38.5,19 9.108,20 32,21 35,22 40.4,23 1.024,24 9.6,29 5.538}
{0 CHEMBL325166,1 34,2 12,3 82.979,4 74.021,5 73,6 76,7 0.645,8 47.068,9 44.979,10 0.616,11 558.73,12 26,13 1.137,14 6,15 11,16 17,17 53.5,18 46.6,19 7.654,20 39,21 42,22 35.6,23 1.014,24 8.2,29 5.721}
{0 CHEMBL325529,1 29,2 7,3 74.441,4 66.825,5 66,6 69,7 0.668,8 44.085,9 42.19,10 0.639,11 523.67,12 26,13 1.128,14 5,15 17,16 22,17 53.5,18 43.9,19 7.934,20 37,21 40,22 39.4,23 1.013,24 7.6,29 5.699}
{0 CHEMBL326013,1 37,2 11,3 86.892,4 77.032,5 77,6 80,7 0.658,8 50.677,9 47.582,10 0.618,11 563.79,12 30,13 1.128,14 5,15 17,16 22,17 56.5,18 48.1,19 7.322,20 40,21 43,22 39,23 1,24 6.5,29 7.194}
{0 CHEMBL326046,1 24,2 5,3 59.484,4 52.974,5 53,6 56,7 0.683,8 36.193,9 33.97,10 0.641,11 408.57,12 22,13 1.122,14 3,15 17,16 20,17 43.5,18 45.3,19 7.709,20 29,21 32,22 41.5,23 1,24 7.5,29 5.538}
{0 CHEMBL326316,1 26,2 5,3 66.109,4 59.185,5 59,6 62,7 0.685,8 40.409,9 38.212,10 0.648,11 462.62,12 25,13 1.12,14 4,15 18,16 22,17 49,18 44.1,19 7.841,20 33,21 36,22 42.4,23 1.003,24 6.8,29 5.538}
{0 CHEMBL326704,1 26,2 5,3 66.399,4 59.345,5 59,6 62,7 0.679,8 40.034,9 37.97,10 0.644,11 464.62,12 24,13 1.125,14 4,15 18,16 22,17 49,18 44.1,19 7.875,20 33,21 36,22 40.7,23 1.006,24 8.5,29 5.538}
{0 CHEMBL326866,1 45,2 16,3 98.763,4 86.894,5 87,6 89,7 0.634,8 55.177,9 51.404,10 0.591,11 599.88,12 31,13 1.135,14 5,15 12,16 17,17 55,18 51.7,19 6.895,20 42,21 44,22 35.6,23 0.999,24 5.7,29 6.959}
{0 CHEMBL326959,1 24,2 5,3 63.275,4 56.622,5 56,6 59,7 0.677,8 37.898,9 36.201,10 0.646,11 452.59,12 22,13 1.13,14 4,15 17,16 21,17 47.5,18 42.9,19 8.082,20 32,21 35,22 39.3,23 1.011,24 10.7,29 5.538}
{0 CHEMBL327600,1 24,2 5,3 62.903,4 56.629,5 56,6 59,7 0.68,8 38.102,9 36.4,10 0.65,11 452.58,12 23,13 1.123,14 4,15 17,16 21,17 47.5,18 42.9,19 8.082,20 32,21 35,22 41.1,23 1.011,24 7.1,29 6.07}
{0 CHEMBL330960,1 23,2 4,3 61.777,4 55.52,5 55,6 58,7 0.689,8 37.892,9 36.18,10 0.658,11 449.58,12 23,13 1.123,14 4,15 18,16 22,17 48,18 41.8,19 8.174,20 32,21 35,22 41.8,23 1.009,24 9.1,29 5.538}
{0 CHEMBL331561,1 29,2 7,3 74.441,4 66.825,5 66,6 69,7 0.668,8 44.085,9 42.19,10 0.639,11 523.67,12 26,13 1.128,14 5,15 17,16 22,17 53.5,18 43.9,19 7.934,20 37,21 40,22 39.4,23 1.013,24 7.6,29 5.538}
{0 CHEMBL331648,1 22,2 4,3 58.278,4 52.418,5 52,6 55,7 0.69,8 35.887,9 34.158,10 0.657,11 422.55,12 22,13 1.121,14 4,15 17,16 21,17 45.5,18 42.3,19 8.126,20 30,21 33,22 42.3,23 1.008,24 7.7,29 5.538}
{0 CHEMBL331666,1 22,2 5,3 61.989,4 56.142,5 55,6 58,7 0.695,8 38.239,9 36.576,10 0.665,11 486.63,12 21,13 1.127,14 4,15 17,16 21,17 48.5,18 40,19 8.848,20 33,21 36,22 38.2,23 1.021,24 10.9,29 5.538}
{0 CHEMBL331686,1 21,2 4,3 58.222,4 52.742,5 52,6 55,7 0.707,8 36.744,9 34.986,10 0.673,11 456.99,12 22,13 1.12,14 4,15 17,16 21,17 46.5,18 40.4,19 8.788,20 31,21 34,22 42.3,23 1.014,24 7.7,27 1,29 5.538}
{0 CHEMBL331896,1 25,2 5,3 64.192,4 57.403,5 57,6 60,7 0.678,8 38.654,9 36.706,10 0.644,11 451.6,12 23,13 1.126,14 4,15 17,16 21,17 47.5,18 43.9,19 7.923,20 32,21 35,22 40.4,23 1.007,24 8.8,29 5.824}
{0 CHEMBL331939,1 22,2 5,3 59.408,4 53.822,5 53,6 56,7 0.698,8 36.989,9 35.06,10 0.662,11 458.61,12 21,13 1.121,14 4,15 16,16 20,17 46,18 41.5,19 8.653,20 31,21 34,22 39.6,23 1.016,24 7.5,29 6.027}
{0 CHEMBL331943,1 24,2 6,3 62.823,4 56.705,5 56,6 59,7 0.692,8 38.75,9 36.587,10 0.653,11 472.64,12 22,13 1.122,14 4,15 16,16 20,17 47,18 42.9,19 8.44,20 32,21 35,22 39.3,23 1.013,24 7.1,29 6.276}
{0 CHEMBL331955,1 21,2 4,3 58.222,4 52.742,5 52,6 55,7 0.707,8 36.744,9 34.986,10 0.673,11 456.99,12 22,13 1.12,14 4,15 17,16 21,17 46.5,18 40.4,19 8.788,20 31,21 34,22 42.3,23 1.014,24 7.7,27 1,29 5.699}
{0 CHEMBL332121,1 28,2 7,3 74.361,4 67.378,5 66,6 69,7 0.666,8 43.989,9 42.598,10 0.645,11 540.65,12 26,13 1.127,14 5,15 17,16 22,17 54.5,18 42.4,19 8.192,20 38,21 41,22 39.4,23 1.021,24 6.1,29 7.921}
{0 CHEMBL332160,1 26,2 5,3 67.318,4 60.512,5 60,6 63,7 0.681,8 40.864,9 38.927,10 0.649,11 478.62,12 25,13 1.122,14 4,15 18,16 22,17 50,18 43.3,19 7.977,20 34,21 37,22 41.7,23 1.009,24 6.7,29 5.538}
{0 CHEMBL332256,1 25,2 5,3 65.401,4 58.731,5 58,6 61,7 0.674,8 39.108,9 37.421,10 0.645,11 467.6,12 23,13 1.128,14 4,15 17,16 21,17 48.5,18 43.1,19 8.062,20 33,21 36,22 39.7,23 1.013,24 8.6,29 6.524}
{0 CHEMBL332619,1 24,2 5,3 61.693,4 55.302,5 55,6 58,7 0.685,8 37.648,9 35.685,10 0.649,11 436.58,12 23,13 1.122,14 4,15 17,16 21,17 46.5,18 43.6,19 7.938,20 31,21 34,22 41.8,23 1.005,24 7.3,29 5.959}
{0 CHEMBL332650,1 22,2 4,3 60.78,4 54.814,5 54,6 57,7 0.7,8 37.784,9 35.861,10 0.664,11 470.63,12 21,13 1.126,14 4,15 17,16 21,17 47.5,18 40.7,19 8.715,20 32,21 35,22 38.9,23 1.015,24 11.1,29 5.824}
{0 CHEMBL333548,1 24,2 4,3 62.693,4 56.302,5 56,6 59,7 0.69,8 38.648,9 36.685,10 0.655,11 448.59,12 24,13 1.12,14 4,15 18,16 22,17 48,18 42.9,19 8.011,20 32,21 35,22 42.9,23 1.005,24 7.1,29 5.538}
{0 CHEMBL333639,1 23,2 5,3 61.986,4 55.847,5 55,6 58,7 0.679,8 37.347,9 35.894,10 0.653,11 453.57,12 22,13 1.127,14 4,15 17,16 21,17 47.5,18 41.8,19 8.247,20 32,21 35,22 40,23 1.015,24 9.1,29 5.547}
{0 CHEMBL333678,1 26,2 6,3 66.318,4 59.512,5 59,6 62,7 0.676,8 39.864,9 37.927,10 0.643,11 466.61,12 24,13 1.124,14 4,15 17,16 21,17 48.5,18 44.1,19 7.909,20 33,21 36,22 40.7,23 1.009,24 6.8,29 6.154}
{0 CHEMBL333891,1 24,2 5,3 62.903,4 56.629,5 56,6 59,7 0.68,8 38.102,9 36.4,10 0.65,11 452.58,12 23,13 1.123,14 4,15 17,16 21,17 47.5,18 42.9,19 8.082,20 32,21 35,22 41.1,23 1.011,24 7.1,29 5.638}
{0 CHEMBL333958,1 24,2 4,3 62.693,4 56.302,5 56,6 59,7 0.69,8 38.648,9 36.685,10 0.655,11 448.59,12 24,13 1.12,14 4,15 18,16 22,17 48,18 42.9,19 8.011,20 32,21 35,22 42.9,23 1.005,24 7.1,29 5.538}
{0 CHEMBL334454,1 33,2 13,3 75.271,4 66.592,5 66,6 68,7 0.63,8 41.608,9 39.243,10 0.595,11 479.67,12 22,13 1.14,14 5,15 6,16 11,17 43,18 50,19 7.268,20 33,21 35,22 33.3,23 1.009,24 7.6,29 6.533}
{0 CHEMBL336844,1 25,2 5,3 65.531,4 59.134,5 58,6 59,7 0.676,8 39.21,9 37.323,10 0.644,11 491.65,12 21,13 1.13,14 6,15 12,16 18,17 46,18 43.1,19 8.477,20 33,21 34,22 36.2,23 1.02,24 8.6,29 4.886}
{0 CHEMBL340336,1 30,2 6,3 77.148,4 69.28,5 69,6 73,7 0.687,8 47.387,9 44.98,10 0.652,11 542.71,12 30,13 1.118,14 4,15 23,16 27,17 58.5,18 43.5,19 7.865,20 39,21 43,22 43.5,23 1.004,24 5.8,29 5.745}
{0 CHEMBL341933,1 22,2 3,3 60.278,4 54.393,5 53,6 54,7 0.661,8 35.046,9 34.104,10 0.643,11 446.54,12 19,13 1.137,14 6,15 12,16 18,17 44,18 41.5,19 8.425,20 31,21 32,22 35.8,23 1.026,24 11.3,29 4.745}
{0 CHEMBL342604,1 34,2 13,3 78.77,4 69.694,5 69,6 71,7 0.632,8 43.614,9 41.265,10 0.598,11 506.7,12 23,13 1.142,14 6,15 6,16 12,17 46,18 49.3,19 7.343,20 35,21 37,22 33.3,23 1.01,24 8.7,29 4.217}
{0 CHEMBL342838,1 46,2 21,3 97.55,4 85.247,5 85,6 86,7 0.6,8 50.989,9 47.953,10 0.564,11 550.79,12 27,13 1.148,14 6,16 6,17 46,18 54.1,19 6.48,20 39,21 40,22 31.8,23 1.003,24 7.1,29 6.947}
{0 CHEMBL342914,1 36,2 14,3 82.185,4 72.578,5 72,6 74,7 0.63,8 45.375,9 42.791,10 0.594,11 520.73,12 24,13 1.141,14 6,15 6,16 12,17 47,18 50,19 7.232,20 36,21 38,22 33.3,23 1.008,24 8.3,29 4.58}
{0 CHEMBL344204,1 32,2 11,3 74.354,4 65.811,5 65,6 66,7 0.629,8 40.853,9 38.738,10 0.596,11 480.66,12 21,13 1.144,14 6,15 6,16 12,17 43,18 49.2,19 7.395,20 33,21 34,22 32.3,23 1.012,24 9.2,29 6.483}
{0 CHEMBL38512,1 21,2 6,3 53.781,4 47.891,5 47,6 48,7 0.656,8 30.841,9 29.512,10 0.628,11 425.33,12 16,13 1.144,14 4,15 6,16 10,17 34,18 44.7,19 9.05,20 26,21 27,22 34,23 1.019,24 12.8,26 1,29 4.699}
{0 CHEMBL409260,1 26,2 6,3 66.318,4 59.512,5 59,6 62,7 0.676,8 39.864,9 37.927,10 0.643,11 466.61,12 24,13 1.124,14 4,15 17,16 21,17 48.5,18 44.1,19 7.909,20 33,21 36,22 40.7,23 1.009,24 6.8,29 5.538}
{0 CHEMBL411506,1 23,2 7,3 53.777,4 47.52,5 47,6 48,7 0.636,8 29.892,9 28.18,10 0.6,11 353.5,12 15,13 1.144,14 4,15 6,16 10,17 32,18 48.9,19 7.521,20 24,21 25,22 31.9,23 1.011,24 10.6,29 4.538}
{0 CHEMBL419049,1 27,2 6,3 71.026,4 63.942,5 63,6 66,7 0.672,8 42.324,9 40.663,10 0.645,11 509.64,12 25,13 1.127,14 5,15 17,16 22,17 52.5,18 42.9,19 8.09,20 36,21 39,22 39.7,23 1.015,24 7.9,29 6}
{0 CHEMBL419227,1 24,2 5,3 62.903,4 56.629,5 56,6 59,7 0.68,8 38.102,9 36.4,10 0.65,11 452.58,12 23,13 1.123,14 4,15 17,16 21,17 47.5,18 42.9,19 8.082,20 32,21 35,22 41.1,23 1.011,24 7.1,29 5.538}
{0 CHEMBL420476,1 27,2 6,3 69.816,4 62.614,5 62,6 65,7 0.675,8 41.87,9 39.948,10 0.644,11 493.64,12 25,13 1.126,14 5,15 17,16 22,17 51.5,18 43.5,19 7.962,20 35,21 38,22 40.3,23 1.01,24 8.1,29 6.658}
{0 CHEMBL420546,1 21,2 4,3 59.491,4 54.04,5 53,6 56,7 0.703,8 37.233,9 35.555,10 0.671,11 471.61,12 21,13 1.122,14 4,15 17,16 21,17 47.5,18 39.6,19 8.898,20 32,21 35,22 39.6,23 1.02,24 9.4,29 5.538}
{0 CHEMBL421411,1 35,2 11,3 81.607,4 72.552,5 72,6 74,7 0.653,8 47.017,9 43.957,10 0.611,11 549.79,12 25,13 1.133,14 6,15 12,16 18,17 51,18 48.6,19 7.636,20 37,21 39,22 34.7,23 1.008,24 6.9,29 6.796}
{0 CHEMBL421760,1 29,2 11,3 68.441,4 60.825,5 60,6 62,7 0.635,8 38.085,9 36.19,10 0.603,11 451.61,12 20,13 1.141,14 5,15 6,16 11,17 41,18 48.3,19 7.527,20 31,21 33,22 33.3,23 1.014,24 8.3,29 6.269}
{0 CHEMBL423699,1 24,2 5,3 61.112,4 54.956,5 54,6 55,7 0.658,8 35.557,9 34.115,10 0.632,11 432.55,12 20,13 1.132,14 5,15 12,16 17,17 42,18 44.4,19 8.01,20 30,21 31,22 37,23 1.018,24 7.4,29 5.252}
{0 CHEMBL431666,1 27,2 6,3 68.816,4 61.614,5 61,6 64,7 0.67,8 40.87,9 38.948,10 0.638,11 481.63,12 24,13 1.128,14 4,15 17,16 21,17 49.5,18 44.3,19 7.896,20 34,21 37,22 39.3,23 1.01,24 8.2,29 6.724}
{0 CHEMBL433644,1 25,2 5,3 65.401,4 58.731,5 58,6 61,7 0.674,8 39.108,9 37.421,10 0.645,11 467.6,12 23,13 1.128,14 4,15 17,16 21,17 48.5,18 43.1,19 8.062,20 33,21 36,22 39.7,23 1.013,24 8.6,29 5.538}
{0 CHEMBL434219,1 23,2 4,3 62.986,4 56.847,5 56,6 59,7 0.685,8 38.347,9 36.894,10 0.659,11 465.58,12 23,13 1.125,14 5,15 18,16 23,17 50,18 41.1,19 8.314,20 33,21 36,22 41.1,23 1.015,24 8.9,29 5.538}
{0 CHEMBL436563,1 22,2 5,3 59.697,4 54.073,5 53,6 56,7 0.675,8 35.796,9 34.588,10 0.653,11 442.54,12 21,13 1.126,14 4,15 16,16 20,17 46,18 41.5,19 8.35,20 31,21 34,22 39.6,23 1.02,24 7.5,29 5.538}
{0 CHEMBL448420,1 40,2 16,3 85.806,4 75.018,5 75,6 77,7 0.619,8 46.444,9 43.13,10 0.575,11 508.77,12 24,13 1.144,14 4,15 6,16 10,17 44,18 53.3,19 6.784,20 35,21 37,22 32,23 1,24 8,29 5.149}
{0 CHEMBL450936,1 33,2 9,3 80.062,4 71.265,5 71,6 74,7 0.664,8 47.154,9 44.528,10 0.627,11 535.73,12 28,13 1.128,14 5,15 17,16 22,17 54.5,18 46.5,19 7.545,20 38,21 41,22 39.4,23 1.004,24 7,29 7.31}
{0 CHEMBL51173,1 31,2 8,3 76.647,4 68.381,5 68,6 71,7 0.668,8 45.392,9 43.002,10 0.632,11 521.7,12 27,13 1.127,14 5,15 17,16 22,17 53.5,18 45.6,19 7.672,20 37,21 40,22 39.7,23 1.006,24 7.4,29 6.161}
{0 CHEMBL93681,1 23,2 4,3 60.777,4 54.52,5 54,6 57,7 0.683,8 36.892,9 35.18,10 0.651,11 437.57,12 22,13 1.125,14 4,15 17,16 21,17 46.5,18 42.6,19 8.103,20 31,21 34,22 40.7,23 1.01,24 9.3,29 5.886}
{0 CHEMBL93796,1 22,2 4,3 58.278,4 52.418,5 52,6 55,7 0.69,8 35.887,9 34.158,10 0.657,11 422.55,12 22,13 1.121,14 4,15 17,16 21,17 45.5,18 42.3,19 8.126,20 30,21 33,22 42.3,23 1.008,24 7.7,29 5.538}
{0 CHEMBL93854,1 24,2 5,3 64.112,4 57.956,5 57,6 60,7 0.676,8 38.557,9 37.115,10 0.651,11 468.58,12 23,13 1.125,14 4,15 17,16 21,17 48.5,18 42.1,19 8.221,20 33,21 36,22 40.4,23 1.017,24 7,29 6.516}
{0 CHEMBL97597,1 30,2 8,3 71.939,4 63.952,5 64,6 67,7 0.671,8 42.932,9 40.265,10 0.629,11 478.67,12 26,13 1.124,14 4,15 17,16 21,17 49.5,18 46.9,19 7.479,20 34,21 37,22 40.6,23 0.999,24 6.3,29 6.854}
