{
  "data_features": {
    "feature": [
      {
        "data_type": "nominal",
        "index": "0",
        "is_ignore": "false",
        "is_row_identifier": "true",
        "is_target": "false",
        "name": "molecule_id",
        "nominal_value": [
          "CHEMBL100573",
          "CHEMBL100697",
          "CHEMBL100822",
          "CHEMBL100987",
          "CHEMBL100996",
          "CHEMBL101016",
          "CHEMBL101096",
          "CHEMBL101259",
          "CHEMBL101309",
          "CHEMBL101515",
          "CHEMBL101989",
          "CHEMBL101993",
          "CHEMBL102045",
          "CHEMBL103",
          "CHEMBL109245",
          "CHEMBL109666",
          "CHEMBL110473",
          "CHEMBL111830",
          "CHEMBL111894",
          "CHEMBL111959",
          "CHEMBL111981",
          "CHEMBL112032",
          "CHEMBL112066",
          "CHEMBL112177",
          "CHEMBL112269",
          "CHEMBL112361",
          "CHEMBL112429",
          "CHEMBL112519",
          "CHEMBL112525",
          "CHEMBL112632",
          "CHEMBL112738",
          "CHEMBL112937",
          "CHEMBL113011",
          "CHEMBL113079",
          "CHEMBL113158",
          "CHEMBL113252",
          "CHEMBL113279",
          "CHEMBL113284",
          "CHEMBL113342",
          "CHEMBL113372",
          "CHEMBL113398",
          "CHEMBL113430",
          "CHEMBL113475",
          "CHEMBL113493",
          "CHEMBL113548",
          "CHEMBL113549",
          "CHEMBL113631",
          "CHEMBL113861",
          "CHEMBL113909",
          "CHEMBL113910",
          "CHEMBL113912",
          "CHEMBL1256009",
          "CHEMBL1256010",
          "CHEMBL1257207",
          "CHEMBL1257209",
          "CHEMBL1257327",
          "CHEMBL1257328",
          "CHEMBL1257329",
          "CHEMBL1257330",
          "CHEMBL1257442",
          "CHEMBL1257443",
          "CHEMBL1257556",
          "CHEMBL1257558",
          "CHEMBL1257559",
          "CHEMBL1257677",
          "CHEMBL1257678",
          "CHEMBL1257679",
          "CHEMBL1257799",
          "CHEMBL1257800",
          "CHEMBL1257917",
          "CHEMBL1257918",
          "CHEMBL1258027",
          "CHEMBL1258030",
          "CHEMBL1258146",
          "CHEMBL1258147",
          "CHEMBL1258148",
          "CHEMBL1258261",
          "CHEMBL1258263",
          "CHEMBL1258374",
          "CHEMBL1258375",
          "CHEMBL1258487",
          "CHEMBL1258488",
          "CHEMBL1258600",
          "CHEMBL1258601",
          "CHEMBL1258708",
          "CHEMBL1258709",
          "CHEMBL1258828",
          "CHEMBL1258829",
          "CHEMBL1258943",
          "CHEMBL1258944",
          "CHEMBL127304",
          "CHEMBL127928",
          "CHEMBL134364",
          "CHEMBL134366",
          "CHEMBL134632",
          "CHEMBL134634",
          "CHEMBL134687",
          "CHEMBL134794",
          "CHEMBL134850",
          "CHEMBL136257",
          "CHEMBL136276",
          "CHEMBL136306",
          "CHEMBL136500",
          "CHEMBL136619",
          "CHEMBL136626",
          "CHEMBL136631",
          "CHEMBL136662",
          "CHEMBL136802",
          "CHEMBL136804",
          "CHEMBL136851",
          "CHEMBL136914",
          "CHEMBL137031",
          "CHEMBL137118",
          "CHEMBL137693",
          "CHEMBL138070",
          "CHEMBL138229",
          "CHEMBL138886",
          "CHEMBL138911",
          "CHEMBL139039",
          "CHEMBL139263",
          "CHEMBL15611",
          "CHEMBL15927",
          "CHEMBL159285",
          "CHEMBL159666",
          "CHEMBL159722",
          "CHEMBL160103",
          "CHEMBL161109",
          "CHEMBL162721",
          "CHEMBL162831",
          "CHEMBL162996",
          "CHEMBL163208",
          "CHEMBL163212",
          "CHEMBL163214",
          "CHEMBL163237",
          "CHEMBL163293",
          "CHEMBL163325",
          "CHEMBL163356",
          "CHEMBL163562",
          "CHEMBL163615",
          "CHEMBL163688",
          "CHEMBL163763",
          "CHEMBL163860",
          "CHEMBL164203",
          "CHEMBL164205",
          "CHEMBL164260",
          "CHEMBL164479",
          "CHEMBL165984",
          "CHEMBL165988",
          "CHEMBL166042",
          "CHEMBL166281",
          "CHEMBL166556",
          "CHEMBL166647",
          "CHEMBL166873",
          "CHEMBL167186",
          "CHEMBL167198",
          "CHEMBL167205",
          "CHEMBL167466",
          "CHEMBL167500",
          "CHEMBL167532",
          "CHEMBL167652",
          "CHEMBL167674",
          "CHEMBL167784",
          "CHEMBL167785",
          "CHEMBL168159",
          "CHEMBL168160",
          "CHEMBL168406",
          "CHEMBL168617",
          "CHEMBL176126",
          "CHEMBL1766811",
          "CHEMBL177678",
          "CHEMBL178472",
          "CHEMBL178526",
          "CHEMBL178591",
          "CHEMBL179229",
          "CHEMBL179528",
          "CHEMBL180573",
          "CHEMBL1907860",
          "CHEMBL1933478",
          "CHEMBL1933479",
          "CHEMBL1933480",
          "CHEMBL1933481",
          "CHEMBL197916",
          "CHEMBL200429",
          "CHEMBL200625",
          "CHEMBL2092880",
          "CHEMBL2170728",
          "CHEMBL2170736",
          "CHEMBL2170821",
          "CHEMBL2170832",
          "CHEMBL218383",
          "CHEMBL218550",
          "CHEMBL220746",
          "CHEMBL22373",
          "CHEMBL22963",
          "CHEMBL23084",
          "CHEMBL23111",
          "CHEMBL2331597",
          "CHEMBL2333808",
          "CHEMBL2333809",
          "CHEMBL2333810",
          "CHEMBL2333811",
          "CHEMBL2333812",
          "CHEMBL2333813",
          "CHEMBL23340",
          "CHEMBL2334082",
          "CHEMBL2334100",
          "CHEMBL2334194",
          "CHEMBL2334195",
          "CHEMBL2334196",
          "CHEMBL2334197",
          "CHEMBL2334198",
          "CHEMBL2334199",
          "CHEMBL2334200",
          "CHEMBL2334201",
          "CHEMBL2334202",
          "CHEMBL2334203",
          "CHEMBL2334204",
          "CHEMBL2334205",
          "CHEMBL2334206",
          "CHEMBL2334207",
          "CHEMBL2334208",
          "CHEMBL2334209",
          "CHEMBL2334210",
          "CHEMBL2334211",
          "CHEMBL2334212",
          "CHEMBL2334213",
          "CHEMBL2334214",
          "CHEMBL2334215",
          "CHEMBL2334216",
          "CHEMBL2334217",
          "CHEMBL2334218",
          "CHEMBL2334219",
          "CHEMBL2334220",
          "CHEMBL2334221",
          "CHEMBL2334222",
          "CHEMBL2334223",
          "CHEMBL2334224",
          "CHEMBL2334536",
          "CHEMBL2334537",
          "CHEMBL2334538",
          "CHEMBL2334539",
          "CHEMBL2334540",
          "CHEMBL2334541",
          "CHEMBL2335513",
          "CHEMBL2335514",
          "CHEMBL2335515",
          "CHEMBL2335516",
          "CHEMBL2335518",
          "CHEMBL2335519",
          "CHEMBL2335520",
          "CHEMBL2335521",
          "CHEMBL2335522",
          "CHEMBL2335523",
          "CHEMBL2335524",
          "CHEMBL2335525",
          "CHEMBL2335526",
          "CHEMBL2335527",
          "CHEMBL2335528",
          "CHEMBL2335529",
          "CHEMBL2335530",
          "CHEMBL2335531",
          "CHEMBL2335532",
          "CHEMBL2335533",
          "CHEMBL2335534",
          "CHEMBL2335535",
          "CHEMBL2335536",
          "CHEMBL2335537",
          "CHEMBL2335538",
          "CHEMBL2335539",
          "CHEMBL2335540",
          "CHEMBL2335541",
          "CHEMBL2335542",
          "CHEMBL2335543",
          "CHEMBL2335544",
          "CHEMBL2335545",
          "CHEMBL2335546",
          "CHEMBL2335547",
          "CHEMBL2335548",
          "CHEMBL2335549",
          "CHEMBL2335550",
          "CHEMBL2335551",
          "CHEMBL2335552",
          "CHEMBL2335553",
          "CHEMBL2335554",
          "CHEMBL2335555",
          "CHEMBL2335556",
          "CHEMBL2335557",
          "CHEMBL2335558",
          "CHEMBL2335559",
          "CHEMBL2335560",
          "CHEMBL2335561",
          "CHEMBL2335562",
          "CHEMBL2335563",
          "CHEMBL2335564",
          "CHEMBL2335565",
          "CHEMBL2335566",
          "CHEMBL2335567",
          "CHEMBL23476",
          "CHEMBL23541",
          "CHEMBL23561",
          "CHEMBL23599",
          "CHEMBL23602",
          "CHEMBL23624",
          "CHEMBL23740",
          "CHEMBL23775",
          "CHEMBL23782",
          "CHEMBL23857",
          "CHEMBL23976",
          "CHEMBL243796",
          "CHEMBL25110",
          "CHEMBL25387",
          "CHEMBL25662",
          "CHEMBL25712",
          "CHEMBL257943",
          "CHEMBL262010",
          "CHEMBL264631",
          "CHEMBL264816",
          "CHEMBL264863",
          "CHEMBL276448",
          "CHEMBL277986",
          "CHEMBL278155",
          "CHEMBL278578",
          "CHEMBL278856",
          "CHEMBL279228",
          "CHEMBL280903",
          "CHEMBL281144",
          "CHEMBL281777",
          "CHEMBL282071",
          "CHEMBL282451",
          "CHEMBL282897",
          "CHEMBL283332",
          "CHEMBL284378",
          "CHEMBL284559",
          "CHEMBL284596",
          "CHEMBL285429",
          "CHEMBL286434",
          "CHEMBL286583",
          "CHEMBL286611",
          "CHEMBL286812",
          "CHEMBL286836",
          "CHEMBL287013",
          "CHEMBL287233",
          "CHEMBL287842",
          "CHEMBL287932",
          "CHEMBL288332",
          "CHEMBL288422",
          "CHEMBL288771",
          "CHEMBL288988",
          "CHEMBL289033",
          "CHEMBL289062",
          "CHEMBL289465",
          "CHEMBL289483",
          "CHEMBL290000",
          "CHEMBL290606",
          "CHEMBL290627",
          "CHEMBL290630",
          "CHEMBL290655",
          "CHEMBL291052",
          "CHEMBL291164",
          "CHEMBL291173",
          "CHEMBL294929",
          "CHEMBL294932",
          "CHEMBL294984",
          "CHEMBL295033",
          "CHEMBL295134",
          "CHEMBL295147",
          "CHEMBL295156",
          "CHEMBL295171",
          "CHEMBL295184",
          "CHEMBL295227",
          "CHEMBL295230",
          "CHEMBL295248",
          "CHEMBL295362",
          "CHEMBL295466",
          "CHEMBL295580",
          "CHEMBL295616",
          "CHEMBL295671",
          "CHEMBL295824",
          "CHEMBL295831",
          "CHEMBL295846",
          "CHEMBL295847",
          "CHEMBL295867",
          "CHEMBL295878",
          "CHEMBL295979",
          "CHEMBL295993",
          "CHEMBL296055",
          "CHEMBL296056",
          "CHEMBL296094",
          "CHEMBL296124",
          "CHEMBL296287",
          "CHEMBL296412",
          "CHEMBL296421",
          "CHEMBL296463",
          "CHEMBL296469",
          "CHEMBL296714",
          "CHEMBL296852",
          "CHEMBL296892",
          "CHEMBL297054",
          "CHEMBL297135",
          "CHEMBL297184",
          "CHEMBL297185",
          "CHEMBL297198",
          "CHEMBL297206",
          "CHEMBL297221",
          "CHEMBL297232",
          "CHEMBL297271",
          "CHEMBL297311",
          "CHEMBL297351",
          "CHEMBL297373",
          "CHEMBL297374",
          "CHEMBL297454",
          "CHEMBL297460",
          "CHEMBL297553",
          "CHEMBL297559",
          "CHEMBL297580",
          "CHEMBL297747",
          "CHEMBL297770",
          "CHEMBL297834",
          "CHEMBL297985",
          "CHEMBL298236",
          "CHEMBL298330",
          "CHEMBL298440",
          "CHEMBL298465",
          "CHEMBL298479",
          "CHEMBL298486",
          "CHEMBL299444",
          "CHEMBL299566",
          "CHEMBL300264",
          "CHEMBL300732",
          "CHEMBL302284",
          "CHEMBL303612",
          "CHEMBL303881",
          "CHEMBL304267",
          "CHEMBL304612",
          "CHEMBL305235",
          "CHEMBL305819",
          "CHEMBL306266",
          "CHEMBL306349",
          "CHEMBL307540",
          "CHEMBL30860",
          "CHEMBL308926",
          "CHEMBL309182",
          "CHEMBL309297",
          "CHEMBL309442",
          "CHEMBL309560",
          "CHEMBL309595",
          "CHEMBL309676",
          "CHEMBL309744",
          "CHEMBL309867",
          "CHEMBL310031",
          "CHEMBL310147",
          "CHEMBL310909",
          "CHEMBL311427",
          "CHEMBL311438",
          "CHEMBL311725",
          "CHEMBL312356",
          "CHEMBL312412",
          "CHEMBL312422",
          "CHEMBL312501",
          "CHEMBL312643",
          "CHEMBL312795",
          "CHEMBL313793",
          "CHEMBL316331",
          "CHEMBL316669",
          "CHEMBL316728",
          "CHEMBL316787",
          "CHEMBL317460",
          "CHEMBL317542",
          "CHEMBL317779",
          "CHEMBL318137",
          "CHEMBL318456",
          "CHEMBL320717",
          "CHEMBL321124",
          "CHEMBL321493",
          "CHEMBL322919",
          "CHEMBL322937",
          "CHEMBL322938",
          "CHEMBL323662",
          "CHEMBL323811",
          "CHEMBL323852",
          "CHEMBL324104",
          "CHEMBL324320",
          "CHEMBL324491",
          "CHEMBL324589",
          "CHEMBL324925",
          "CHEMBL325384",
          "CHEMBL326106",
          "CHEMBL326657",
          "CHEMBL326851",
          "CHEMBL326882",
          "CHEMBL329308",
          "CHEMBL330151",
          "CHEMBL33054",
          "CHEMBL330794",
          "CHEMBL33127",
          "CHEMBL332150",
          "CHEMBL33229",
          "CHEMBL332474",
          "CHEMBL332944",
          "CHEMBL333141",
          "CHEMBL333228",
          "CHEMBL333544",
          "CHEMBL33464",
          "CHEMBL335557",
          "CHEMBL335801",
          "CHEMBL336445",
          "CHEMBL33661",
          "CHEMBL337336",
          "CHEMBL33780",
          "CHEMBL337811",
          "CHEMBL33842",
          "CHEMBL340487",
          "CHEMBL34219",
          "CHEMBL342412",
          "CHEMBL342427",
          "CHEMBL342666",
          "CHEMBL344172",
          "CHEMBL344628",
          "CHEMBL348070",
          "CHEMBL348853",
          "CHEMBL349364",
          "CHEMBL349908",
          "CHEMBL350852",
          "CHEMBL351292",
          "CHEMBL351882",
          "CHEMBL352567",
          "CHEMBL352693",
          "CHEMBL352772",
          "CHEMBL352840",
          "CHEMBL353082",
          "CHEMBL353175",
          "CHEMBL353227",
          "CHEMBL353236",
          "CHEMBL353517",
          "CHEMBL353609",
          "CHEMBL353660",
          "CHEMBL353791",
          "CHEMBL353898",
          "CHEMBL353958",
          "CHEMBL354290",
          "CHEMBL354494",
          "CHEMBL354571",
          "CHEMBL354659",
          "CHEMBL355025",
          "CHEMBL355255",
          "CHEMBL355357",
          "CHEMBL360400",
          "CHEMBL360512",
          "CHEMBL364823",
          "CHEMBL367216",
          "CHEMBL368497",
          "CHEMBL369660",
          "CHEMBL370126",
          "CHEMBL371024",
          "CHEMBL371677",
          "CHEMBL38789",
          "CHEMBL38836",
          "CHEMBL395857",
          "CHEMBL40470",
          "CHEMBL40506",
          "CHEMBL40516",
          "CHEMBL40518",
          "CHEMBL40519",
          "CHEMBL40527",
          "CHEMBL40547",
          "CHEMBL40556",
          "CHEMBL405810",
          "CHEMBL40608",
          "CHEMBL40644",
          "CHEMBL40685",
          "CHEMBL40688",
          "CHEMBL40689",
          "CHEMBL40767",
          "CHEMBL40781",
          "CHEMBL40809",
          "CHEMBL40945",
          "CHEMBL40985",
          "CHEMBL409855",
          "CHEMBL41001",
          "CHEMBL41085",
          "CHEMBL41127",
          "CHEMBL41184",
          "CHEMBL41233",
          "CHEMBL41273",
          "CHEMBL41330",
          "CHEMBL41554",
          "CHEMBL41571",
          "CHEMBL415924",
          "CHEMBL416448",
          "CHEMBL416485",
          "CHEMBL416626",
          "CHEMBL41667",
          "CHEMBL41714",
          "CHEMBL417159",
          "CHEMBL417177",
          "CHEMBL41725",
          "CHEMBL417517",
          "CHEMBL417531",
          "CHEMBL417896",
          "CHEMBL41793",
          "CHEMBL41845",
          "CHEMBL418840",
          "CHEMBL41891",
          "CHEMBL418976",
          "CHEMBL419530",
          "CHEMBL41960",
          "CHEMBL41967",
          "CHEMBL41992",
          "CHEMBL420119",
          "CHEMBL42045",
          "CHEMBL42048",
          "CHEMBL42082",
          "CHEMBL420942",
          "CHEMBL421012",
          "CHEMBL42111",
          "CHEMBL42128",
          "CHEMBL421320",
          "CHEMBL42143",
          "CHEMBL42147",
          "CHEMBL42165",
          "CHEMBL42166",
          "CHEMBL421700",
          "CHEMBL42186",
          "CHEMBL422222",
          "CHEMBL42236",
          "CHEMBL422452",
          "CHEMBL422709",
          "CHEMBL42296",
          "CHEMBL423267",
          "CHEMBL42343",
          "CHEMBL42354",
          "CHEMBL423651",
          "CHEMBL42371",
          "CHEMBL42384",
          "CHEMBL42395",
          "CHEMBL42433",
          "CHEMBL424404",
          "CHEMBL424655",
          "CHEMBL42477",
          "CHEMBL42488",
          "CHEMBL42498",
          "CHEMBL42544",
          "CHEMBL42552",
          "CHEMBL42574",
          "CHEMBL42575",
          "CHEMBL425926",
          "CHEMBL42596",
          "CHEMBL42602",
          "CHEMBL42603",
          "CHEMBL42655",
          "CHEMBL42668",
          "CHEMBL42673",
          "CHEMBL42723",
          "CHEMBL42732",
          "CHEMBL42760",
          "CHEMBL42765",
          "CHEMBL42807",
          "CHEMBL42813",
          "CHEMBL42821",
          "CHEMBL42873",
          "CHEMBL42890",
          "CHEMBL42897",
          "CHEMBL42902",
          "CHEMBL42936",
          "CHEMBL42942",
          "CHEMBL42998",
          "CHEMBL43010",
          "CHEMBL43036",
          "CHEMBL430621",
          "CHEMBL430887",
          "CHEMBL43095",
          "CHEMBL431003",
          "CHEMBL43107",
          "CHEMBL43109",
          "CHEMBL431258",
          "CHEMBL431513",
          "CHEMBL431783",
          "CHEMBL431981",
          "CHEMBL432003",
          "CHEMBL432497",
          "CHEMBL43252",
          "CHEMBL43257",
          "CHEMBL432833",
          "CHEMBL432999",
          "CHEMBL43316",
          "CHEMBL433397",
          "CHEMBL433470",
          "CHEMBL433472",
          "CHEMBL43362",
          "CHEMBL433717",
          "CHEMBL433915",
          "CHEMBL43422",
          "CHEMBL43431",
          "CHEMBL43499",
          "CHEMBL43505",
          "CHEMBL43537",
          "CHEMBL43592",
          "CHEMBL43603",
          "CHEMBL43675",
          "CHEMBL43810",
          "CHEMBL43812",
          "CHEMBL43856",
          "CHEMBL43908",
          "CHEMBL439763",
          "CHEMBL43984",
          "CHEMBL43989",
          "CHEMBL439926",
          "CHEMBL44016",
          "CHEMBL44020",
          "CHEMBL44024",
          "CHEMBL440392",
          "CHEMBL440475",
          "CHEMBL440615",
          "CHEMBL440703",
          "CHEMBL44071",
          "CHEMBL44099",
          "CHEMBL441429",
          "CHEMBL44154",
          "CHEMBL44179",
          "CHEMBL441992",
          "CHEMBL442157",
          "CHEMBL442196",
          "CHEMBL442216",
          "CHEMBL442351",
          "CHEMBL442409",
          "CHEMBL442567",
          "CHEMBL44264",
          "CHEMBL44266",
          "CHEMBL44314",
          "CHEMBL443151",
          "CHEMBL44318",
          "CHEMBL44331",
          "CHEMBL44334",
          "CHEMBL44336",
          "CHEMBL44358",
          "CHEMBL44360",
          "CHEMBL44423",
          "CHEMBL444332",
          "CHEMBL44435",
          "CHEMBL44460",
          "CHEMBL44471",
          "CHEMBL44480",
          "CHEMBL444831",
          "CHEMBL44495",
          "CHEMBL44590",
          "CHEMBL44609",
          "CHEMBL44652",
          "CHEMBL44702",
          "CHEMBL44755",
          "CHEMBL44760",
          "CHEMBL447674",
          "CHEMBL448407",
          "CHEMBL44847",
          "CHEMBL44848",
          "CHEMBL44863",
          "CHEMBL44885",
          "CHEMBL44906",
          "CHEMBL449307",
          "CHEMBL44956",
          "CHEMBL44960",
          "CHEMBL449832",
          "CHEMBL449977",
          "CHEMBL45033",
          "CHEMBL45036",
          "CHEMBL45093",
          "CHEMBL45098",
          "CHEMBL45146",
          "CHEMBL45148",
          "CHEMBL45200",
          "CHEMBL45319",
          "CHEMBL45333",
          "CHEMBL453491",
          "CHEMBL45377",
          "CHEMBL45379",
          "CHEMBL45429",
          "CHEMBL45438",
          "CHEMBL454397",
          "CHEMBL459791",
          "CHEMBL459998",
          "CHEMBL459999",
          "CHEMBL46373",
          "CHEMBL46376",
          "CHEMBL46417",
          "CHEMBL46418",
          "CHEMBL46423",
          "CHEMBL46426",
          "CHEMBL46430",
          "CHEMBL46450",
          "CHEMBL46460",
          "CHEMBL46480",
          "CHEMBL46481",
          "CHEMBL46503",
          "CHEMBL46505",
          "CHEMBL46510",
          "CHEMBL46531",
          "CHEMBL46534",
          "CHEMBL46586",
          "CHEMBL46641",
          "CHEMBL46645",
          "CHEMBL46676",
          "CHEMBL46689",
          "CHEMBL46690",
          "CHEMBL46706",
          "CHEMBL46709",
          "CHEMBL46729",
          "CHEMBL46738",
          "CHEMBL46741",
          "CHEMBL46744",
          "CHEMBL46756",
          "CHEMBL46769",
          "CHEMBL46793",
          "CHEMBL46827",
          "CHEMBL46854",
          "CHEMBL46861",
          "CHEMBL46966",
          "CHEMBL46978",
          "CHEMBL46985",
          "CHEMBL47030",
          "CHEMBL47071",
          "CHEMBL47084",
          "CHEMBL47093",
          "CHEMBL47095",
          "CHEMBL47099",
          "CHEMBL47105",
          "CHEMBL47206",
          "CHEMBL47218",
          "CHEMBL47221",
          "CHEMBL47233",
          "CHEMBL47235",
          "CHEMBL47256",
          "CHEMBL47509",
          "CHEMBL47522",
          "CHEMBL47640",
          "CHEMBL49273",
          "CHEMBL49500",
          "CHEMBL49683",
          "CHEMBL499122",
          "CHEMBL500498",
          "CHEMBL501429",
          "CHEMBL503766",
          "CHEMBL505016",
          "CHEMBL509834",
          "CHEMBL510453",
          "CHEMBL516093",
          "CHEMBL51736",
          "CHEMBL517393",
          "CHEMBL520938",
          "CHEMBL52678",
          "CHEMBL52720",
          "CHEMBL531383",
          "CHEMBL53287",
          "CHEMBL53524",
          "CHEMBL53537",
          "CHEMBL542103",
          "CHEMBL54548",
          "CHEMBL545661",
          "CHEMBL553566",
          "CHEMBL55560",
          "CHEMBL55870",
          "CHEMBL64122",
          "CHEMBL64237",
          "CHEMBL69844",
          "CHEMBL70491",
          "CHEMBL71041",
          "CHEMBL71051",
          "CHEMBL71075",
          "CHEMBL72261",
          "CHEMBL72531",
          "CHEMBL72792",
          "CHEMBL73336",
          "CHEMBL74463",
          "CHEMBL74684",
          "CHEMBL75865",
          "CHEMBL76037",
          "CHEMBL76088",
          "CHEMBL76251",
          "CHEMBL76780",
          "CHEMBL76835",
          "CHEMBL76951",
          "CHEMBL77339",
          "CHEMBL77370",
          "CHEMBL77443",
          "CHEMBL77583",
          "CHEMBL77841",
          "CHEMBL77898",
          "CHEMBL77900",
          "CHEMBL78142",
          "CHEMBL78143",
          "CHEMBL78193",
          "CHEMBL78361",
          "CHEMBL78384",
          "CHEMBL78394",
          "CHEMBL78506",
          "CHEMBL78522",
          "CHEMBL78542",
          "CHEMBL78577",
          "CHEMBL78581",
          "CHEMBL78626",
          "CHEMBL78717",
          "CHEMBL78754",
          "CHEMBL78828",
          "CHEMBL78829",
          "CHEMBL78833",
          "CHEMBL78870",
          "CHEMBL78948",
          "CHEMBL79050",
          "CHEMBL79146",
          "CHEMBL79147",
          "CHEMBL79163",
          "CHEMBL79170",
          "CHEMBL79179",
          "CHEMBL79600",
          "CHEMBL79936",
          "CHEMBL80131",
          "CHEMBL80134",
          "CHEMBL80201",
          "CHEMBL80281",
          "CHEMBL80332",
          "CHEMBL80449",
          "CHEMBL80561",
          "CHEMBL80570",
          "CHEMBL80697",
          "CHEMBL80720",
          "CHEMBL80752",
          "CHEMBL80753",
          "CHEMBL80763",
          "CHEMBL80805",
          "CHEMBL80818",
          "CHEMBL80825",
          "CHEMBL80836",
          "CHEMBL80841",
          "CHEMBL80887",
          "CHEMBL80951",
          "CHEMBL81537",
          "CHEMBL81651",
          "CHEMBL81707",
          "CHEMBL81910",
          "CHEMBL86421",
          "CHEMBL86681",
          "CHEMBL86722",
          "CHEMBL86802",
          "CHEMBL87050",
          "CHEMBL87183",
          "CHEMBL8805",
          "CHEMBL8806",
          "CHEMBL88148",
          "CHEMBL8951",
          "CHEMBL89544",
          "CHEMBL89574",
          "CHEMBL89642",
          "CHEMBL89694",
          "CHEMBL89843",
          "CHEMBL89873",
          "CHEMBL90110",
          "CHEMBL9470",
          "CHEMBL9499",
          "CHEMBL97967",
          "CHEMBL98156",
          "CHEMBL98543",
          "CHEMBL98651",
          "CHEMBL99375",
          "CHEMBL99488",
          "CHEMBL99880"
        ],
        "number_of_missing_values": "0"
      },
      {
        "data_type": "numeric",
        "index": "1",
        "is_ignore": "false",
        "is_row_identifier": "false",
        "is_target": "false",
        "name": "AMW",
        "number_of_missing_values": "0"
      },
      {
        "data_type": "numeric",
        "index": "2",
        "is_ignore": "false",
        "is_row_identifier": "false",
        "is_target": "false",
        "name": "C.",
        "number_of_missing_values": "0"
      },
      {
        "data_type": "numeric",
        "index": "3",
        "is_ignore": "false",
        "is_row_identifier": "false",
        "is_target": "false",
        "name": "H.",
        "number_of_missing_values": "0"
      },
      {
        "data_type": "numeric",
        "index": "4",
        "is_ignore": "false",
        "is_row_identifier": "false",
        "is_target": "false",
        "name": "Me",
        "number_of_missing_values": "0"
      },
      {
        "data_type": "numeric",
        "index": "5",
        "is_ignore": "false",
        "is_row_identifier": "false",
        "is_target": "false",
        "name": "Mi",
        "number_of_missing_values": "0"
      },
      {
        "data_type": "numeric",
        "index": "6",
        "is_ignore": "false",
        "is_row_identifier": "false",
        "is_target": "false",
        "name": "Mp",
        "number_of_missing_values": "0"
      },
      {
        "data_type": "numeric",
        "index": "7",
        "is_ignore": "false",
        "is_row_identifier": "false",
        "is_target": "false",
        "name": "Mv",
        "number_of_missing_values": "0"
      },
      {
        "data_type": "numeric",
        "index": "8",
        "is_ignore": "false",
        "is_row_identifier": "false",
        "is_target": "false",
        "name": "MW",
        "number_of_missing_values": "0"
      },
      {
        "data_type": "numeric",
        "index": "9",
        "is_ignore": "false",
        "is_row_identifier": "false",
        "is_target": "false",
        "name": "N.",
        "number_of_missing_values": "0"
      },
      {
        "data_type": "numeric",
        "index": "10",
        "is_ignore": "false",
        "is_row_identifier": "false",
        "is_target": "false",
        "name": "nAB",
        "number_of_missing_values": "0"
      },
      {
        "data_type": "numeric",
        "index": "11",
        "is_ignore": "false",
        "is_row_identifier": "false",
        "is_target": "false",
        "name": "nAT",
        "number_of_missing_values": "0"
      },
      {
        "data_type": "numeric",
        "index": "12",
        "is_ignore": "false",
        "is_row_identifier": "false",
        "is_target": "false",
        "name": "nB",
        "number_of_missing_values": "0"
      },
      {
        "data_type": "numeric",
        "index": "13",
        "is_ignore": "false",
        "is_row_identifier": "false",
        "is_target": "false",
        "name": "nBM",
        "number_of_missing_values": "0"
      },
      {
        "data_type": "numeric",
        "index": "14",
        "is_ignore": "false",
        "is_row_identifier": "false",
        "is_target": "false",
        "name": "nBO",
        "number_of_missing_values": "0"
      },
      {
        "data_type": "numeric",
        "index": "15",
        "is_ignore": "false",
        "is_row_identifier": "false",
        "is_target": "false",
        "name": "nBR",
        "number_of_missing_values": "0"
      },
      {
        "data_type": "numeric",
        "index": "16",
        "is_ignore": "false",
        "is_row_identifier": "false",
        "is_target": "false",
        "name": "nBT",
        "number_of_missing_values": "0"
      },
      {
        "data_type": "numeric",
        "index": "17",
        "is_ignore": "false",
        "is_row_identifier": "false",
        "is_target": "false",
        "name": "nC",
        "number_of_missing_values": "0"
      },
      {
        "data_type": "numeric",
        "index": "18",
        "is_ignore": "false",
        "is_row_identifier": "false",
        "is_target": "false",
        "name": "nCL",
        "number_of_missing_values": "0"
      },
      {
        "data_type": "numeric",
        "index": "19",
        "is_ignore": "false",
        "is_row_identifier": "false",
        "is_target": "false",
        "name": "nCsp",
        "number_of_missing_values": "0"
      },
      {
        "data_type": "numeric",
        "index": "20",
        "is_ignore": "false",
        "is_row_identifier": "false",
        "is_target": "false",
        "name": "nCsp2",
        "number_of_missing_values": "0"
      },
      {
        "data_type": "numeric",
        "index": "21",
        "is_ignore": "false",
        "is_row_identifier": "false",
        "is_target": "false",
        "name": "nCsp3",
        "number_of_missing_values": "0"
      },
      {
        "data_type": "numeric",
        "index": "22",
        "is_ignore": "false",
        "is_row_identifier": "false",
        "is_target": "false",
        "name": "nDB",
        "number_of_missing_values": "0"
      },
      {
        "data_type": "numeric",
        "index": "23",
        "is_ignore": "false",
        "is_row_identifier": "false",
        "is_target": "false",
        "name": "nF",
        "number_of_missing_values": "0"
      },
      {
        "data_type": "numeric",
        "index": "24",
        "is_ignore": "false",
        "is_row_identifier": "false",
        "is_target": "false",
        "name": "nH",
        "number_of_missing_values": "0"
      },
      {
        "data_type": "numeric",
        "index": "25",
        "is_ignore": "false",
        "is_row_identifier": "false",
        "is_target": "false",
        "name": "nHet",
        "number_of_missing_values": "0"
      },
      {
        "data_type": "numeric",
        "index": "26",
        "is_ignore": "false",
        "is_row_identifier": "false",
        "is_target": "false",
        "name": "nHM",
        "number_of_missing_values": "0"
      },
      {
        "data_type": "numeric",
        "index": "27",
        "is_ignore": "false",
        "is_row_identifier": "false",
        "is_target": "false",
        "name": "nI",
        "number_of_missing_values": "0"
      },
      {
        "data_type": "numeric",
        "index": "28",
        "is_ignore": "false",
        "is_row_identifier": "false",
        "is_target": "false",
        "name": "nN",
        "number_of_missing_values": "0"
      },
      {
        "data_type": "numeric",
        "index": "29",
        "is_ignore": "false",
        "is_row_identifier": "false",
        "is_target": "false",
        "name": "nO",
        "number_of_missing_values": "0"
      },
      {
        "data_type": "numeric",
        "index": "30",
        "is_ignore": "false",
        "is_row_identifier": "false",
        "is_target": "false",
        "name": "nP",
        "number_of_missing_values": "0"
      },
      {
        "data_type": "numeric",
        "index": "31",
        "is_ignore": "false",
        "is_row_identifier": "false",
        "is_target": "false",
        "name": "nS",
        "number_of_missing_values": "0"
      },
      {
        "data_type": "numeric",
        "index": "32",
        "is_ignore": "false",
        "is_row_identifier": "false",
        "is_target": "false",
        "name": "nSK",
        "number_of_missing_values": "0"
      },
      {
        "data_type": "numeric",
        "index": "33",
        "is_ignore": "false",
        "is_row_identifier": "false",
        "is_target": "false",
        "name": "nTB",
        "number_of_missing_values": "0"
      },
      {
        "data_type": "numeric",
        "index": "34",
        "is_ignore": "false",
        "is_row_identifier": "false",
        "is_target": "false",
        "name": "nX",
        "number_of_missing_values": "0"
      },
      {
        "data_type": "numeric",
        "index": "35",
        "is_ignore": "false",
        "is_row_identifier": "false",
        "is_target": "false",
        "name": "O.",
        "number_of_missing_values": "0"
      },
      {
        "data_type": "numeric",
        "index": "36",
        "is_ignore": "false",
        "is_row_identifier": "false",
        "is_target": "false",
        "name": "RBF",
        "number_of_missing_values": "0"
      },
      {
        "data_type": "numeric",
        "index": "37",
        "is_ignore": "false",
        "is_row_identifier": "false",
        "is_target": "false",
        "name": "RBN",
        "number_of_missing_values": "0"
      },
      {
        "data_type": "numeric",
        "index": "38",
        "is_ignore": "false",
        "is_row_identifier": "false",
        "is_target": "false",
        "name": "SCBO",
        "number_of_missing_values": "0"
      },
      {
        "data_type": "numeric",
        "index": "39",
        "is_ignore": "false",
        "is_row_identifier": "false",
        "is_target": "false",
        "name": "Se",
        "number_of_missing_values": "0"
      },
      {
        "data_type": "numeric",
        "index": "40",
        "is_ignore": "false",
        "is_row_identifier": "false",
        "is_target": "false",
        "name": "Si",
        "number_of_missing_values": "0"
      },
      {
        "data_type": "numeric",
        "index": "41",
        "is_ignore": "false",
        "is_row_identifier": "false",
        "is_target": "false",
        "name": "Sp",
        "number_of_missing_values": "0"
      },
      {
        "data_type": "numeric",
        "index": "42",
        "is_ignore": "false",
        "is_row_identifier": "false",
        "is_target": "false",
        "name": "Sv",
        "number_of_missing_values": "0"
      },
      {
        "data_type": "numeric",
        "index": "43",
        "is_ignore": "false",
        "is_row_identifier": "false",
        "is_target": "false",
        "name": "X.",
        "number_of_missing_values": "0"
      },
      {
        "data_type": "numeric",
        "index": "44",
        "is_ignore": "false",
        "is_row_identifier": "false",
        "is_target": "true",
        "name": "pXC50",
        "number_of_missing_values": "0"
      }
    ]
  }
}