{
  "data_features": {
    "feature": [
      {
        "data_type": "nominal",
        "index": "0",
        "is_ignore": "false",
        "is_row_identifier": "true",
        "is_target": "false",
        "name": "molecule_id",
        "nominal_value": [
          "CHEMBL1301276",
          "CHEMBL1303289",
          "CHEMBL1305247",
          "CHEMBL1307845",
          "CHEMBL1312519",
          "CHEMBL1313635",
          "CHEMBL1316903",
          "CHEMBL1317842",
          "CHEMBL1318162",
          "CHEMBL1318253",
          "CHEMBL1318827",
          "CHEMBL1318903",
          "CHEMBL1319469",
          "CHEMBL1319613",
          "CHEMBL1320897",
          "CHEMBL1321207",
          "CHEMBL1321388",
          "CHEMBL1321632",
          "CHEMBL1324692",
          "CHEMBL1325618",
          "CHEMBL1326803",
          "CHEMBL1327734",
          "CHEMBL1332525",
          "CHEMBL1333544",
          "CHEMBL1334858",
          "CHEMBL1335091",
          "CHEMBL1339277",
          "CHEMBL1339518",
          "CHEMBL1339593",
          "CHEMBL1340905",
          "CHEMBL1342158",
          "CHEMBL1343383",
          "CHEMBL1344772",
          "CHEMBL1345008",
          "CHEMBL1349022",
          "CHEMBL1349451",
          "CHEMBL1349518",
          "CHEMBL1350188",
          "CHEMBL1353644",
          "CHEMBL1355123",
          "CHEMBL1358933",
          "CHEMBL1359322",
          "CHEMBL1359526",
          "CHEMBL1363678",
          "CHEMBL1364118",
          "CHEMBL1364684",
          "CHEMBL1367248",
          "CHEMBL1369880",
          "CHEMBL1377588",
          "CHEMBL1378601",
          "CHEMBL1379062",
          "CHEMBL1382280",
          "CHEMBL1383109",
          "CHEMBL1383229",
          "CHEMBL1383779",
          "CHEMBL1383962",
          "CHEMBL1385027",
          "CHEMBL1385494",
          "CHEMBL1387505",
          "CHEMBL1388052",
          "CHEMBL1389680",
          "CHEMBL1398945",
          "CHEMBL1400038",
          "CHEMBL1406127",
          "CHEMBL1407474",
          "CHEMBL1411252",
          "CHEMBL1411577",
          "CHEMBL1411777",
          "CHEMBL1414701",
          "CHEMBL1415644",
          "CHEMBL1415893",
          "CHEMBL1416302",
          "CHEMBL1416798",
          "CHEMBL1420111",
          "CHEMBL1420927",
          "CHEMBL1422183",
          "CHEMBL1422657",
          "CHEMBL1422684",
          "CHEMBL1422967",
          "CHEMBL1423236",
          "CHEMBL1423536",
          "CHEMBL1423915",
          "CHEMBL1426560",
          "CHEMBL1428441",
          "CHEMBL1429327",
          "CHEMBL1430103",
          "CHEMBL1432423",
          "CHEMBL1439364",
          "CHEMBL1439545",
          "CHEMBL1441794",
          "CHEMBL1444209",
          "CHEMBL1445700",
          "CHEMBL1447764",
          "CHEMBL1448744",
          "CHEMBL1449357",
          "CHEMBL1451147",
          "CHEMBL1451597",
          "CHEMBL1452833",
          "CHEMBL1458352",
          "CHEMBL1458928",
          "CHEMBL1459844",
          "CHEMBL1461216",
          "CHEMBL1462740",
          "CHEMBL1463019",
          "CHEMBL1464460",
          "CHEMBL1465964",
          "CHEMBL1466225",
          "CHEMBL1469272",
          "CHEMBL1469858",
          "CHEMBL1470414",
          "CHEMBL1479067",
          "CHEMBL1480280",
          "CHEMBL1480992",
          "CHEMBL1482955",
          "CHEMBL1483521",
          "CHEMBL1485592",
          "CHEMBL1487716",
          "CHEMBL1489703",
          "CHEMBL1490082",
          "CHEMBL1492004",
          "CHEMBL1495764",
          "CHEMBL1497097",
          "CHEMBL1497457",
          "CHEMBL1497773",
          "CHEMBL1502154",
          "CHEMBL1505531",
          "CHEMBL1505905",
          "CHEMBL1506901",
          "CHEMBL1508177",
          "CHEMBL1510003",
          "CHEMBL1510325",
          "CHEMBL1518235",
          "CHEMBL1522300",
          "CHEMBL1524163",
          "CHEMBL1527523",
          "CHEMBL1527895",
          "CHEMBL1530246",
          "CHEMBL1534370",
          "CHEMBL1535072",
          "CHEMBL1540272",
          "CHEMBL1542453",
          "CHEMBL1544021",
          "CHEMBL1545487",
          "CHEMBL1547939",
          "CHEMBL1548422",
          "CHEMBL1550902",
          "CHEMBL1553245",
          "CHEMBL1560104",
          "CHEMBL1561115",
          "CHEMBL1562954",
          "CHEMBL1563010",
          "CHEMBL1563084",
          "CHEMBL1563641",
          "CHEMBL1567502",
          "CHEMBL1568319",
          "CHEMBL1570406",
          "CHEMBL1570460",
          "CHEMBL1572009",
          "CHEMBL1573412",
          "CHEMBL1575077",
          "CHEMBL1575292",
          "CHEMBL1577127",
          "CHEMBL1577942",
          "CHEMBL1578367",
          "CHEMBL1581190",
          "CHEMBL1582188",
          "CHEMBL1582492",
          "CHEMBL1583019",
          "CHEMBL1583797",
          "CHEMBL1586498",
          "CHEMBL1587391",
          "CHEMBL1587882",
          "CHEMBL1588650",
          "CHEMBL1589193",
          "CHEMBL1589596",
          "CHEMBL1591536",
          "CHEMBL1594808",
          "CHEMBL1595086",
          "CHEMBL1596638",
          "CHEMBL1596870",
          "CHEMBL1599517",
          "CHEMBL1601708",
          "CHEMBL1602385",
          "CHEMBL1602624",
          "CHEMBL1602954",
          "CHEMBL1603147",
          "CHEMBL1610821",
          "CHEMBL1612391",
          "CHEMBL1698385",
          "CHEMBL1699486",
          "CHEMBL1699657",
          "CHEMBL1700771",
          "CHEMBL1700837",
          "CHEMBL1701659",
          "CHEMBL1703558",
          "CHEMBL1703699",
          "CHEMBL1704868",
          "CHEMBL1705486",
          "CHEMBL1709023",
          "CHEMBL1709549",
          "CHEMBL1709821",
          "CHEMBL1711550",
          "CHEMBL1713539",
          "CHEMBL1715163",
          "CHEMBL1715789",
          "CHEMBL1718734",
          "CHEMBL1722484",
          "CHEMBL1726321",
          "CHEMBL1730395",
          "CHEMBL1731046",
          "CHEMBL1731262",
          "CHEMBL1731512",
          "CHEMBL1732622",
          "CHEMBL1734711",
          "CHEMBL1965155",
          "CHEMBL1978327",
          "CHEMBL1985932",
          "CHEMBL1991440",
          "CHEMBL1993780",
          "CHEMBL286404",
          "CHEMBL411502",
          "CHEMBL585964",
          "CHEMBL589711",
          "CHEMBL592588"
        ],
        "number_of_missing_values": "0"
      },
      {
        "data_type": "numeric",
        "index": "1",
        "is_ignore": "false",
        "is_row_identifier": "false",
        "is_target": "false",
        "name": "SM04_EA.bo.",
        "number_of_missing_values": "0"
      },
      {
        "data_type": "numeric",
        "index": "2",
        "is_ignore": "false",
        "is_row_identifier": "false",
        "is_target": "false",
        "name": "piID",
        "number_of_missing_values": "0"
      },
      {
        "data_type": "numeric",
        "index": "3",
        "is_ignore": "false",
        "is_row_identifier": "false",
        "is_target": "false",
        "name": "P_VSA_LogP_4",
        "number_of_missing_values": "0"
      },
      {
        "data_type": "numeric",
        "index": "4",
        "is_ignore": "false",
        "is_row_identifier": "false",
        "is_target": "false",
        "name": "piPC04",
        "number_of_missing_values": "0"
      },
      {
        "data_type": "numeric",
        "index": "5",
        "is_ignore": "false",
        "is_row_identifier": "false",
        "is_target": "false",
        "name": "piPC03",
        "number_of_missing_values": "0"
      },
      {
        "data_type": "numeric",
        "index": "6",
        "is_ignore": "false",
        "is_row_identifier": "false",
        "is_target": "false",
        "name": "D.Dtr05",
        "number_of_missing_values": "0"
      },
      {
        "data_type": "numeric",
        "index": "7",
        "is_ignore": "false",
        "is_row_identifier": "false",
        "is_target": "false",
        "name": "Eig03_EA.bo.",
        "number_of_missing_values": "0"
      },
      {
        "data_type": "numeric",
        "index": "8",
        "is_ignore": "false",
        "is_row_identifier": "false",
        "is_target": "false",
        "name": "SM13_AEA.ri.",
        "number_of_missing_values": "0"
      },
      {
        "data_type": "numeric",
        "index": "9",
        "is_ignore": "false",
        "is_row_identifier": "false",
        "is_target": "false",
        "name": "SpMax3_Bh.s.",
        "number_of_missing_values": "0"
      },
      {
        "data_type": "numeric",
        "index": "10",
        "is_ignore": "false",
        "is_row_identifier": "false",
        "is_target": "false",
        "name": "nCsp2",
        "number_of_missing_values": "0"
      },
      {
        "data_type": "numeric",
        "index": "11",
        "is_ignore": "false",
        "is_row_identifier": "false",
        "is_target": "false",
        "name": "O.",
        "number_of_missing_values": "0"
      },
      {
        "data_type": "numeric",
        "index": "12",
        "is_ignore": "false",
        "is_row_identifier": "false",
        "is_target": "false",
        "name": "TPSA.Tot.",
        "number_of_missing_values": "0"
      },
      {
        "data_type": "numeric",
        "index": "13",
        "is_ignore": "false",
        "is_row_identifier": "false",
        "is_target": "false",
        "name": "TPSA.NO.",
        "number_of_missing_values": "0"
      },
      {
        "data_type": "numeric",
        "index": "14",
        "is_ignore": "false",
        "is_row_identifier": "false",
        "is_target": "false",
        "name": "SpMax4_Bh.s.",
        "number_of_missing_values": "0"
      },
      {
        "data_type": "numeric",
        "index": "15",
        "is_ignore": "false",
        "is_row_identifier": "false",
        "is_target": "false",
        "name": "PCD",
        "number_of_missing_values": "0"
      },
      {
        "data_type": "numeric",
        "index": "16",
        "is_ignore": "false",
        "is_row_identifier": "false",
        "is_target": "false",
        "name": "Eig05_EA.bo.",
        "number_of_missing_values": "0"
      },
      {
        "data_type": "numeric",
        "index": "17",
        "is_ignore": "false",
        "is_row_identifier": "false",
        "is_target": "false",
        "name": "SM15_AEA.ri.",
        "number_of_missing_values": "0"
      },
      {
        "data_type": "numeric",
        "index": "18",
        "is_ignore": "false",
        "is_row_identifier": "false",
        "is_target": "false",
        "name": "Eig06_AEA.ri.",
        "number_of_missing_values": "0"
      },
      {
        "data_type": "numeric",
        "index": "19",
        "is_ignore": "false",
        "is_row_identifier": "false",
        "is_target": "false",
        "name": "ZM2Kup",
        "number_of_missing_values": "0"
      },
      {
        "data_type": "numeric",
        "index": "20",
        "is_ignore": "false",
        "is_row_identifier": "false",
        "is_target": "false",
        "name": "Eig05_AEA.bo.",
        "number_of_missing_values": "0"
      },
      {
        "data_type": "numeric",
        "index": "21",
        "is_ignore": "false",
        "is_row_identifier": "false",
        "is_target": "false",
        "name": "Eig09_AEA.bo.",
        "number_of_missing_values": "0"
      },
      {
        "data_type": "numeric",
        "index": "22",
        "is_ignore": "false",
        "is_row_identifier": "false",
        "is_target": "false",
        "name": "Eig09_EA.bo.",
        "number_of_missing_values": "0"
      },
      {
        "data_type": "numeric",
        "index": "23",
        "is_ignore": "false",
        "is_row_identifier": "false",
        "is_target": "false",
        "name": "Xindex",
        "number_of_missing_values": "0"
      },
      {
        "data_type": "numeric",
        "index": "24",
        "is_ignore": "false",
        "is_row_identifier": "false",
        "is_target": "false",
        "name": "SM06_EA.bo.",
        "number_of_missing_values": "0"
      },
      {
        "data_type": "numeric",
        "index": "25",
        "is_ignore": "false",
        "is_row_identifier": "false",
        "is_target": "false",
        "name": "Eta_epsi_A",
        "number_of_missing_values": "0"
      },
      {
        "data_type": "numeric",
        "index": "26",
        "is_ignore": "false",
        "is_row_identifier": "false",
        "is_target": "false",
        "name": "Eig07_EA.bo.",
        "number_of_missing_values": "0"
      },
      {
        "data_type": "numeric",
        "index": "27",
        "is_ignore": "false",
        "is_row_identifier": "false",
        "is_target": "false",
        "name": "Me",
        "number_of_missing_values": "0"
      },
      {
        "data_type": "numeric",
        "index": "28",
        "is_ignore": "false",
        "is_row_identifier": "false",
        "is_target": "false",
        "name": "piPC02",
        "number_of_missing_values": "0"
      },
      {
        "data_type": "numeric",
        "index": "29",
        "is_ignore": "false",
        "is_row_identifier": "false",
        "is_target": "false",
        "name": "SM02_EA.bo.",
        "number_of_missing_values": "0"
      },
      {
        "data_type": "numeric",
        "index": "30",
        "is_ignore": "false",
        "is_row_identifier": "false",
        "is_target": "false",
        "name": "SM03_AEA.bo.",
        "number_of_missing_values": "0"
      },
      {
        "data_type": "numeric",
        "index": "31",
        "is_ignore": "false",
        "is_row_identifier": "false",
        "is_target": "false",
        "name": "SaaO",
        "number_of_missing_values": "0"
      },
      {
        "data_type": "numeric",
        "index": "32",
        "is_ignore": "false",
        "is_row_identifier": "false",
        "is_target": "false",
        "name": "nFuranes",
        "number_of_missing_values": "0"
      },
      {
        "data_type": "numeric",
        "index": "33",
        "is_ignore": "false",
        "is_row_identifier": "false",
        "is_target": "false",
        "name": "SM03_EA.bo.",
        "number_of_missing_values": "0"
      },
      {
        "data_type": "numeric",
        "index": "34",
        "is_ignore": "false",
        "is_row_identifier": "false",
        "is_target": "false",
        "name": "Eig08_AEA.bo.",
        "number_of_missing_values": "0"
      },
      {
        "data_type": "numeric",
        "index": "35",
        "is_ignore": "false",
        "is_row_identifier": "false",
        "is_target": "false",
        "name": "NaasC",
        "number_of_missing_values": "0"
      },
      {
        "data_type": "numeric",
        "index": "36",
        "is_ignore": "false",
        "is_row_identifier": "false",
        "is_target": "false",
        "name": "SM04_AEA.bo.",
        "number_of_missing_values": "0"
      },
      {
        "data_type": "numeric",
        "index": "37",
        "is_ignore": "false",
        "is_row_identifier": "false",
        "is_target": "false",
        "name": "Eig06_EA.ed.",
        "number_of_missing_values": "0"
      },
      {
        "data_type": "numeric",
        "index": "38",
        "is_ignore": "false",
        "is_row_identifier": "false",
        "is_target": "false",
        "name": "SM15_AEA.dm.",
        "number_of_missing_values": "0"
      },
      {
        "data_type": "numeric",
        "index": "39",
        "is_ignore": "false",
        "is_row_identifier": "false",
        "is_target": "false",
        "name": "SM05_AEA.bo.",
        "number_of_missing_values": "0"
      },
      {
        "data_type": "numeric",
        "index": "40",
        "is_ignore": "false",
        "is_row_identifier": "false",
        "is_target": "false",
        "name": "SM05_EA.bo.",
        "number_of_missing_values": "0"
      },
      {
        "data_type": "numeric",
        "index": "41",
        "is_ignore": "false",
        "is_row_identifier": "false",
        "is_target": "false",
        "name": "piPC05",
        "number_of_missing_values": "0"
      },
      {
        "data_type": "numeric",
        "index": "42",
        "is_ignore": "false",
        "is_row_identifier": "false",
        "is_target": "false",
        "name": "Ui",
        "number_of_missing_values": "0"
      },
      {
        "data_type": "numeric",
        "index": "43",
        "is_ignore": "false",
        "is_row_identifier": "false",
        "is_target": "false",
        "name": "P_VSA_s_6",
        "number_of_missing_values": "0"
      },
      {
        "data_type": "numeric",
        "index": "44",
        "is_ignore": "false",
        "is_row_identifier": "false",
        "is_target": "false",
        "name": "P_VSA_e_5",
        "number_of_missing_values": "0"
      },
      {
        "data_type": "numeric",
        "index": "45",
        "is_ignore": "false",
        "is_row_identifier": "false",
        "is_target": "false",
        "name": "ZM1Per",
        "number_of_missing_values": "0"
      },
      {
        "data_type": "numeric",
        "index": "46",
        "is_ignore": "false",
        "is_row_identifier": "false",
        "is_target": "false",
        "name": "Yindex",
        "number_of_missing_values": "0"
      },
      {
        "data_type": "numeric",
        "index": "47",
        "is_ignore": "false",
        "is_row_identifier": "false",
        "is_target": "false",
        "name": "SpMax2_Bh.s.",
        "number_of_missing_values": "0"
      },
      {
        "data_type": "numeric",
        "index": "48",
        "is_ignore": "false",
        "is_row_identifier": "false",
        "is_target": "false",
        "name": "Eig07_EA.ed.",
        "number_of_missing_values": "0"
      },
      {
        "data_type": "numeric",
        "index": "49",
        "is_ignore": "false",
        "is_row_identifier": "false",
        "is_target": "false",
        "name": "SM02_AEA.ri.",
        "number_of_missing_values": "0"
      },
      {
        "data_type": "numeric",
        "index": "50",
        "is_ignore": "false",
        "is_row_identifier": "false",
        "is_target": "false",
        "name": "NaaO",
        "number_of_missing_values": "0"
      },
      {
        "data_type": "numeric",
        "index": "51",
        "is_ignore": "false",
        "is_row_identifier": "false",
        "is_target": "false",
        "name": "Vindex",
        "number_of_missing_values": "0"
      },
      {
        "data_type": "numeric",
        "index": "52",
        "is_ignore": "false",
        "is_row_identifier": "false",
        "is_target": "false",
        "name": "SpMax4_Bh.m.",
        "number_of_missing_values": "0"
      },
      {
        "data_type": "numeric",
        "index": "53",
        "is_ignore": "false",
        "is_row_identifier": "false",
        "is_target": "false",
        "name": "Eig07_AEA.ed.",
        "number_of_missing_values": "0"
      },
      {
        "data_type": "numeric",
        "index": "54",
        "is_ignore": "false",
        "is_row_identifier": "false",
        "is_target": "false",
        "name": "nCb.",
        "number_of_missing_values": "0"
      },
      {
        "data_type": "numeric",
        "index": "55",
        "is_ignore": "false",
        "is_row_identifier": "false",
        "is_target": "false",
        "name": "SM06_AEA.bo.",
        "number_of_missing_values": "0"
      },
      {
        "data_type": "numeric",
        "index": "56",
        "is_ignore": "false",
        "is_row_identifier": "false",
        "is_target": "false",
        "name": "ZM2Per",
        "number_of_missing_values": "0"
      },
      {
        "data_type": "numeric",
        "index": "57",
        "is_ignore": "false",
        "is_row_identifier": "false",
        "is_target": "false",
        "name": "Eig04_EA.bo.",
        "number_of_missing_values": "0"
      },
      {
        "data_type": "numeric",
        "index": "58",
        "is_ignore": "false",
        "is_row_identifier": "false",
        "is_target": "false",
        "name": "SM14_AEA.ri.",
        "number_of_missing_values": "0"
      },
      {
        "data_type": "numeric",
        "index": "59",
        "is_ignore": "false",
        "is_row_identifier": "false",
        "is_target": "false",
        "name": "Eig06_EA.bo.",
        "number_of_missing_values": "0"
      },
      {
        "data_type": "numeric",
        "index": "60",
        "is_ignore": "false",
        "is_row_identifier": "false",
        "is_target": "false",
        "name": "ZM1MulPer",
        "number_of_missing_values": "0"
      },
      {
        "data_type": "numeric",
        "index": "61",
        "is_ignore": "false",
        "is_row_identifier": "false",
        "is_target": "false",
        "name": "P_VSA_p_2",
        "number_of_missing_values": "0"
      },
      {
        "data_type": "numeric",
        "index": "62",
        "is_ignore": "false",
        "is_row_identifier": "false",
        "is_target": "false",
        "name": "Eig10_EA.ed.",
        "number_of_missing_values": "0"
      },
      {
        "data_type": "numeric",
        "index": "63",
        "is_ignore": "false",
        "is_row_identifier": "false",
        "is_target": "false",
        "name": "SM05_AEA.ri.",
        "number_of_missing_values": "0"
      },
      {
        "data_type": "numeric",
        "index": "64",
        "is_ignore": "false",
        "is_row_identifier": "false",
        "is_target": "false",
        "name": "SpMAD_EA.bo.",
        "number_of_missing_values": "0"
      },
      {
        "data_type": "numeric",
        "index": "65",
        "is_ignore": "false",
        "is_row_identifier": "false",
        "is_target": "false",
        "name": "ATSC1e",
        "number_of_missing_values": "0"
      },
      {
        "data_type": "numeric",
        "index": "66",
        "is_ignore": "false",
        "is_row_identifier": "false",
        "is_target": "false",
        "name": "Eig08_EA.bo.",
        "number_of_missing_values": "0"
      },
      {
        "data_type": "numeric",
        "index": "67",
        "is_ignore": "false",
        "is_row_identifier": "false",
        "is_target": "false",
        "name": "P_VSA_LogP_6",
        "number_of_missing_values": "0"
      },
      {
        "data_type": "numeric",
        "index": "68",
        "is_ignore": "false",
        "is_row_identifier": "false",
        "is_target": "true",
        "name": "pXC50",
        "number_of_missing_values": "0"
      }
    ]
  }
}