{
  "data_features": {
    "feature": [
      {
        "data_type": "nominal",
        "index": "0",
        "is_ignore": "false",
        "is_row_identifier": "true",
        "is_target": "false",
        "name": "molecule_id",
        "nominal_value": [
          "CHEMBL1162110",
          "CHEMBL1172192",
          "CHEMBL1200467",
          "CHEMBL1299355",
          "CHEMBL1299555",
          "CHEMBL1299634",
          "CHEMBL1300115",
          "CHEMBL1300637",
          "CHEMBL1301353",
          "CHEMBL1303580",
          "CHEMBL1304374",
          "CHEMBL1304529",
          "CHEMBL1305092",
          "CHEMBL1308055",
          "CHEMBL1308594",
          "CHEMBL1308999",
          "CHEMBL1309354",
          "CHEMBL1309484",
          "CHEMBL1309643",
          "CHEMBL1311708",
          "CHEMBL1312200",
          "CHEMBL1312212",
          "CHEMBL1312241",
          "CHEMBL1313127",
          "CHEMBL1313807",
          "CHEMBL1317248",
          "CHEMBL1319003",
          "CHEMBL1324729",
          "CHEMBL1326647",
          "CHEMBL1327017",
          "CHEMBL1328027",
          "CHEMBL1328774",
          "CHEMBL1329141",
          "CHEMBL1329425",
          "CHEMBL1329925",
          "CHEMBL1330129",
          "CHEMBL1330475",
          "CHEMBL1331111",
          "CHEMBL1331532",
          "CHEMBL1333555",
          "CHEMBL1333587",
          "CHEMBL1333593",
          "CHEMBL1334010",
          "CHEMBL1335222",
          "CHEMBL1336283",
          "CHEMBL1336922",
          "CHEMBL1337189",
          "CHEMBL1339057",
          "CHEMBL1339324",
          "CHEMBL1341444",
          "CHEMBL1344745",
          "CHEMBL1345076",
          "CHEMBL1345458",
          "CHEMBL1345541",
          "CHEMBL1346887",
          "CHEMBL1347287",
          "CHEMBL1347678",
          "CHEMBL1348946",
          "CHEMBL1349290",
          "CHEMBL1350958",
          "CHEMBL1351108",
          "CHEMBL1352564",
          "CHEMBL1353506",
          "CHEMBL1353738",
          "CHEMBL1354041",
          "CHEMBL1358863",
          "CHEMBL1360615",
          "CHEMBL1361054",
          "CHEMBL1361582",
          "CHEMBL1362734",
          "CHEMBL1365080",
          "CHEMBL1365787",
          "CHEMBL1366367",
          "CHEMBL1366428",
          "CHEMBL1367339",
          "CHEMBL1367952",
          "CHEMBL1368444",
          "CHEMBL1369492",
          "CHEMBL1371004",
          "CHEMBL1372387",
          "CHEMBL1372836",
          "CHEMBL1373145",
          "CHEMBL1373248",
          "CHEMBL1373937",
          "CHEMBL1374603",
          "CHEMBL1375441",
          "CHEMBL1376311",
          "CHEMBL1376711",
          "CHEMBL1377441",
          "CHEMBL1377466",
          "CHEMBL1379125",
          "CHEMBL1379737",
          "CHEMBL1379894",
          "CHEMBL1381474",
          "CHEMBL1381868",
          "CHEMBL1382081",
          "CHEMBL1382616",
          "CHEMBL1382785",
          "CHEMBL1382968",
          "CHEMBL1384843",
          "CHEMBL1388816",
          "CHEMBL1390211",
          "CHEMBL1390923",
          "CHEMBL1391063",
          "CHEMBL1391588",
          "CHEMBL1392551",
          "CHEMBL1393256",
          "CHEMBL1393876",
          "CHEMBL1394204",
          "CHEMBL1395453",
          "CHEMBL1398964",
          "CHEMBL1400127",
          "CHEMBL1400449",
          "CHEMBL1400492",
          "CHEMBL1401029",
          "CHEMBL1401327",
          "CHEMBL1402117",
          "CHEMBL1405684",
          "CHEMBL1407208",
          "CHEMBL1408468",
          "CHEMBL1409007",
          "CHEMBL1409780",
          "CHEMBL1410860",
          "CHEMBL1412254",
          "CHEMBL1412423",
          "CHEMBL1414480",
          "CHEMBL1415285",
          "CHEMBL1416601",
          "CHEMBL1417070",
          "CHEMBL1417320",
          "CHEMBL1417710",
          "CHEMBL1418600",
          "CHEMBL1419357",
          "CHEMBL1420102",
          "CHEMBL1420297",
          "CHEMBL1420379",
          "CHEMBL1421172",
          "CHEMBL1421333",
          "CHEMBL1422112",
          "CHEMBL1422601",
          "CHEMBL1422763",
          "CHEMBL1424505",
          "CHEMBL1424631",
          "CHEMBL1424694",
          "CHEMBL1424929",
          "CHEMBL1425314",
          "CHEMBL1425600",
          "CHEMBL1425797",
          "CHEMBL1425879",
          "CHEMBL1430309",
          "CHEMBL1430983",
          "CHEMBL1431163",
          "CHEMBL1431851",
          "CHEMBL1432044",
          "CHEMBL1432920",
          "CHEMBL1433128",
          "CHEMBL1433919",
          "CHEMBL1434750",
          "CHEMBL1436001",
          "CHEMBL1438552",
          "CHEMBL1439800",
          "CHEMBL1440277",
          "CHEMBL1442758",
          "CHEMBL1444094",
          "CHEMBL1444373",
          "CHEMBL1445720",
          "CHEMBL1447137",
          "CHEMBL1448410",
          "CHEMBL1450861",
          "CHEMBL1452254",
          "CHEMBL1453077",
          "CHEMBL1453524",
          "CHEMBL1454687",
          "CHEMBL1454848",
          "CHEMBL1455522",
          "CHEMBL1456611",
          "CHEMBL1457048",
          "CHEMBL1457077",
          "CHEMBL1460470",
          "CHEMBL1461925",
          "CHEMBL1461928",
          "CHEMBL1462469",
          "CHEMBL1462524",
          "CHEMBL1462906",
          "CHEMBL1463410",
          "CHEMBL1463468",
          "CHEMBL1464039",
          "CHEMBL1464449",
          "CHEMBL1465297",
          "CHEMBL1465398",
          "CHEMBL1466898",
          "CHEMBL1466929",
          "CHEMBL1467130",
          "CHEMBL1468612",
          "CHEMBL1469489",
          "CHEMBL1471907",
          "CHEMBL1472544",
          "CHEMBL1475023",
          "CHEMBL1478587",
          "CHEMBL1482585",
          "CHEMBL1482884",
          "CHEMBL1483620",
          "CHEMBL1484552",
          "CHEMBL1485064",
          "CHEMBL1485818",
          "CHEMBL1486470",
          "CHEMBL1486536",
          "CHEMBL1486792",
          "CHEMBL1487870",
          "CHEMBL1487959",
          "CHEMBL1491528",
          "CHEMBL1492305",
          "CHEMBL1492565",
          "CHEMBL1493125",
          "CHEMBL1494387",
          "CHEMBL1495674",
          "CHEMBL1497153",
          "CHEMBL1497796",
          "CHEMBL1498887",
          "CHEMBL1499010",
          "CHEMBL1499794",
          "CHEMBL1499798",
          "CHEMBL1500050",
          "CHEMBL1500933",
          "CHEMBL1500942",
          "CHEMBL1501475",
          "CHEMBL1501743",
          "CHEMBL1502163",
          "CHEMBL1503209",
          "CHEMBL1503985",
          "CHEMBL1504461",
          "CHEMBL1504817",
          "CHEMBL1505688",
          "CHEMBL1506127",
          "CHEMBL1506475",
          "CHEMBL1506595",
          "CHEMBL1507021",
          "CHEMBL1507128",
          "CHEMBL1507470",
          "CHEMBL1509704",
          "CHEMBL1510501",
          "CHEMBL1515202",
          "CHEMBL1517258",
          "CHEMBL1517470",
          "CHEMBL1517683",
          "CHEMBL1518236",
          "CHEMBL1518422",
          "CHEMBL1519464",
          "CHEMBL1520046",
          "CHEMBL1521669",
          "CHEMBL1521778",
          "CHEMBL1522210",
          "CHEMBL1522531",
          "CHEMBL1523577",
          "CHEMBL1523836",
          "CHEMBL1525576",
          "CHEMBL1526088",
          "CHEMBL1527520",
          "CHEMBL1528089",
          "CHEMBL1528476",
          "CHEMBL1529285",
          "CHEMBL1529306",
          "CHEMBL1532323",
          "CHEMBL1533269",
          "CHEMBL1533561",
          "CHEMBL1535636",
          "CHEMBL1536174",
          "CHEMBL1536292",
          "CHEMBL1536896",
          "CHEMBL1537504",
          "CHEMBL1538738",
          "CHEMBL1542151",
          "CHEMBL1543779",
          "CHEMBL1543994",
          "CHEMBL1544885",
          "CHEMBL1545384",
          "CHEMBL1545396",
          "CHEMBL1546890",
          "CHEMBL1547640",
          "CHEMBL1547867",
          "CHEMBL1548297",
          "CHEMBL1553969",
          "CHEMBL1555218",
          "CHEMBL1557573",
          "CHEMBL1557935",
          "CHEMBL1559100",
          "CHEMBL1559790",
          "CHEMBL1559883",
          "CHEMBL1560577",
          "CHEMBL1561488",
          "CHEMBL1563863",
          "CHEMBL1564716",
          "CHEMBL1566530",
          "CHEMBL1568419",
          "CHEMBL1569215",
          "CHEMBL1570324",
          "CHEMBL1571082",
          "CHEMBL1571480",
          "CHEMBL1575481",
          "CHEMBL1576198",
          "CHEMBL1577545",
          "CHEMBL1578306",
          "CHEMBL1579270",
          "CHEMBL1580170",
          "CHEMBL1580239",
          "CHEMBL1580660",
          "CHEMBL1580684",
          "CHEMBL1583537",
          "CHEMBL1585309",
          "CHEMBL1587159",
          "CHEMBL1587489",
          "CHEMBL1589514",
          "CHEMBL1594818",
          "CHEMBL1595441",
          "CHEMBL1595563",
          "CHEMBL1596373",
          "CHEMBL1598628",
          "CHEMBL1600068",
          "CHEMBL1600580",
          "CHEMBL1602800",
          "CHEMBL1604122",
          "CHEMBL1604719",
          "CHEMBL1605235",
          "CHEMBL1605425",
          "CHEMBL1605668",
          "CHEMBL1608106",
          "CHEMBL1609429",
          "CHEMBL1610008",
          "CHEMBL1612433",
          "CHEMBL1612580",
          "CHEMBL1672291",
          "CHEMBL1672292",
          "CHEMBL1701224",
          "CHEMBL171637",
          "CHEMBL1966700",
          "CHEMBL1968273",
          "CHEMBL1970819",
          "CHEMBL1970867",
          "CHEMBL1971015",
          "CHEMBL1971033",
          "CHEMBL1976042",
          "CHEMBL1979756",
          "CHEMBL1982888",
          "CHEMBL1985327",
          "CHEMBL1986027",
          "CHEMBL1989234",
          "CHEMBL1992702",
          "CHEMBL1994007",
          "CHEMBL1994371",
          "CHEMBL1994988",
          "CHEMBL1999473",
          "CHEMBL2000167",
          "CHEMBL2001743",
          "CHEMBL2003887",
          "CHEMBL2005484",
          "CHEMBL201289",
          "CHEMBL221415",
          "CHEMBL223453",
          "CHEMBL230683",
          "CHEMBL287542",
          "CHEMBL290106",
          "CHEMBL388590",
          "CHEMBL399293",
          "CHEMBL406652",
          "CHEMBL458328",
          "CHEMBL496",
          "CHEMBL551842",
          "CHEMBL81935"
        ],
        "number_of_missing_values": "0"
      },
      {
        "data_type": "numeric",
        "index": "1",
        "is_ignore": "false",
        "is_row_identifier": "false",
        "is_target": "false",
        "name": "AMW",
        "number_of_missing_values": "0"
      },
      {
        "data_type": "numeric",
        "index": "2",
        "is_ignore": "false",
        "is_row_identifier": "false",
        "is_target": "false",
        "name": "C.",
        "number_of_missing_values": "0"
      },
      {
        "data_type": "numeric",
        "index": "3",
        "is_ignore": "false",
        "is_row_identifier": "false",
        "is_target": "false",
        "name": "H.",
        "number_of_missing_values": "0"
      },
      {
        "data_type": "numeric",
        "index": "4",
        "is_ignore": "false",
        "is_row_identifier": "false",
        "is_target": "false",
        "name": "Me",
        "number_of_missing_values": "0"
      },
      {
        "data_type": "numeric",
        "index": "5",
        "is_ignore": "false",
        "is_row_identifier": "false",
        "is_target": "false",
        "name": "Mi",
        "number_of_missing_values": "0"
      },
      {
        "data_type": "numeric",
        "index": "6",
        "is_ignore": "false",
        "is_row_identifier": "false",
        "is_target": "false",
        "name": "Mp",
        "number_of_missing_values": "0"
      },
      {
        "data_type": "numeric",
        "index": "7",
        "is_ignore": "false",
        "is_row_identifier": "false",
        "is_target": "false",
        "name": "Mv",
        "number_of_missing_values": "0"
      },
      {
        "data_type": "numeric",
        "index": "8",
        "is_ignore": "false",
        "is_row_identifier": "false",
        "is_target": "false",
        "name": "MW",
        "number_of_missing_values": "0"
      },
      {
        "data_type": "numeric",
        "index": "9",
        "is_ignore": "false",
        "is_row_identifier": "false",
        "is_target": "false",
        "name": "N.",
        "number_of_missing_values": "0"
      },
      {
        "data_type": "numeric",
        "index": "10",
        "is_ignore": "false",
        "is_row_identifier": "false",
        "is_target": "false",
        "name": "nAB",
        "number_of_missing_values": "0"
      },
      {
        "data_type": "numeric",
        "index": "11",
        "is_ignore": "false",
        "is_row_identifier": "false",
        "is_target": "false",
        "name": "nAT",
        "number_of_missing_values": "0"
      },
      {
        "data_type": "numeric",
        "index": "12",
        "is_ignore": "false",
        "is_row_identifier": "false",
        "is_target": "true",
        "name": "pXC50",
        "number_of_missing_values": "0"
      }
    ]
  }
}