"molecule_id","Eig01_EA.bo.","SM11_AEA.ri.","SpDiam_EA.bo.","SpMax_EA.bo.","SM11_EA.bo.","SM12_EA.bo.","SM13_EA.bo.","SM14_EA.bo.","SM15_EA.bo.","Eig01_AEA.bo.","Eig01_AEA.ed.","Eig01_AEA.ri.","Eig01_EA","Eig01_EA.ed.","SM07_EA.ed.","SM08_EA.ed.","SM09_AEA.bo.","SM09_EA.ed.","SM10_AEA.dm.","SM10_EA.ed.","SM11_EA.ed.","SM12_EA.ed.","SM13_AEA.ed.","SM13_EA.ed.","SM14_AEA.ed.","SM14_EA.ed.","SM15_AEA.ed.","SM15_EA.ed.","SpDiam_AEA.bo.","SpDiam_AEA.ri.","SpDiam_EA","SpDiam_EA.ed.","SpMax_AEA.bo.","SpMax_AEA.ed.","SpMax_AEA.ri.","SpMax_EA","SpMax_EA.ed.","SM03_EA.ri.","ATSC2i","ATSC3i","ATSC4i","GGI9","SPI","X2","SpDiam_AEA.ed.","SM08_EA.bo.","SM09_EA.bo.","SM10_EA.bo.","SpMAD_AEA.bo.","AAC","AECC","ALOGP","ALOGP2","AMR","AMW","ARR","ATS1e","ATS1i","ATS1m","ATS1p","ATS1s","ATS1v","ATS2e","ATS2i","ATS2m","ATS2p","ATS2s","ATS2v","ATS3e","ATS3i","ATS3m","ATS3p","ATS3s","ATS3v","ATS4e","ATS4i","ATS4m","ATS4p","ATS4s","ATS4v","ATS5e","ATS5i","ATS5m","ATS5p","ATS5s","ATS5v","ATS6e","ATS6i","ATS6m","ATS6p","ATS6s","ATS6v","ATS7e","ATS7i","ATS7m","ATS7p","ATS7s","ATS7v","ATS8e","ATS8i","ATS8m","ATS8p","ATS8s","ATS8v","ATSC1e","ATSC1i","ATSC1m","ATSC1p","ATSC1s","ATSC1v","ATSC2e","ATSC2m","ATSC2p","ATSC2s","ATSC2v","ATSC3e","ATSC3m","pXC50"
{1 3.852,2 3.852,3 6.852,4 3.852,5 15.457,6 16.898,7 18.123,8 19.524,9 20.791,10 4.44,11 7.111,12 4.313,13 3.314,14 11.657,15 17.328,16 19.799,17 3.314,18 22.183,19 11.657,20 24.634,21 27.06,22 29.509,23 25.67,24 31.952,25 27.603,26 34.403,27 29.541,28 36.853,29 5.273,30 5.37,31 5.314,32 18.537,33 4.44,34 7.111,35 4.313,36 3.314,37 11.657,38 4.049,39 0.932,40 1.167,41 1.201,42 0.16,43 15.154,44 10.707,45 6.525,46 11.737,47 12.791,48 14.297,49 1.524,50 1.504,51 10.913,52 4.068,53 16.552,54 91.748,55 7.078,56 0.5,57 3.85,58 3.981,59 3.349,60 3.377,61 5.025,62 3.348,63 4.325,64 4.496,65 3.716,66 3.745,67 5.523,68 3.694,69 4.596,70 4.78,71 3.722,72 3.905,73 5.716,74 3.82,75 4.77,76 5.034,77 3.613,78 3.86,79 5.796,80 3.733,81 4.568,82 4.817,83 3.434,84 3.682,85 5.663,86 3.562,87 4.36,88 4.62,89 3.293,90 3.468,91 5.415,92 3.356,93 4.11,94 4.305,95 3.153,96 3.289,97 5.175,98 3.226,99 3.991,100 4.179,101 3.247,102 3.236,103 5.442,104 3.177,105 0.042,106 0.619,107 9.424,108 3.921,109 11.509,110 5.29,111 0.225,112 16.071,113 6.795,114 34.529,115 9.132,116 0.152,117 21.48,118 7.545}
{0 CHEMBL147344,1 3.793,2 3.793,3 6.793,4 3.793,5 15.14,6 16.605,7 17.775,8 19.189,9 20.411,10 4.22,11 6.061,12 3.846,13 2.867,14 8.736,15 15.558,16 17.849,17 2.867,18 19.813,19 8.736,20 22.019,21 24.072,22 26.244,23 23.918,24 28.345,25 25.673,26 30.505,27 27.432,28 32.633,29 5.074,30 4.918,31 4.867,32 14.918,33 4.22,34 6.061,35 3.846,36 2.867,37 8.736,38 3.47,39 0.916,40 1.056,41 0.969,42 0.1,43 13.082,44 10.006,45 5.971,46 11.536,47 12.502,48 14.05,49 1.434,50 1.563,51 12.833,52 3.98,53 15.843,54 93.418,55 7.276,56 0.48,57 3.885,58 4.007,59 3.406,60 3.374,61 5.064,62 3.363,63 4.359,64 4.518,65 3.705,66 3.692,67 5.574,68 3.653,69 4.6,70 4.815,71 3.698,72 3.758,73 5.696,74 3.707,75 4.566,76 4.782,77 3.61,78 3.68,79 5.702,80 3.621,81 4.466,82 4.677,83 3.523,84 3.638,85 5.647,86 3.567,87 4.377,88 4.599,89 3.407,90 3.617,91 5.457,92 3.508,93 4.35,94 4.58,95 3.3,96 3.512,97 5.386,98 3.397,99 4.214,100 4.45,101 3.242,102 3.289,103 5.467,104 3.2,105 0.057,106 0.627,107 9.468,108 3.969,109 12.206,110 5.182,111 0.27,112 16.524,113 6.683,114 35.751,115 8.716,116 0.325,117 22.862,118 7.943}
{0 CHEMBL148731,1 3.793,2 3.793,3 6.793,4 3.793,5 15.137,6 16.602,7 17.772,8 19.186,9 20.408,10 4.22,11 6.061,12 3.846,13 2.866,14 8.736,15 15.543,16 17.831,17 2.866,18 19.798,19 8.736,20 22.004,21 24.058,22 26.231,23 23.909,24 28.334,25 25.664,26 30.495,27 27.424,28 32.624,29 5.049,30 4.902,31 4.866,32 14.917,33 4.22,34 6.061,35 3.846,36 2.866,37 8.736,38 3.47,39 0.728,40 0.838,41 0.79,42 0.08,43 11.704,44 8.918,45 5.614,46 11.532,47 12.5,48 14.046,49 1.461,50 1.65,51 10.619,52 2.652,53 7.031,54 79.545,55 7.926,56 0.545,57 3.689,58 3.801,59 3.283,60 3.174,61 4.966,62 3.191,63 4.113,64 4.247,65 3.592,66 3.48,67 5.455,68 3.479,69 4.3,70 4.467,71 3.585,72 3.555,73 5.542,74 3.542,75 4.328,76 4.517,77 3.464,78 3.481,79 5.569,80 3.443,81 4.235,82 4.443,83 3.333,84 3.389,85 5.502,86 3.331,87 4.088,88 4.312,89 3.178,90 3.281,91 5.26,92 3.201,93 3.956,94 4.156,95 3.068,96 3.135,97 5.128,98 3.071,99 3.794,100 3.99,101 3.054,102 2.952,103 5.274,104 2.912,105 0.095,106 0.513,107 6.656,108 2.957,109 12.363,110 3.525,111 0.316,112 11.504,113 4.909,114 31.517,115 5.86,116 0.309,117 14.777,118 7.788}
{0 CHEMBL148833,1 3.854,2 3.854,3 6.854,4 3.854,5 15.347,6 16.805,7 18.025,8 19.437,9 20.702,10 4.271,11 6.206,12 3.889,13 2.93,14 9.245,15 15.987,16 18.319,17 2.93,18 20.387,19 9.245,20 22.643,21 24.78,22 27.005,23 24.314,24 29.177,25 26.108,26 31.39,27 27.906,28 33.58,29 5.109,30 4.948,31 4.93,32 15.655,33 4.271,34 6.206,35 3.889,36 2.93,37 9.245,38 3.47,39 0.728,40 0.838,41 0.79,42 0.086,43 11.515,44 8.836,45 5.9,46 11.628,47 12.662,48 14.197,49 1.461,50 1.65,51 9.476,52 2.652,53 7.031,54 79.545,55 7.926,56 0.545,57 3.689,58 3.801,59 3.283,60 3.174,61 4.967,62 3.191,63 4.113,64 4.247,65 3.592,66 3.48,67 5.448,68 3.479,69 4.302,70 4.467,71 3.627,72 3.555,73 5.561,74 3.548,75 4.338,76 4.517,77 3.539,78 3.486,79 5.596,80 3.472,81 4.275,82 4.455,83 3.424,84 3.428,85 5.603,86 3.398,87 4.171,88 4.387,89 3.28,90 3.374,91 5.382,92 3.298,93 4.083,94 4.288,95 3.117,96 3.245,97 5.222,98 3.175,99 3.895,100 4.093,101 3.008,102 3.071,103 5.285,104 2.984,105 0.095,106 0.513,107 6.656,108 2.957,109 12.382,110 3.525,111 0.316,112 11.504,113 4.909,114 31.71,115 5.86,116 0.365,117 14.786,118 7.564}
{0 CHEMBL148957,1 3.957,2 3.957,3 6.957,4 3.957,5 15.573,6 17.026,7 18.29,8 19.706,9 21.009,10 4.359,11 6.462,12 3.989,13 3.015,14 9.99,15 16.402,16 18.789,17 3.015,18 20.947,19 9.99,20 23.269,21 25.496,22 27.795,23 24.699,24 30.055,25 26.528,26 32.347,27 28.361,28 34.624,29 5.206,30 5.05,31 5.015,32 16.723,33 4.359,34 6.462,35 3.989,36 3.015,37 9.99,38 3.666,39 0.766,40 0.894,41 0.849,42 0.131,43 13.677,44 9.717,45 6.144,46 11.768,47 12.855,48 14.374,49 1.465,50 1.686,51 10.174,52 2.523,53 6.368,54 84.61,55 8.246,56 0.5,57 3.746,58 3.849,59 3.366,60 3.233,61 5.063,62 3.259,63 4.173,64 4.295,65 3.691,66 3.545,67 5.589,68 3.553,69 4.358,70 4.513,71 3.741,72 3.633,73 5.68,74 3.642,75 4.446,76 4.602,77 3.725,78 3.563,79 5.868,80 3.583,81 4.319,82 4.469,83 3.599,84 3.51,85 5.718,86 3.519,87 4.311,88 4.491,89 3.479,90 3.495,91 5.743,92 3.445,93 4.195,94 4.404,95 3.315,96 3.397,97 5.373,98 3.33,99 4.098,100 4.285,101 3.242,102 3.182,103 5.586,104 3.148,105 0.132,106 0.537,107 6.425,108 3.121,109 15.828,110 3.501,111 0.444,112 11.49,113 5.159,114 41.836,115 5.934,116 0.336,117 14.431,118 7.889}
{0 CHEMBL149135,1 3.797,2 3.797,3 6.797,4 3.797,5 15.205,6 16.663,7 17.844,8 19.253,9 20.483,10 4.225,11 6.063,12 3.856,13 2.876,14 8.744,15 15.788,16 18.077,17 2.876,18 20.067,19 8.744,20 22.272,21 24.338,22 26.508,23 24.2,24 28.613,25 25.969,26 30.769,27 27.741,28 32.895,29 5.055,30 4.911,31 4.876,32 14.932,33 4.225,34 6.063,35 3.856,36 2.876,37 8.744,38 3.672,39 0.863,40 1.041,41 1.009,42 0.12,43 13.514,44 9.648,45 5.478,46 11.578,47 12.564,48 14.1,49 1.491,50 1.529,51 10.773,52 3.862,53 14.917,54 87.273,55 7.253,56 0.522,57 3.787,58 3.915,59 3.307,60 3.315,61 4.98,62 3.293,63 4.247,64 4.411,65 3.64,66 3.661,67 5.475,68 3.611,69 4.501,70 4.702,71 3.645,72 3.774,73 5.625,74 3.703,75 4.565,76 4.796,77 3.54,78 3.71,79 5.681,80 3.614,81 4.445,82 4.685,83 3.381,84 3.569,85 5.586,86 3.469,87 4.249,88 4.493,89 3.235,90 3.394,91 5.349,92 3.294,93 4.046,94 4.247,95 3.098,96 3.246,97 5.108,98 3.173,99 3.935,100 4.129,101 3.149,102 3.152,103 5.383,104 3.087,105 0.039,106 0.581,107 8.524,108 3.578,109 11.492,110 4.744,111 0.209,112 14.441,113 6.179,114 31.879,115 8.203,116 0.171,117 19.686,118 8.18}
{0 CHEMBL149156,1 3.961,2 3.961,3 6.961,4 3.961,5 15.589,6 17.04,7 18.304,8 19.718,9 21.022,10 4.349,11 6.441,12 4.001,13 3.027,14 9.917,15 16.371,16 18.756,17 3.027,18 20.895,19 9.917,20 23.212,21 25.426,22 27.719,23 24.685,24 29.969,25 26.508,26 32.254,27 28.335,28 34.521,29 5.193,30 5.062,31 5.027,32 16.6,33 4.349,34 6.441,35 4.001,36 3.027,37 9.917,38 3.814,39 0.926,40 1.121,41 1.126,42 0.157,43 14.883,44 10.21,45 5.855,46 11.787,47 12.876,48 14.39,49 1.496,50 1.504,51 9.696,52 4.348,53 18.909,54 92.314,55 7.078,56 0.5,57 3.85,58 3.981,59 3.349,60 3.377,61 5.021,62 3.348,63 4.324,64 4.499,65 3.694,66 3.73,67 5.513,68 3.676,69 4.565,70 4.758,71 3.736,72 3.863,73 5.674,74 3.792,75 4.686,76 4.913,77 3.707,78 3.827,79 5.783,80 3.746,81 4.603,82 4.812,83 3.571,84 3.743,85 5.736,86 3.665,87 4.47,88 4.697,89 3.515,90 3.704,91 5.614,92 3.601,93 4.46,94 4.667,95 3.333,96 3.665,97 5.569,98 3.542,99 4.422,100 4.689,101 3.232,102 3.562,103 5.538,104 3.39,105 0.042,106 0.619,107 9.424,108 3.921,109 11.29,110 5.29,111 0.226,112 16.109,113 6.77,114 32.64,115 9.123,116 0.149,117 21.026,118 6.523}
{0 CHEMBL149157,1 3.934,2 3.934,3 6.934,4 3.934,5 15.542,6 16.993,7 18.247,8 19.659,9 20.953,10 4.31,11 6.232,12 3.919,13 2.962,14 9.364,15 16.108,16 18.45,17 2.962,18 20.515,19 9.364,20 22.781,21 24.923,22 27.159,23 24.416,24 29.339,25 26.208,26 31.565,27 28.003,28 33.765,29 5.15,30 4.983,31 4.962,32 15.858,33 4.31,34 6.232,35 3.919,36 2.962,37 9.364,38 3.641,39 0.865,40 1.025,41 1.026,42 0.096,43 14.291,44 10.02,45 6.001,46 11.764,47 12.838,48 14.356,49 1.457,50 1.583,51 11.375,52 3.66,53 13.392,54 93.833,55 7.567,56 0.48,57 3.845,58 3.962,59 3.401,60 3.348,61 5.092,62 3.345,63 4.285,64 4.431,65 3.709,66 3.664,67 5.553,68 3.641,69 4.49,70 4.662,71 3.77,72 3.778,73 5.692,74 3.744,75 4.577,76 4.776,77 3.727,78 3.755,79 5.757,80 3.71,81 4.53,82 4.717,83 3.646,84 3.696,85 5.792,86 3.649,87 4.447,88 4.656,89 3.509,90 3.63,91 5.616,92 3.55,93 4.397,94 4.618,95 3.371,96 3.519,97 5.486,98 3.438,99 4.217,100 4.414,101 3.279,102 3.382,103 5.567,104 3.297,105 0.068,106 0.599,107 8.483,108 3.696,109 14.533,110 4.628,111 0.296,112 14.577,113 6.108,114 35.523,115 7.649,116 0.324,117 18.606,118 7.863}
{0 CHEMBL149324,1 3.786,2 3.786,3 6.786,4 3.786,5 14.925,6 16.418,7 17.554,8 18.987,9 20.185,10 4.215,11 6.06,12 3.842,13 2.861,14 8.732,15 15.421,16 17.723,17 2.861,18 19.703,19 8.732,20 21.919,21 23.985,22 26.166,23 23.788,24 28.277,25 25.551,26 30.444,27 27.319,28 32.579,29 5.039,30 4.886,31 4.861,32 14.909,33 4.215,34 6.06,35 3.842,36 2.861,37 8.732,38 3.308,39 0.667,40 0.779,41 0.683,42 0.07,43 9.255,44 8.127,45 5.862,46 11.384,47 12.292,48 13.88,49 1.469,50 1.62,51 9.263,52 2.668,53 7.118,54 73.082,55 7.978,56 0.6,57 3.569,58 3.686,59 3.17,60 3.102,61 4.852,62 3.107,63 3.97,64 4.096,65 3.48,66 3.413,67 5.343,68 3.392,69 4.211,70 4.4,71 3.437,72 3.455,73 5.431,74 3.422,75 4.177,76 4.381,77 3.325,78 3.308,79 5.439,80 3.277,81 4.001,82 4.184,83 3.204,84 3.206,85 5.355,86 3.184,87 3.907,88 4.11,89 3.05,90 3.18,91 5.154,92 3.099,93 3.841,94 4.067,95 2.848,96 3.062,97 4.902,98 2.956,99 3.651,100 3.876,101 2.78,102 2.797,103 5.106,104 2.707,105 0.069,106 0.465,107 5.731,108 2.55,109 11.743,110 3.058,111 0.21,112 9.057,113 4.321,114 24.124,115 5.278,116 0.23,117 13.703,118 8.252}
{0 CHEMBL150009,1 3.881,2 3.881,3 6.881,4 3.881,5 15.488,6 16.932,7 18.167,8 19.572,9 20.848,10 4.455,11 7.116,12 4.18,13 3.32,14 11.69,15 17.344,16 19.821,17 3.32,18 22.206,19 11.69,20 24.661,21 27.089,22 29.542,23 25.679,24 31.987,25 27.613,26 34.442,27 29.552,28 36.894,29 5.29,30 5.239,31 5.32,32 18.672,33 4.455,34 7.116,35 4.18,36 3.32,37 11.69,38 3.789,39 1.385,40 1.136,41 1.126,42 0.144,43 14.97,44 10.719,45 6.662,46 11.748,47 12.811,48 14.319,49 1.527,50 1.897,51 10.304,52 3.61,53 13.034,54 79.056,55 9.237,56 0.5,57 3.686,58 3.792,59 3.384,60 3.17,61 5.054,62 3.22,63 4.156,64 4.27,65 3.84,66 3.492,67 6.087,68 3.538,69 4.335,70 4.498,71 3.751,72 3.563,73 5.78,74 3.594,75 4.41,76 4.602,77 3.696,78 3.437,79 5.905,80 3.492,81 4.235,82 4.395,83 3.614,84 3.307,85 5.901,86 3.364,87 4.067,88 4.259,89 3.346,90 3.269,91 5.472,92 3.254,93 4.041,94 4.223,95 3.406,96 3.178,97 5.833,98 3.179,99 3.86,100 4.036,101 3.318,102 2.997,103 5.565,104 3.031,105 0.257,106 0.722,107 4.42,108 2.987,109 46.427,110 2.794,111 0.907,112 8.79,113 5.162,114 148.023,115 4.964,116 0.637,117 12.053,118 7.415}
{0 CHEMBL151454,1 3.792,2 3.792,3 6.792,4 3.792,5 15.11,6 16.578,7 17.744,8 19.159,9 20.378,10 4.219,11 6.061,12 3.845,13 2.865,14 8.735,15 15.478,16 17.778,17 2.865,18 19.744,19 8.735,20 21.958,21 24.016,22 26.195,23 23.853,24 28.3,25 25.61,26 30.466,27 27.372,28 32.597,29 5.046,30 4.895,31 4.865,32 14.914,33 4.219,34 6.061,35 3.845,36 2.865,37 8.735,38 3.507,39 0.731,40 0.857,41 0.795,42 0.08,43 11.219,44 8.749,45 5.475,46 11.512,47 12.474,48 14.024,49 1.476,50 1.588,51 9.95,52 3.154,53 9.949,54 78.123,55 7.695,56 0.571,57 3.647,58 3.768,59 3.218,60 3.178,61 4.897,62 3.173,63 4.07,64 4.215,65 3.543,66 3.501,67 5.389,68 3.472,69 4.294,70 4.475,71 3.514,72 3.574,73 5.502,74 3.528,75 4.334,76 4.556,77 3.382,78 3.452,79 5.525,80 3.388,81 4.142,82 4.353,83 3.264,84 3.295,85 5.419,86 3.253,87 3.981,88 4.177,89 3.108,90 3.227,91 5.206,92 3.156,93 3.903,94 4.12,95 2.978,96 3.153,97 4.989,98 3.058,99 3.812,100 4.022,101 2.92,102 2.96,103 5.262,104 2.88,105 0.058,106 0.503,107 6.678,108 2.892,109 11.485,110 3.629,111 0.214,112 11.041,113 4.944,114 27.524,115 6.293,116 0.195,117 14.966,118 8.481}
{0 CHEMBL151747,1 3.798,2 3.798,3 6.798,4 3.798,5 15.211,6 16.674,7 17.854,8 19.265,9 20.496,10 4.224,11 6.061,12 3.846,13 2.866,14 8.736,15 15.543,16 17.831,17 2.866,18 19.798,19 8.736,20 22.004,21 24.058,22 26.231,23 23.909,24 28.334,25 25.664,26 30.495,27 27.424,28 32.624,29 5.051,30 4.899,31 4.866,32 14.917,33 4.224,34 6.061,35 3.846,36 2.866,37 8.736,38 3.507,39 0.695,40 0.839,41 0.767,42 0.08,43 11.704,44 8.918,45 5.614,46 11.589,47 12.566,48 14.11,49 1.52,50 1.662,51 10.619,52 2.547,53 6.487,54 78.82,55 8.494,56 0.545,57 3.602,58 3.713,59 3.254,60 3.156,61 4.968,62 3.171,63 3.994,64 4.111,65 3.568,66 3.472,67 5.407,68 3.465,69 4.248,70 4.42,71 3.567,72 3.544,73 5.561,74 3.526,75 4.246,76 4.441,77 3.447,78 3.406,79 5.601,80 3.385,81 4.062,82 4.245,83 3.304,84 3.261,85 5.474,86 3.251,87 3.939,88 4.132,89 3.161,90 3.217,91 5.267,92 3.155,93 3.869,94 4.082,95 3.023,96 3.131,97 5.051,98 3.056,99 3.722,100 3.925,101 3.029,102 2.92,103 5.398,104 2.877,105 0.088,106 0.488,107 5.025,108 2.477,109 16.181,110 2.71,111 0.227,112 7.92,113 4.205,114 27.441,115 4.868,116 0.268,117 12.58,118 8.921}
{0 CHEMBL1834511,1 4.707,2 4.707,3 7.707,4 4.707,5 17.252,6 18.787,7 20.289,8 21.821,9 23.343,10 4.856,11 7.308,12 4.312,13 3.392,14 12.507,15 17.84,16 20.374,17 3.392,18 22.827,19 12.507,20 25.345,21 27.841,22 30.358,23 26.062,24 32.871,25 28.017,26 35.391,27 29.978,28 37.911,29 5.683,30 5.364,31 5.392,32 19.846,33 4.856,34 7.308,35 4.312,36 3.392,37 12.507,38 4.056,39 1.043,40 1.221,41 1.247,42 0.175,43 15.332,44 12.029,45 7.077,46 12.847,47 14.236,48 15.787,49 1.507,50 1.737,51 12.852,52 4.163,53 17.329,54 104.317,55 8.38,56 0.586,57 3.935,58 4.028,59 3.747,60 3.519,61 5.078,62 3.486,63 4.444,64 4.576,65 4.021,66 3.865,67 5.837,68 3.825,69 4.625,70 4.786,71 4.054,72 3.96,73 5.89,74 3.889,75 4.685,76 4.86,77 3.997,78 3.905,79 6.015,80 3.837,81 4.63,82 4.832,83 3.807,84 3.795,85 5.887,86 3.729,87 4.405,88 4.583,89 3.676,90 3.685,91 5.644,92 3.618,93 4.414,94 4.61,95 3.571,96 3.597,97 5.613,98 3.522,99 4.289,100 4.498,101 3.519,102 3.536,103 5.423,104 3.428,105 0.137,106 0.688,107 10.617,108 4.524,109 17.863,110 4.92,111 0.473,112 17.356,113 7.337,114 62.133,115 8.442,116 0.431,117 23.353,118 4.495}
{0 CHEMBL1911252,1 3.814,2 3.814,3 6.814,4 3.814,5 15.341,6 16.789,7 17.993,8 19.396,9 20.645,10 4.237,11 6.068,12 3.861,13 2.881,14 8.758,15 15.887,16 18.186,17 2.881,18 20.193,19 8.758,20 22.408,21 24.489,22 26.668,23 24.279,24 28.786,25 26.054,26 30.951,27 27.832,28 33.087,29 5.069,30 4.919,31 4.881,32 14.953,33 4.237,34 6.068,35 3.861,36 2.881,37 8.758,38 3.666,39 0.766,40 0.894,41 0.843,42 0.12,43 13.977,44 9.79,45 5.612,46 11.669,47 12.689,48 14.208,49 1.466,50 1.686,51 11.478,52 2.523,53 6.368,54 84.61,55 8.246,56 0.5,57 3.746,58 3.849,59 3.366,60 3.233,61 5.062,62 3.259,63 4.173,64 4.295,65 3.691,66 3.545,67 5.593,68 3.553,69 4.358,70 4.513,71 3.713,72 3.632,73 5.689,74 3.634,75 4.433,76 4.604,77 3.617,78 3.543,79 5.795,80 3.543,81 4.276,82 4.446,83 3.455,84 3.454,85 5.62,86 3.432,87 4.208,88 4.42,89 3.307,90 3.401,91 5.453,92 3.313,93 4.075,94 4.303,95 3.165,96 3.244,97 5.162,98 3.172,99 3.903,100 4.07,101 3.239,102 3.019,103 5.6,104 3.019,105 0.132,106 0.537,107 6.425,108 3.121,109 15.717,110 3.501,111 0.444,112 11.49,113 5.159,114 41.912,115 5.934,116 0.349,117 14.444,118 4.569}
{0 CHEMBL2023317,1 4.79,2 4.79,3 7.79,4 4.79,5 17.531,6 19.084,7 20.619,8 22.169,9 23.713,10 4.939,11 7.668,12 4.44,13 3.517,14 13.626,15 18.346,16 20.979,17 3.517,18 23.541,19 13.626,20 26.156,21 28.749,22 31.36,23 26.579,24 33.964,25 28.596,26 36.575,27 30.617,28 39.184,29 5.852,30 5.528,31 5.517,32 21.632,33 4.939,34 7.668,35 4.44,36 3.517,37 13.626,38 4.111,39 1.301,40 1.572,41 1.621,42 0.262,43 19.6,44 12.577,45 7.219,46 12.978,47 14.449,48 16.015,49 1.488,50 1.653,51 10.964,52 4.453,53 19.832,54 108.341,55 7.079,56 0.345,57 4.127,58 4.252,59 3.779,60 3.602,61 5.132,62 3.549,63 4.714,64 4.912,65 4.087,66 3.99,67 5.904,68 3.904,69 4.939,70 5.156,71 4.122,72 4.159,73 5.963,74 4.033,75 5.136,76 5.394,77 4.134,78 4.161,79 6.213,80 4.031,81 5,82 5.237,83 4.182,84 4.129,85 6.085,86 4.022,87 4.979,88 5.163,89 4.136,90 4.224,91 6.154,92 4.107,93 5.197,94 5.445,95 3.908,96 4.209,97 6.284,98 4.066,99 4.974,100 5.234,101 3.797,102 4.108,103 5.812,104 3.936,105 0.097,106 0.853,107 16.708,108 5.455,109 16.907,110 7.489,111 0.678,112 28.148,113 9.318,114 72.724,115 12.736,116 0.309,117 39.399,118 4.201}
{0 CHEMBL2316070,1 4.739,2 4.739,3 7.739,4 4.739,5 17.487,6 19.028,7 20.538,8 22.074,9 23.599,10 4.859,11 7.299,12 4.311,13 3.391,14 12.44,15 17.826,16 20.352,17 3.391,18 22.797,19 12.44,20 25.306,21 27.794,22 30.303,23 26.059,24 32.808,25 28.012,26 35.322,27 29.971,28 37.834,29 5.737,30 5.394,31 5.391,32 19.718,33 4.859,34 7.299,35 4.311,36 3.391,37 12.44,38 4.007,39 1.218,40 1.415,41 1.352,42 0.206,43 15.497,44 12.4,45 7.163,46 13.025,47 14.445,48 16.005,49 1.479,50 1.955,51 12.821,52 1.359,53 1.846,54 99.273,55 8.858,56 0.533,57 3.963,58 4.066,59 3.79,60 3.469,61 5.166,62 3.469,63 4.471,64 4.609,65 4.077,66 3.834,67 5.936,68 3.814,69 4.707,70 4.893,71 4.084,72 3.91,73 6.011,74 3.871,75 4.731,76 4.925,77 4.043,78 3.816,79 6.129,80 3.783,81 4.584,82 4.773,83 4.045,84 3.713,85 6.029,86 3.689,87 4.522,88 4.699,89 3.964,90 3.684,91 6.12,92 3.678,93 4.459,94 4.635,95 3.774,96 3.642,97 5.881,98 3.618,99 4.396,100 4.586,101 3.664,102 3.583,103 5.641,104 3.539,105 0.237,106 0.806,107 9.885,108 4.064,109 34.314,110 4.235,111 0.632,112 15.815,113 6.962,114 74.141,115 7.697,116 0.782,117 27.439,118 4.097}
{0 CHEMBL356950,1 3.852,2 3.852,3 6.852,4 3.852,5 15.457,6 16.898,7 18.123,8 19.524,9 20.791,10 4.44,11 7.111,12 4.171,13 3.314,14 11.657,15 17.328,16 19.799,17 3.314,18 22.183,19 11.657,20 24.634,21 27.06,22 29.509,23 25.67,24 31.952,25 27.603,26 34.403,27 29.541,28 36.853,29 5.273,30 5.229,31 5.314,32 18.537,33 4.44,34 7.111,35 4.171,36 3.314,37 11.657,38 3.789,39 1.385,40 1.136,41 1.126,42 0.16,43 15.154,44 10.707,45 6.525,46 11.737,47 12.791,48 14.297,49 1.524,50 1.897,51 10.913,52 3.61,53 13.034,54 79.056,55 9.237,56 0.5,57 3.686,58 3.792,59 3.384,60 3.17,61 5.054,62 3.22,63 4.156,64 4.27,65 3.84,66 3.492,67 6.087,68 3.538,69 4.335,70 4.498,71 3.751,72 3.563,73 5.783,74 3.594,75 4.41,76 4.602,77 3.668,78 3.435,79 5.924,80 3.482,81 4.21,82 4.397,83 3.447,84 3.283,85 5.704,86 3.319,87 4.018,88 4.195,89 3.345,90 3.223,91 5.54,92 3.19,93 3.934,94 4.137,95 3.184,96 3.145,97 5.167,98 3.111,99 3.888,100 4.062,101 3.368,102 2.946,103 5.919,104 2.985,105 0.257,106 0.722,107 4.42,108 2.987,109 46.427,110 2.794,111 0.907,112 8.79,113 5.162,114 147.912,115 4.964,116 0.637,117 12.053,118 7.481}
{0 CHEMBL357455,1 3.792,2 3.792,3 6.792,4 3.792,5 15.11,6 16.578,7 17.744,8 19.159,9 20.378,10 4.219,11 6.061,12 3.844,13 2.865,14 8.735,15 15.478,16 17.778,17 2.865,18 19.744,19 8.735,20 21.958,21 24.016,22 26.195,23 23.853,24 28.3,25 25.61,26 30.466,27 27.372,28 32.597,29 5.046,30 4.898,31 4.865,32 14.914,33 4.219,34 6.061,35 3.844,36 2.865,37 8.735,38 3.392,39 0.65,40 0.759,41 0.671,42 0.08,43 11.219,44 8.749,45 5.475,46 11.512,47 12.474,48 14.024,49 1.476,50 1.779,51 9.95,52 3.332,53 11.105,54 77.887,55 9.054,56 0.571,57 3.578,58 3.685,59 3.284,60 3.14,61 4.879,62 3.143,63 3.982,64 4.094,65 3.643,66 3.468,67 5.391,68 3.447,69 4.229,70 4.397,71 3.619,72 3.527,73 5.505,74 3.488,75 4.191,76 4.378,77 3.439,78 3.361,79 5.483,80 3.323,81 4.009,82 4.183,83 3.349,84 3.222,85 5.402,86 3.208,87 3.914,88 4.109,89 3.177,90 3.215,91 5.167,92 3.136,93 3.857,94 4.065,95 3.176,96 3.119,97 5.076,98 3.028,99 3.668,100 3.874,101 3.084,102 2.897,103 5.167,104 2.811,105 0.102,106 0.454,107 4.585,108 2.468,109 13.079,110 2.708,111 0.245,112 7.579,113 4.237,114 23.821,115 4.893,116 0.335,117 14.845,118 8.523}
{0 CHEMBL357708,1 3.799,2 3.799,3 6.799,4 3.799,5 15.171,6 16.635,7 17.815,8 19.228,9 20.458,10 4.225,11 6.064,12 3.85,13 2.872,14 8.755,15 15.586,16 17.887,17 2.872,18 19.857,19 8.755,20 22.071,21 24.128,22 26.305,23 23.935,24 28.408,25 25.693,26 30.571,27 27.455,28 32.699,29 5.056,30 4.907,31 4.872,32 14.964,33 4.225,34 6.064,35 3.85,36 2.872,37 8.755,38 3.47,39 0.728,40 0.838,41 0.79,42 0.116,43 11.616,44 8.93,45 5.656,46 11.544,47 12.523,48 14.069,49 1.455,50 1.65,51 10.048,52 2.652,53 7.031,54 79.545,55 7.926,56 0.545,57 3.689,58 3.801,59 3.283,60 3.174,61 4.966,62 3.191,63 4.113,64 4.247,65 3.592,66 3.48,67 5.455,68 3.479,69 4.3,70 4.467,71 3.585,72 3.555,73 5.535,74 3.542,75 4.33,76 4.517,77 3.511,78 3.481,79 5.595,80 3.45,81 4.244,82 4.443,83 3.366,84 3.394,85 5.503,86 3.356,87 4.124,88 4.325,89 3.247,90 3.319,91 5.386,92 3.249,93 4.011,94 4.229,95 3.107,96 3.201,97 5.123,98 3.129,99 3.884,100 4.065,101 3.064,102 3.009,103 5.36,104 2.969,105 0.095,106 0.513,107 6.656,108 2.957,109 12.363,110 3.525,111 0.316,112 11.504,113 4.909,114 31.537,115 5.86,116 0.309,117 14.777,118 7.754}
{0 CHEMBL358868,1 3.792,2 3.792,3 6.792,4 3.792,5 15.11,6 16.578,7 17.744,8 19.159,9 20.378,10 4.219,11 6.061,12 3.844,13 2.865,14 8.735,15 15.478,16 17.778,17 2.865,18 19.744,19 8.735,20 21.958,21 24.016,22 26.195,23 23.853,24 28.3,25 25.61,26 30.466,27 27.372,28 32.597,29 5.046,30 4.9,31 4.865,32 14.914,33 4.219,34 6.061,35 3.844,36 2.865,37 8.735,38 3.372,39 0.655,40 0.78,41 0.69,42 0.08,43 11.219,44 8.749,45 5.475,46 11.512,47 12.474,48 14.024,49 1.476,50 1.779,51 9.95,52 3.416,53 11.672,54 80.705,55 10.443,56 0.571,57 3.575,58 3.682,59 3.414,60 3.161,61 4.861,62 3.151,63 3.978,64 4.091,65 3.82,66 3.498,67 5.366,68 3.459,69 4.224,70 4.391,71 3.814,72 3.566,73 5.471,74 3.503,75 4.187,76 4.374,77 3.569,78 3.391,79 5.462,80 3.334,81 4.007,82 4.181,83 3.508,84 3.231,85 5.381,86 3.213,87 3.912,88 4.108,89 3.321,90 3.235,91 5.154,92 3.144,93 3.853,94 4.061,95 3.483,96 3.15,97 4.999,98 3.044,99 3.663,100 3.869,101 3.376,102 2.95,103 5.135,104 2.835,105 0.091,106 0.453,107 3.064,108 2.512,109 12.274,110 2.685,111 0.232,112 5.347,113 4.365,114 24.043,115 4.919,116 0.295,117 18.968,118 8.456}
{0 CHEMBL440176,1 3.906,2 3.906,3 6.906,4 3.906,5 15.503,6 16.953,7 18.198,8 19.608,9 20.894,10 4.274,11 6.103,12 3.887,13 2.916,14 8.901,15 15.939,16 18.266,17 2.916,18 20.277,19 8.901,20 22.516,21 24.606,22 26.807,23 24.312,24 28.936,25 26.092,26 31.12,27 27.875,28 33.27,29 5.155,30 4.947,31 4.916,32 15.223,33 4.274,34 6.103,35 3.887,36 2.916,37 8.901,38 3.641,39 1.065,40 1.275,41 1.22,42 0.151,43 15.268,44 10.889,45 6.039,46 11.741,47 12.808,48 14.325,49 1.439,50 1.515,51 13.5,52 5.168,53 26.706,54 102.822,55 6.97,56 0.444,57 3.996,58 4.125,59 3.471,60 3.498,61 5.153,62 3.47,63 4.484,64 4.657,65 3.781,66 3.851,67 5.646,68 3.784,69 4.772,70 5.003,71 3.811,72 3.957,73 5.821,74 3.873,75 4.8,76 5.034,77 3.758,78 3.905,79 5.913,80 3.81,81 4.723,82 4.962,83 3.644,84 3.835,85 5.813,86 3.737,87 4.624,88 4.862,89 3.585,90 3.773,91 5.771,92 3.663,93 4.54,94 4.773,95 3.493,96 3.685,97 5.571,98 3.584,99 4.436,100 4.639,101 3.473,102 3.549,103 5.76,104 3.473,105 0.057,106 0.707,107 11.293,108 4.663,109 14.913,110 6.269,111 0.215,112 19.202,113 8.034,114 35.243,115 10.861,116 0.236,117 27.185,118 7.001}
{0 CHEMBL539058,1 3.794,2 3.794,3 6.794,4 3.794,5 15.17,6 16.629,7 17.801,8 19.211,9 20.434,10 4.221,11 6.061,12 3.847,13 2.867,14 8.736,15 15.599,16 17.893,17 2.867,18 19.851,19 8.736,20 22.058,21 24.106,22 26.277,23 23.957,24 28.375,25 25.71,26 30.533,27 27.467,28 32.658,29 5.054,30 4.907,31 4.867,32 14.919,33 4.221,34 6.061,35 3.847,36 2.867,37 8.736,38 3.669,39 0.827,40 0.956,41 0.881,42 0.12,43 14.061,44 10.14,45 5.475,46 11.57,47 12.542,48 14.077,49 1.483,50 1.676,51 11.522,52 1.788,53 3.198,54 86.164,55 8.009,56 0.5,57 3.763,58 3.885,59 3.358,60 3.256,61 5.053,62 3.27,63 4.187,64 4.327,65 3.692,66 3.571,67 5.575,68 3.563,69 4.427,70 4.607,71 3.657,72 3.646,73 5.702,74 3.63,75 4.424,76 4.628,77 3.593,78 3.585,79 5.686,80 3.552,81 4.321,82 4.503,83 3.494,84 3.512,85 5.677,86 3.476,87 4.252,88 4.469,89 3.293,90 3.422,91 5.451,92 3.339,93 4.099,94 4.329,95 3.189,96 3.249,97 5.263,98 3.169,99 3.903,100 4.092,101 3.156,102 3.038,103 5.382,104 3.016,105 0.11,106 0.579,107 7.03,108 3.036,109 14.628,110 3.713,111 0.304,112 11.757,113 5.182,114 31.116,115 6.531,116 0.421,117 17.065,118 8.097}
{0 CHEMBL540096,1 3.814,2 3.814,3 6.814,4 3.814,5 15.343,6 16.791,7 17.995,8 19.398,9 20.648,10 4.237,11 6.069,12 3.862,13 2.883,14 8.763,15 15.9,16 18.203,17 2.883,18 20.21,19 8.763,20 22.429,21 24.511,22 26.694,23 24.286,24 28.813,25 26.061,26 30.98,27 27.84,28 33.118,29 5.075,30 4.924,31 4.883,32 14.961,33 4.237,34 6.069,35 3.862,36 2.883,37 8.763,38 3.666,39 0.828,40 0.957,41 0.881,42 0.14,43 14.436,44 10.17,45 5.838,46 11.671,47 12.69,48 14.21,49 1.47,50 1.657,51 12.167,52 2.872,53 8.25,54 89.358,55 7.985,56 0.48,57 3.811,58 3.919,59 3.406,60 3.301,61 5.088,62 3.316,63 4.257,64 4.389,65 3.731,66 3.611,67 5.637,68 3.607,69 4.468,70 4.646,71 3.744,72 3.683,73 5.734,74 3.678,75 4.468,76 4.635,77 3.679,78 3.601,79 5.83,80 3.601,81 4.365,82 4.531,83 3.528,84 3.541,85 5.713,86 3.52,87 4.291,88 4.493,89 3.394,90 3.526,91 5.52,92 3.431,93 4.248,94 4.491,95 3.231,96 3.397,97 5.27,98 3.295,99 4.057,100 4.258,101 3.296,102 3.126,103 5.649,104 3.1,105 0.116,106 0.575,107 7.395,108 3.459,109 15.882,110 4.066,111 0.421,112 13.204,113 5.758,114 41.962,115 6.936,116 0.415,117 18.162,118 8.032}
{0 CHEMBL542258,1 3.837,2 3.837,3 6.837,4 3.837,5 15.375,6 16.825,7 18.04,8 19.446,9 20.705,10 4.255,11 6.095,12 3.88,13 2.901,14 8.881,15 15.931,16 18.246,17 2.901,18 20.263,19 8.881,20 22.493,21 24.585,22 26.779,23 24.303,24 28.909,25 26.081,26 31.088,27 27.863,28 33.237,29 5.091,30 4.939,31 4.901,32 15.14,33 4.255,34 6.095,35 3.88,36 2.901,37 8.881,38 3.666,39 0.766,40 0.894,41 0.843,42 0.126,43 13.836,44 9.802,45 5.649,46 11.68,47 12.71,48 14.231,49 1.468,50 1.686,51 10.783,52 2.523,53 6.368,54 84.61,55 8.246,56 0.5,57 3.746,58 3.849,59 3.366,60 3.233,61 5.062,62 3.259,63 4.173,64 4.295,65 3.691,66 3.545,67 5.593,68 3.553,69 4.358,70 4.513,71 3.713,72 3.632,73 5.685,74 3.634,75 4.433,76 4.604,77 3.648,78 3.545,79 5.791,80 3.553,81 4.291,82 4.444,83 3.548,84 3.474,85 5.711,86 3.466,87 4.238,88 4.446,89 3.371,90 3.44,91 5.462,92 3.375,93 4.16,94 4.356,95 3.296,96 3.311,97 5.525,98 3.257,99 3.949,100 4.133,101 3.26,102 3.134,103 5.46,104 3.11,105 0.132,106 0.537,107 6.425,108 3.121,109 15.717,110 3.501,111 0.444,112 11.49,113 5.159,114 42.023,115 5.934,116 0.349,117 14.444,118 8.268}
{0 CHEMBL542261,1 3.808,2 3.808,3 6.808,4 3.808,5 15.248,6 16.71,7 17.901,8 19.313,9 20.553,10 4.232,11 6.064,12 3.851,13 2.872,14 8.755,15 15.586,16 17.887,17 2.872,18 19.857,19 8.755,20 22.071,21 24.128,22 26.305,23 23.935,24 28.408,25 25.693,26 30.571,27 27.455,28 32.699,29 5.061,30 4.905,31 4.872,32 14.964,33 4.232,34 6.064,35 3.851,36 2.872,37 8.755,38 3.507,39 0.695,40 0.839,41 0.767,42 0.116,43 11.616,44 8.93,45 5.656,46 11.602,47 12.59,48 14.134,49 1.525,50 1.662,51 10.048,52 2.547,53 6.487,54 78.82,55 8.494,56 0.545,57 3.602,58 3.713,59 3.254,60 3.156,61 4.968,62 3.171,63 3.994,64 4.111,65 3.568,66 3.472,67 5.408,68 3.465,69 4.248,70 4.42,71 3.567,72 3.544,73 5.556,74 3.526,75 4.246,76 4.441,77 3.483,78 3.407,79 5.61,80 3.397,81 4.07,82 4.242,83 3.348,84 3.284,85 5.528,86 3.28,87 3.954,88 4.149,89 3.199,90 3.251,91 5.302,92 3.194,93 3.9,94 4.108,95 3.082,96 3.158,97 5.25,98 3.091,99 3.715,100 3.91,101 3.017,102 2.963,103 5.282,104 2.91,105 0.088,106 0.488,107 5.025,108 2.477,109 16.181,110 2.71,111 0.227,112 7.92,113 4.205,114 27.552,115 4.868,116 0.268,117 12.58,118 8.143}
{0 CHEMBL543454,1 4.433,2 4.433,3 7.433,4 4.433,5 16.529,6 18.049,7 19.47,8 20.968,9 22.42,10 4.503,11 6.519,12 4.021,13 3.055,14 10.253,15 16.547,16 18.956,17 3.055,18 21.142,19 10.253,20 23.489,21 25.745,22 28.071,23 24.789,24 30.36,25 26.626,26 32.68,27 28.466,28 34.986,29 5.336,30 5.085,31 5.055,32 17.124,33 4.503,34 6.519,35 4.021,36 3.055,37 10.253,38 3.657,39 0.822,40 0.988,41 0.908,42 0.112,43 10.614,44 10.023,45 6.208,46 12.348,47 13.594,48 15.166,49 1.492,50 1.621,51 10.174,52 2.854,53 8.147,54 87.003,55 8.28,56 0.68,57 3.731,58 3.843,59 3.375,60 3.291,61 5.01,62 3.3,63 4.151,64 4.273,65 3.717,66 3.633,67 5.497,68 3.624,69 4.395,70 4.571,71 3.747,72 3.714,73 5.631,74 3.695,75 4.394,76 4.582,77 3.648,78 3.605,79 5.649,80 3.586,81 4.272,82 4.444,83 3.511,84 3.5,85 5.607,86 3.478,87 4.16,88 4.362,89 3.381,90 3.432,91 5.42,92 3.374,93 4.077,94 4.277,95 3.268,96 3.35,97 5.266,98 3.295,99 3.936,100 4.119,101 3.181,102 3.234,103 5.361,104 3.162,105 0.077,106 0.554,107 6.067,108 2.879,109 12.273,110 3.289,111 0.231,112 9.829,113 4.841,114 26.46,115 5.75,116 0.282,117 15.039,118 7.703}
{0 CHEMBL545564,1 3.949,2 3.949,3 6.949,4 3.949,5 15.556,6 17.01,7 18.271,8 19.686,9 20.987,10 4.348,11 6.425,12 3.979,13 3,14 9.841,15 16.319,16 18.694,17 3,18 20.836,19 9.841,20 23.144,21 25.354,22 27.638,23 24.639,24 29.881,25 26.464,26 32.157,27 28.292,28 34.417,29 5.188,30 5.036,31 5,32 16.482,33 4.348,34 6.425,35 3.979,36 3,37 9.841,38 3.684,39 0.76,40 0.887,41 0.832,42 0.121,43 13.21,44 9.576,45 6.107,46 11.755,47 12.839,48 14.36,49 1.496,50 1.707,51 9.591,52 1.67,53 2.79,54 81.663,55 8.287,56 0.522,57 3.694,58 3.813,59 3.311,60 3.195,61 5.036,62 3.217,63 4.093,64 4.214,65 3.651,66 3.522,67 5.558,68 3.521,69 4.344,70 4.509,71 3.679,72 3.602,73 5.669,74 3.602,75 4.379,76 4.552,77 3.655,78 3.515,79 5.804,80 3.52,81 4.285,82 4.461,83 3.492,84 3.433,85 5.691,86 3.43,87 4.179,88 4.379,89 3.379,90 3.38,91 5.675,92 3.328,93 4.06,94 4.259,95 3.204,96 3.282,97 5.301,98 3.222,99 3.954,100 4.149,101 3.133,102 3.091,103 5.483,104 3.039,105 0.131,106 0.539,107 6.115,108 2.715,109 21.501,110 3.127,111 0.299,112 9.622,113 4.771,114 39.984,115 5.681,116 0.353,117 14.529,118 6.523}
{0 CHEMBL554140,1 3.814,2 3.814,3 6.814,4 3.814,5 15.341,6 16.789,7 17.993,8 19.396,9 20.645,10 4.237,11 6.068,12 3.861,13 2.881,14 8.758,15 15.887,16 18.186,17 2.881,18 20.193,19 8.758,20 22.408,21 24.489,22 26.668,23 24.279,24 28.786,25 26.054,26 30.951,27 27.832,28 33.087,29 5.069,30 4.919,31 4.881,32 14.953,33 4.237,34 6.068,35 3.861,36 2.881,37 8.758,38 3.666,39 0.766,40 0.894,41 0.843,42 0.12,43 13.977,44 9.79,45 5.612,46 11.669,47 12.689,48 14.208,49 1.466,50 1.686,51 11.478,52 2.523,53 6.368,54 84.61,55 8.246,56 0.5,57 3.746,58 3.849,59 3.366,60 3.233,61 5.062,62 3.259,63 4.173,64 4.295,65 3.691,66 3.545,67 5.593,68 3.553,69 4.358,70 4.513,71 3.713,72 3.632,73 5.689,74 3.634,75 4.433,76 4.604,77 3.617,78 3.543,79 5.795,80 3.543,81 4.276,82 4.446,83 3.455,84 3.454,85 5.62,86 3.432,87 4.208,88 4.42,89 3.307,90 3.401,91 5.453,92 3.313,93 4.075,94 4.303,95 3.165,96 3.244,97 5.162,98 3.172,99 3.903,100 4.07,101 3.239,102 3.019,103 5.6,104 3.019,105 0.132,106 0.537,107 6.425,108 3.121,109 15.717,110 3.501,111 0.444,112 11.49,113 5.159,114 41.912,115 5.934,116 0.349,117 14.444,118 9.174}
