{
  "data_features": {
    "feature": [
      {
        "data_type": "nominal",
        "index": "0",
        "is_ignore": "false",
        "is_row_identifier": "true",
        "is_target": "false",
        "name": "molecule_id",
        "nominal_value": [
          "CHEMBL1070",
          "CHEMBL1076153",
          "CHEMBL1076880",
          "CHEMBL1077616",
          "CHEMBL1079383",
          "CHEMBL1080035",
          "CHEMBL1080196",
          "CHEMBL1080447",
          "CHEMBL1080448",
          "CHEMBL1080449",
          "CHEMBL1082723",
          "CHEMBL1089",
          "CHEMBL109018",
          "CHEMBL11608",
          "CHEMBL1170237",
          "CHEMBL1172318",
          "CHEMBL1173331",
          "CHEMBL1173525",
          "CHEMBL118703",
          "CHEMBL1196",
          "CHEMBL1200624",
          "CHEMBL121",
          "CHEMBL1213717",
          "CHEMBL1213718",
          "CHEMBL1213719",
          "CHEMBL1213774",
          "CHEMBL1213775",
          "CHEMBL1213776",
          "CHEMBL1213777",
          "CHEMBL1213778",
          "CHEMBL1213779",
          "CHEMBL1213838",
          "CHEMBL1213839",
          "CHEMBL1213840",
          "CHEMBL1213841",
          "CHEMBL1213842",
          "CHEMBL1213843",
          "CHEMBL1213911",
          "CHEMBL1213912",
          "CHEMBL1213914",
          "CHEMBL1213915",
          "CHEMBL1213916",
          "CHEMBL1213968",
          "CHEMBL1213969",
          "CHEMBL1213971",
          "CHEMBL1213972",
          "CHEMBL1214023",
          "CHEMBL1214402",
          "CHEMBL1221982",
          "CHEMBL1222279",
          "CHEMBL1222280",
          "CHEMBL1222281",
          "CHEMBL1235738",
          "CHEMBL1240558",
          "CHEMBL1241294",
          "CHEMBL1241295",
          "CHEMBL1242923",
          "CHEMBL1242936",
          "CHEMBL1242937",
          "CHEMBL1242938",
          "CHEMBL1242950",
          "CHEMBL1242964",
          "CHEMBL1242965",
          "CHEMBL1242991",
          "CHEMBL1242992",
          "CHEMBL1243026",
          "CHEMBL1243057",
          "CHEMBL1243058",
          "CHEMBL1243059",
          "CHEMBL1243088",
          "CHEMBL1243089",
          "CHEMBL1243125",
          "CHEMBL1243180",
          "CHEMBL1243181",
          "CHEMBL1243182",
          "CHEMBL1243212",
          "CHEMBL1243213",
          "CHEMBL1243214",
          "CHEMBL1243245",
          "CHEMBL1243371",
          "CHEMBL1243399",
          "CHEMBL1243400",
          "CHEMBL1243401",
          "CHEMBL1253578",
          "CHEMBL1253604",
          "CHEMBL1253605",
          "CHEMBL1253606",
          "CHEMBL1253613",
          "CHEMBL1253614",
          "CHEMBL1253618",
          "CHEMBL1253680",
          "CHEMBL1253693",
          "CHEMBL1253699",
          "CHEMBL1253700",
          "CHEMBL1253762",
          "CHEMBL1253763",
          "CHEMBL1253764",
          "CHEMBL1253845",
          "CHEMBL1253846",
          "CHEMBL1253847",
          "CHEMBL1253924",
          "CHEMBL1253925",
          "CHEMBL1253926",
          "CHEMBL1254017",
          "CHEMBL1254550",
          "CHEMBL1254551",
          "CHEMBL1254552",
          "CHEMBL1254623",
          "CHEMBL1254624",
          "CHEMBL1254625",
          "CHEMBL1254764",
          "CHEMBL1254850",
          "CHEMBL1254851",
          "CHEMBL1254934",
          "CHEMBL1254935",
          "CHEMBL1255019",
          "CHEMBL1255020",
          "CHEMBL1255021",
          "CHEMBL125520",
          "CHEMBL1255743",
          "CHEMBL1256152",
          "CHEMBL1256153",
          "CHEMBL1257219",
          "CHEMBL1257220",
          "CHEMBL1257340",
          "CHEMBL1257341",
          "CHEMBL1257451",
          "CHEMBL1257452",
          "CHEMBL1257570",
          "CHEMBL1257571",
          "CHEMBL1257692",
          "CHEMBL1257693",
          "CHEMBL1257814",
          "CHEMBL1257815",
          "CHEMBL1257932",
          "CHEMBL1257933",
          "CHEMBL1258041",
          "CHEMBL1258042",
          "CHEMBL1258159",
          "CHEMBL1258160",
          "CHEMBL1258274",
          "CHEMBL1258275",
          "CHEMBL1258387",
          "CHEMBL1258388",
          "CHEMBL1258499",
          "CHEMBL1258500",
          "CHEMBL1258610",
          "CHEMBL1258611",
          "CHEMBL1258718",
          "CHEMBL1258719",
          "CHEMBL1258839",
          "CHEMBL1258954",
          "CHEMBL1258955",
          "CHEMBL126",
          "CHEMBL1269719",
          "CHEMBL1269720",
          "CHEMBL1269721",
          "CHEMBL1269737",
          "CHEMBL1271944",
          "CHEMBL130217",
          "CHEMBL13311",
          "CHEMBL1351571",
          "CHEMBL1381098",
          "CHEMBL139679",
          "CHEMBL1400294",
          "CHEMBL14355",
          "CHEMBL1458820",
          "CHEMBL1461072",
          "CHEMBL1475",
          "CHEMBL1477100",
          "CHEMBL1492484",
          "CHEMBL151",
          "CHEMBL1521156",
          "CHEMBL1529697",
          "CHEMBL155350",
          "CHEMBL155754",
          "CHEMBL155863",
          "CHEMBL156630",
          "CHEMBL156861",
          "CHEMBL156919",
          "CHEMBL156931",
          "CHEMBL157182",
          "CHEMBL1575961",
          "CHEMBL158946",
          "CHEMBL160347",
          "CHEMBL1606959",
          "CHEMBL160836",
          "CHEMBL1629810",
          "CHEMBL163651",
          "CHEMBL1642670",
          "CHEMBL1642671",
          "CHEMBL1642672",
          "CHEMBL1642673",
          "CHEMBL1642674",
          "CHEMBL1642675",
          "CHEMBL1642676",
          "CHEMBL1642677",
          "CHEMBL1642678",
          "CHEMBL1642679",
          "CHEMBL1642681",
          "CHEMBL1642682",
          "CHEMBL1642684",
          "CHEMBL1642686",
          "CHEMBL1645544",
          "CHEMBL1645545",
          "CHEMBL1645546",
          "CHEMBL1645547",
          "CHEMBL1645548",
          "CHEMBL1645549",
          "CHEMBL1645550",
          "CHEMBL1645551",
          "CHEMBL1645552",
          "CHEMBL1645553",
          "CHEMBL1645554",
          "CHEMBL1645555",
          "CHEMBL1645556",
          "CHEMBL1645557",
          "CHEMBL164781",
          "CHEMBL165",
          "CHEMBL1651054",
          "CHEMBL1651055",
          "CHEMBL170263",
          "CHEMBL1712955",
          "CHEMBL172767",
          "CHEMBL173247",
          "CHEMBL173759",
          "CHEMBL175851",
          "CHEMBL1760713",
          "CHEMBL1760714",
          "CHEMBL1760715",
          "CHEMBL1760716",
          "CHEMBL1760717",
          "CHEMBL1760718",
          "CHEMBL1760719",
          "CHEMBL1760720",
          "CHEMBL1760721",
          "CHEMBL1760722",
          "CHEMBL1761761",
          "CHEMBL1761762",
          "CHEMBL1766555",
          "CHEMBL1766558",
          "CHEMBL1766561",
          "CHEMBL177029",
          "CHEMBL177061",
          "CHEMBL1777849",
          "CHEMBL177899",
          "CHEMBL179100",
          "CHEMBL179128",
          "CHEMBL179162",
          "CHEMBL179190",
          "CHEMBL179191",
          "CHEMBL1795357",
          "CHEMBL1796443",
          "CHEMBL1796444",
          "CHEMBL1796445",
          "CHEMBL1796446",
          "CHEMBL1796447",
          "CHEMBL1796448",
          "CHEMBL1796449",
          "CHEMBL1796450",
          "CHEMBL1796451",
          "CHEMBL1796452",
          "CHEMBL1796453",
          "CHEMBL1796454",
          "CHEMBL1796455",
          "CHEMBL1796456",
          "CHEMBL1796457",
          "CHEMBL1796458",
          "CHEMBL1796459",
          "CHEMBL1796460",
          "CHEMBL1796461",
          "CHEMBL1796807",
          "CHEMBL1796808",
          "CHEMBL1797641",
          "CHEMBL1806757",
          "CHEMBL1806758",
          "CHEMBL1806759",
          "CHEMBL1806760",
          "CHEMBL1806761",
          "CHEMBL1806762",
          "CHEMBL1806763",
          "CHEMBL1806764",
          "CHEMBL1806765",
          "CHEMBL1806766",
          "CHEMBL1806767",
          "CHEMBL1806768",
          "CHEMBL1813518",
          "CHEMBL1813519",
          "CHEMBL1813520",
          "CHEMBL1813521",
          "CHEMBL1813522",
          "CHEMBL1813523",
          "CHEMBL1813524",
          "CHEMBL1813525",
          "CHEMBL1814055",
          "CHEMBL1814057",
          "CHEMBL1814064",
          "CHEMBL1814065",
          "CHEMBL1814066",
          "CHEMBL1814068",
          "CHEMBL1814071",
          "CHEMBL1814644",
          "CHEMBL1814645",
          "CHEMBL1814648",
          "CHEMBL1823802",
          "CHEMBL1823803",
          "CHEMBL1823805",
          "CHEMBL1823807",
          "CHEMBL1823810",
          "CHEMBL1823812",
          "CHEMBL1823813",
          "CHEMBL1823814",
          "CHEMBL1823815",
          "CHEMBL1830129",
          "CHEMBL1830130",
          "CHEMBL1830131",
          "CHEMBL1830132",
          "CHEMBL1830135",
          "CHEMBL1830138",
          "CHEMBL1830139",
          "CHEMBL1830140",
          "CHEMBL1830143",
          "CHEMBL1830144",
          "CHEMBL1830145",
          "CHEMBL1830146",
          "CHEMBL1830148",
          "CHEMBL1830792",
          "CHEMBL1830796",
          "CHEMBL1830799",
          "CHEMBL1830800",
          "CHEMBL1830808",
          "CHEMBL1830809",
          "CHEMBL1830818",
          "CHEMBL1830819",
          "CHEMBL1830820",
          "CHEMBL1830830",
          "CHEMBL1830831",
          "CHEMBL1830832",
          "CHEMBL1830833",
          "CHEMBL1830834",
          "CHEMBL1835225",
          "CHEMBL1835230",
          "CHEMBL1835326",
          "CHEMBL1835327",
          "CHEMBL183946",
          "CHEMBL184574",
          "CHEMBL185138",
          "CHEMBL185425",
          "CHEMBL185686",
          "CHEMBL185776",
          "CHEMBL185788",
          "CHEMBL185895",
          "CHEMBL185960",
          "CHEMBL186020",
          "CHEMBL186191",
          "CHEMBL186368",
          "CHEMBL186416",
          "CHEMBL186433",
          "CHEMBL186576",
          "CHEMBL186609",
          "CHEMBL186784",
          "CHEMBL186863",
          "CHEMBL186888",
          "CHEMBL186957",
          "CHEMBL187043",
          "CHEMBL187044",
          "CHEMBL187159",
          "CHEMBL187178",
          "CHEMBL187247",
          "CHEMBL187265",
          "CHEMBL187368",
          "CHEMBL187694",
          "CHEMBL187801",
          "CHEMBL188014",
          "CHEMBL188061",
          "CHEMBL1891947",
          "CHEMBL1911928",
          "CHEMBL1917526",
          "CHEMBL1917527",
          "CHEMBL1917528",
          "CHEMBL1917529",
          "CHEMBL1917530",
          "CHEMBL1917531",
          "CHEMBL1917532",
          "CHEMBL1927665",
          "CHEMBL1927666",
          "CHEMBL1927667",
          "CHEMBL1927668",
          "CHEMBL1927669",
          "CHEMBL1927670",
          "CHEMBL1927672",
          "CHEMBL1927673",
          "CHEMBL1927674",
          "CHEMBL1927675",
          "CHEMBL1927677",
          "CHEMBL1927679",
          "CHEMBL1927681",
          "CHEMBL1927684",
          "CHEMBL1928855",
          "CHEMBL1938474",
          "CHEMBL1938475",
          "CHEMBL1938476",
          "CHEMBL1938478",
          "CHEMBL1938479",
          "CHEMBL1938480",
          "CHEMBL1938483",
          "CHEMBL1938897",
          "CHEMBL1938898",
          "CHEMBL1938899",
          "CHEMBL1945150",
          "CHEMBL1945151",
          "CHEMBL1945152",
          "CHEMBL1945153",
          "CHEMBL1945154",
          "CHEMBL1945155",
          "CHEMBL1945156",
          "CHEMBL1945157",
          "CHEMBL1945158",
          "CHEMBL1945159",
          "CHEMBL1945160",
          "CHEMBL1945271",
          "CHEMBL1945272",
          "CHEMBL1945273",
          "CHEMBL1946643",
          "CHEMBL1946644",
          "CHEMBL1946645",
          "CHEMBL1946826",
          "CHEMBL1946827",
          "CHEMBL1946828",
          "CHEMBL1950700",
          "CHEMBL1950701",
          "CHEMBL1950702",
          "CHEMBL1950703",
          "CHEMBL1950704",
          "CHEMBL1950705",
          "CHEMBL1950706",
          "CHEMBL1950707",
          "CHEMBL1950708",
          "CHEMBL1950709",
          "CHEMBL1950710",
          "CHEMBL1982267",
          "CHEMBL1987137",
          "CHEMBL201199",
          "CHEMBL201250",
          "CHEMBL201777",
          "CHEMBL202017",
          "CHEMBL202018",
          "CHEMBL202112",
          "CHEMBL202218",
          "CHEMBL2023193",
          "CHEMBL2029527",
          "CHEMBL2029535",
          "CHEMBL2029540",
          "CHEMBL2029541",
          "CHEMBL2029545",
          "CHEMBL2029546",
          "CHEMBL2029549",
          "CHEMBL2029550",
          "CHEMBL2058150",
          "CHEMBL2058151",
          "CHEMBL2058152",
          "CHEMBL2058153",
          "CHEMBL2058154",
          "CHEMBL2058407",
          "CHEMBL2058408",
          "CHEMBL2058409",
          "CHEMBL2058410",
          "CHEMBL2058411",
          "CHEMBL2058412",
          "CHEMBL2058413",
          "CHEMBL2058414",
          "CHEMBL2058415",
          "CHEMBL2058416",
          "CHEMBL2058417",
          "CHEMBL2058418",
          "CHEMBL2058419",
          "CHEMBL2058420",
          "CHEMBL2058421",
          "CHEMBL2058422",
          "CHEMBL2058423",
          "CHEMBL2058424",
          "CHEMBL2058425",
          "CHEMBL2058426",
          "CHEMBL2058427",
          "CHEMBL2058428",
          "CHEMBL2058429",
          "CHEMBL2058694",
          "CHEMBL2058695",
          "CHEMBL2058696",
          "CHEMBL2058697",
          "CHEMBL2058698",
          "CHEMBL2058699",
          "CHEMBL2058700",
          "CHEMBL2058701",
          "CHEMBL2058702",
          "CHEMBL2058703",
          "CHEMBL2058704",
          "CHEMBL2058705",
          "CHEMBL2058706",
          "CHEMBL2062871",
          "CHEMBL2062872",
          "CHEMBL2062873",
          "CHEMBL2062876",
          "CHEMBL2062877",
          "CHEMBL2062878",
          "CHEMBL2062879",
          "CHEMBL2062881",
          "CHEMBL2062882",
          "CHEMBL2062883",
          "CHEMBL2088299",
          "CHEMBL2088301",
          "CHEMBL2088302",
          "CHEMBL2088303",
          "CHEMBL2088304",
          "CHEMBL2088306",
          "CHEMBL2088307",
          "CHEMBL2088308",
          "CHEMBL2088309",
          "CHEMBL2088310",
          "CHEMBL2088311",
          "CHEMBL2088312",
          "CHEMBL2088313",
          "CHEMBL2088314",
          "CHEMBL2088315",
          "CHEMBL2088316",
          "CHEMBL2088317",
          "CHEMBL2093956",
          "CHEMBL209413",
          "CHEMBL2151538",
          "CHEMBL2151540",
          "CHEMBL2151542",
          "CHEMBL2151546",
          "CHEMBL2151556",
          "CHEMBL2151558",
          "CHEMBL2151660",
          "CHEMBL2151663",
          "CHEMBL2151664",
          "CHEMBL2151665",
          "CHEMBL2151675",
          "CHEMBL2151679",
          "CHEMBL2151680",
          "CHEMBL2151681",
          "CHEMBL2151688",
          "CHEMBL2158241",
          "CHEMBL2158242",
          "CHEMBL2158243",
          "CHEMBL2158244",
          "CHEMBL2158245",
          "CHEMBL2158246",
          "CHEMBL2158247",
          "CHEMBL2158248",
          "CHEMBL2158249",
          "CHEMBL2158250",
          "CHEMBL2158251",
          "CHEMBL2177464",
          "CHEMBL2177465",
          "CHEMBL2177466",
          "CHEMBL2177467",
          "CHEMBL2203918",
          "CHEMBL2203919",
          "CHEMBL2203920",
          "CHEMBL2203921",
          "CHEMBL2204755",
          "CHEMBL2204756",
          "CHEMBL2204758",
          "CHEMBL2204760",
          "CHEMBL2204761",
          "CHEMBL2204762",
          "CHEMBL2204763",
          "CHEMBL2204764",
          "CHEMBL2204765",
          "CHEMBL2204766",
          "CHEMBL2204767",
          "CHEMBL2204769",
          "CHEMBL2204770",
          "CHEMBL2204771",
          "CHEMBL2204772",
          "CHEMBL2204773",
          "CHEMBL2204774",
          "CHEMBL2204775",
          "CHEMBL220495",
          "CHEMBL2206089",
          "CHEMBL2206093",
          "CHEMBL2206094",
          "CHEMBL2206096",
          "CHEMBL2206097",
          "CHEMBL2206099",
          "CHEMBL2206102",
          "CHEMBL2206103",
          "CHEMBL2206104",
          "CHEMBL2206105",
          "CHEMBL2206106",
          "CHEMBL2206107",
          "CHEMBL229472",
          "CHEMBL230106",
          "CHEMBL230219",
          "CHEMBL230220",
          "CHEMBL230436",
          "CHEMBL230864",
          "CHEMBL230865",
          "CHEMBL230964",
          "CHEMBL231058",
          "CHEMBL231159",
          "CHEMBL2312485",
          "CHEMBL2312486",
          "CHEMBL2312487",
          "CHEMBL2312488",
          "CHEMBL2312489",
          "CHEMBL2312490",
          "CHEMBL231283",
          "CHEMBL2312975",
          "CHEMBL2312976",
          "CHEMBL2312977",
          "CHEMBL2312981",
          "CHEMBL2312987",
          "CHEMBL2312988",
          "CHEMBL2312989",
          "CHEMBL2313277",
          "CHEMBL2313279",
          "CHEMBL2313284",
          "CHEMBL2313285",
          "CHEMBL2313286",
          "CHEMBL2313291",
          "CHEMBL2313292",
          "CHEMBL2313294",
          "CHEMBL2313295",
          "CHEMBL2313296",
          "CHEMBL2313297",
          "CHEMBL2313298",
          "CHEMBL231382",
          "CHEMBL231383",
          "CHEMBL231384",
          "CHEMBL231480",
          "CHEMBL231481",
          "CHEMBL23154",
          "CHEMBL23265",
          "CHEMBL2331563",
          "CHEMBL23318",
          "CHEMBL23319",
          "CHEMBL2332170",
          "CHEMBL2332173",
          "CHEMBL2332175",
          "CHEMBL2332181",
          "CHEMBL2332182",
          "CHEMBL2332183",
          "CHEMBL2332184",
          "CHEMBL2332190",
          "CHEMBL2332210",
          "CHEMBL2332211",
          "CHEMBL2332212",
          "CHEMBL233226",
          "CHEMBL233227",
          "CHEMBL2333925",
          "CHEMBL2333926",
          "CHEMBL2333927",
          "CHEMBL2333928",
          "CHEMBL2333929",
          "CHEMBL2333930",
          "CHEMBL2333931",
          "CHEMBL2333932",
          "CHEMBL2333933",
          "CHEMBL2333934",
          "CHEMBL2333935",
          "CHEMBL2333936",
          "CHEMBL2333937",
          "CHEMBL23419",
          "CHEMBL23475",
          "CHEMBL23487",
          "CHEMBL235156",
          "CHEMBL235373",
          "CHEMBL23582",
          "CHEMBL23722",
          "CHEMBL23818",
          "CHEMBL23918",
          "CHEMBL239507",
          "CHEMBL239508",
          "CHEMBL24172",
          "CHEMBL246809",
          "CHEMBL246811",
          "CHEMBL247833",
          "CHEMBL247834",
          "CHEMBL248049",
          "CHEMBL248050",
          "CHEMBL249550",
          "CHEMBL255231",
          "CHEMBL255590",
          "CHEMBL255700",
          "CHEMBL255822",
          "CHEMBL257057",
          "CHEMBL257990",
          "CHEMBL258420",
          "CHEMBL26323",
          "CHEMBL269538",
          "CHEMBL277177",
          "CHEMBL28",
          "CHEMBL282034",
          "CHEMBL282036",
          "CHEMBL285230",
          "CHEMBL290302",
          "CHEMBL291083",
          "CHEMBL291647",
          "CHEMBL293004",
          "CHEMBL293335",
          "CHEMBL293559",
          "CHEMBL294811",
          "CHEMBL301898",
          "CHEMBL303112",
          "CHEMBL303594",
          "CHEMBL304241",
          "CHEMBL311469",
          "CHEMBL31184",
          "CHEMBL313833",
          "CHEMBL323988",
          "CHEMBL326294",
          "CHEMBL342357",
          "CHEMBL346766",
          "CHEMBL347197",
          "CHEMBL348083",
          "CHEMBL348607",
          "CHEMBL349376",
          "CHEMBL350464",
          "CHEMBL353619",
          "CHEMBL356385",
          "CHEMBL359978",
          "CHEMBL360048",
          "CHEMBL360090",
          "CHEMBL361025",
          "CHEMBL361190",
          "CHEMBL362107",
          "CHEMBL363555",
          "CHEMBL363747",
          "CHEMBL364169",
          "CHEMBL364619",
          "CHEMBL365234",
          "CHEMBL365640",
          "CHEMBL368801",
          "CHEMBL368870",
          "CHEMBL371428",
          "CHEMBL372346",
          "CHEMBL372943",
          "CHEMBL374237",
          "CHEMBL375539",
          "CHEMBL37589",
          "CHEMBL37607",
          "CHEMBL382645",
          "CHEMBL386941",
          "CHEMBL387777",
          "CHEMBL387778",
          "CHEMBL387785",
          "CHEMBL388012",
          "CHEMBL388013",
          "CHEMBL390050",
          "CHEMBL390405",
          "CHEMBL390406",
          "CHEMBL390465",
          "CHEMBL394529",
          "CHEMBL394864",
          "CHEMBL398160",
          "CHEMBL398161",
          "CHEMBL398440",
          "CHEMBL399353",
          "CHEMBL399572",
          "CHEMBL404232",
          "CHEMBL408",
          "CHEMBL416",
          "CHEMBL416055",
          "CHEMBL41814",
          "CHEMBL418480",
          "CHEMBL420",
          "CHEMBL424673",
          "CHEMBL424956",
          "CHEMBL430593",
          "CHEMBL43185",
          "CHEMBL435101",
          "CHEMBL436947",
          "CHEMBL439193",
          "CHEMBL44",
          "CHEMBL440966",
          "CHEMBL441121",
          "CHEMBL445184",
          "CHEMBL446059",
          "CHEMBL447307",
          "CHEMBL447729",
          "CHEMBL450239",
          "CHEMBL450498",
          "CHEMBL450518",
          "CHEMBL453703",
          "CHEMBL455782",
          "CHEMBL456150",
          "CHEMBL457535",
          "CHEMBL460269",
          "CHEMBL461133",
          "CHEMBL462549",
          "CHEMBL462630",
          "CHEMBL463249",
          "CHEMBL466769",
          "CHEMBL466770",
          "CHEMBL466872",
          "CHEMBL467794",
          "CHEMBL468597",
          "CHEMBL468852",
          "CHEMBL468855",
          "CHEMBL469024",
          "CHEMBL469571",
          "CHEMBL469583",
          "CHEMBL469783",
          "CHEMBL470020",
          "CHEMBL470213",
          "CHEMBL470220",
          "CHEMBL470221",
          "CHEMBL470222",
          "CHEMBL470226",
          "CHEMBL470419",
          "CHEMBL470612",
          "CHEMBL471221",
          "CHEMBL471228",
          "CHEMBL471232",
          "CHEMBL471448",
          "CHEMBL472069",
          "CHEMBL472218",
          "CHEMBL475885",
          "CHEMBL484410",
          "CHEMBL484769",
          "CHEMBL487049",
          "CHEMBL487050",
          "CHEMBL487071",
          "CHEMBL487235",
          "CHEMBL488063",
          "CHEMBL488072",
          "CHEMBL488073",
          "CHEMBL488074",
          "CHEMBL488075",
          "CHEMBL488076",
          "CHEMBL488916",
          "CHEMBL488917",
          "CHEMBL489079",
          "CHEMBL489743",
          "CHEMBL494795",
          "CHEMBL495714",
          "CHEMBL496279",
          "CHEMBL496280",
          "CHEMBL496281",
          "CHEMBL497674",
          "CHEMBL497675",
          "CHEMBL497676",
          "CHEMBL498505",
          "CHEMBL498506",
          "CHEMBL498507",
          "CHEMBL498683",
          "CHEMBL498694",
          "CHEMBL499266",
          "CHEMBL50",
          "CHEMBL500683",
          "CHEMBL500684",
          "CHEMBL501402",
          "CHEMBL502371",
          "CHEMBL504356",
          "CHEMBL506",
          "CHEMBL506301",
          "CHEMBL507756",
          "CHEMBL508324",
          "CHEMBL508657",
          "CHEMBL508793",
          "CHEMBL511601",
          "CHEMBL511789",
          "CHEMBL511966",
          "CHEMBL511967",
          "CHEMBL512332",
          "CHEMBL512703",
          "CHEMBL512719",
          "CHEMBL512843",
          "CHEMBL513209",
          "CHEMBL513549",
          "CHEMBL519241",
          "CHEMBL519426",
          "CHEMBL519678",
          "CHEMBL520061",
          "CHEMBL522",
          "CHEMBL524447",
          "CHEMBL526897",
          "CHEMBL534756",
          "CHEMBL53515",
          "CHEMBL536057",
          "CHEMBL536059",
          "CHEMBL536060",
          "CHEMBL537732",
          "CHEMBL537735",
          "CHEMBL538733",
          "CHEMBL538902",
          "CHEMBL540259",
          "CHEMBL541474",
          "CHEMBL542095",
          "CHEMBL544004",
          "CHEMBL544010",
          "CHEMBL544715",
          "CHEMBL545177",
          "CHEMBL545409",
          "CHEMBL545413",
          "CHEMBL545652",
          "CHEMBL55",
          "CHEMBL55325",
          "CHEMBL553631",
          "CHEMBL555787",
          "CHEMBL555908",
          "CHEMBL55602",
          "CHEMBL556769",
          "CHEMBL55707",
          "CHEMBL55934",
          "CHEMBL56097",
          "CHEMBL56134",
          "CHEMBL56363",
          "CHEMBL56649",
          "CHEMBL56750",
          "CHEMBL56823",
          "CHEMBL57299",
          "CHEMBL57403",
          "CHEMBL589765",
          "CHEMBL590",
          "CHEMBL591523",
          "CHEMBL592160",
          "CHEMBL595",
          "CHEMBL596254",
          "CHEMBL596955",
          "CHEMBL597371",
          "CHEMBL597372",
          "CHEMBL597373",
          "CHEMBL597392",
          "CHEMBL597768",
          "CHEMBL597769",
          "CHEMBL598393",
          "CHEMBL598394",
          "CHEMBL598395",
          "CHEMBL602259",
          "CHEMBL602260",
          "CHEMBL602464",
          "CHEMBL602465",
          "CHEMBL602466",
          "CHEMBL602880",
          "CHEMBL608141",
          "CHEMBL608438",
          "CHEMBL612",
          "CHEMBL62743",
          "CHEMBL63223",
          "CHEMBL65252",
          "CHEMBL65761",
          "CHEMBL66225",
          "CHEMBL66639",
          "CHEMBL69011",
          "CHEMBL698",
          "CHEMBL7002",
          "CHEMBL79512",
          "CHEMBL828",
          "CHEMBL86304",
          "CHEMBL86905",
          "CHEMBL8706",
          "CHEMBL887",
          "CHEMBL903",
          "CHEMBL92401",
          "CHEMBL945",
          "CHEMBL9514",
          "CHEMBL960",
          "CHEMBL964",
          "CHEMBL972"
        ],
        "number_of_missing_values": "0"
      },
      {
        "data_type": "numeric",
        "index": "1",
        "is_ignore": "false",
        "is_row_identifier": "false",
        "is_target": "false",
        "name": "AMW",
        "number_of_missing_values": "0"
      },
      {
        "data_type": "numeric",
        "index": "2",
        "is_ignore": "false",
        "is_row_identifier": "false",
        "is_target": "false",
        "name": "C.",
        "number_of_missing_values": "0"
      },
      {
        "data_type": "numeric",
        "index": "3",
        "is_ignore": "false",
        "is_row_identifier": "false",
        "is_target": "false",
        "name": "H.",
        "number_of_missing_values": "0"
      },
      {
        "data_type": "numeric",
        "index": "4",
        "is_ignore": "false",
        "is_row_identifier": "false",
        "is_target": "false",
        "name": "Me",
        "number_of_missing_values": "0"
      },
      {
        "data_type": "numeric",
        "index": "5",
        "is_ignore": "false",
        "is_row_identifier": "false",
        "is_target": "false",
        "name": "Mi",
        "number_of_missing_values": "0"
      },
      {
        "data_type": "numeric",
        "index": "6",
        "is_ignore": "false",
        "is_row_identifier": "false",
        "is_target": "false",
        "name": "Mp",
        "number_of_missing_values": "0"
      },
      {
        "data_type": "numeric",
        "index": "7",
        "is_ignore": "false",
        "is_row_identifier": "false",
        "is_target": "false",
        "name": "Mv",
        "number_of_missing_values": "0"
      },
      {
        "data_type": "numeric",
        "index": "8",
        "is_ignore": "false",
        "is_row_identifier": "false",
        "is_target": "false",
        "name": "MW",
        "number_of_missing_values": "0"
      },
      {
        "data_type": "numeric",
        "index": "9",
        "is_ignore": "false",
        "is_row_identifier": "false",
        "is_target": "false",
        "name": "N.",
        "number_of_missing_values": "0"
      },
      {
        "data_type": "numeric",
        "index": "10",
        "is_ignore": "false",
        "is_row_identifier": "false",
        "is_target": "false",
        "name": "nAB",
        "number_of_missing_values": "0"
      },
      {
        "data_type": "numeric",
        "index": "11",
        "is_ignore": "false",
        "is_row_identifier": "false",
        "is_target": "false",
        "name": "nAT",
        "number_of_missing_values": "0"
      },
      {
        "data_type": "numeric",
        "index": "12",
        "is_ignore": "false",
        "is_row_identifier": "false",
        "is_target": "false",
        "name": "nB",
        "number_of_missing_values": "0"
      },
      {
        "data_type": "numeric",
        "index": "13",
        "is_ignore": "false",
        "is_row_identifier": "false",
        "is_target": "false",
        "name": "nBM",
        "number_of_missing_values": "0"
      },
      {
        "data_type": "numeric",
        "index": "14",
        "is_ignore": "false",
        "is_row_identifier": "false",
        "is_target": "false",
        "name": "nBO",
        "number_of_missing_values": "0"
      },
      {
        "data_type": "numeric",
        "index": "15",
        "is_ignore": "false",
        "is_row_identifier": "false",
        "is_target": "false",
        "name": "nBR",
        "number_of_missing_values": "0"
      },
      {
        "data_type": "numeric",
        "index": "16",
        "is_ignore": "false",
        "is_row_identifier": "false",
        "is_target": "false",
        "name": "nBT",
        "number_of_missing_values": "0"
      },
      {
        "data_type": "numeric",
        "index": "17",
        "is_ignore": "false",
        "is_row_identifier": "false",
        "is_target": "false",
        "name": "nC",
        "number_of_missing_values": "0"
      },
      {
        "data_type": "numeric",
        "index": "18",
        "is_ignore": "false",
        "is_row_identifier": "false",
        "is_target": "false",
        "name": "nCL",
        "number_of_missing_values": "0"
      },
      {
        "data_type": "numeric",
        "index": "19",
        "is_ignore": "false",
        "is_row_identifier": "false",
        "is_target": "false",
        "name": "nCsp",
        "number_of_missing_values": "0"
      },
      {
        "data_type": "numeric",
        "index": "20",
        "is_ignore": "false",
        "is_row_identifier": "false",
        "is_target": "false",
        "name": "nCsp2",
        "number_of_missing_values": "0"
      },
      {
        "data_type": "numeric",
        "index": "21",
        "is_ignore": "false",
        "is_row_identifier": "false",
        "is_target": "false",
        "name": "nCsp3",
        "number_of_missing_values": "0"
      },
      {
        "data_type": "numeric",
        "index": "22",
        "is_ignore": "false",
        "is_row_identifier": "false",
        "is_target": "false",
        "name": "nDB",
        "number_of_missing_values": "0"
      },
      {
        "data_type": "numeric",
        "index": "23",
        "is_ignore": "false",
        "is_row_identifier": "false",
        "is_target": "false",
        "name": "nF",
        "number_of_missing_values": "0"
      },
      {
        "data_type": "numeric",
        "index": "24",
        "is_ignore": "false",
        "is_row_identifier": "false",
        "is_target": "false",
        "name": "nH",
        "number_of_missing_values": "0"
      },
      {
        "data_type": "numeric",
        "index": "25",
        "is_ignore": "false",
        "is_row_identifier": "false",
        "is_target": "false",
        "name": "nHet",
        "number_of_missing_values": "0"
      },
      {
        "data_type": "numeric",
        "index": "26",
        "is_ignore": "false",
        "is_row_identifier": "false",
        "is_target": "false",
        "name": "nHM",
        "number_of_missing_values": "0"
      },
      {
        "data_type": "numeric",
        "index": "27",
        "is_ignore": "false",
        "is_row_identifier": "false",
        "is_target": "false",
        "name": "nI",
        "number_of_missing_values": "0"
      },
      {
        "data_type": "numeric",
        "index": "28",
        "is_ignore": "false",
        "is_row_identifier": "false",
        "is_target": "false",
        "name": "nN",
        "number_of_missing_values": "0"
      },
      {
        "data_type": "numeric",
        "index": "29",
        "is_ignore": "false",
        "is_row_identifier": "false",
        "is_target": "false",
        "name": "nO",
        "number_of_missing_values": "0"
      },
      {
        "data_type": "numeric",
        "index": "30",
        "is_ignore": "false",
        "is_row_identifier": "false",
        "is_target": "false",
        "name": "nP",
        "number_of_missing_values": "0"
      },
      {
        "data_type": "numeric",
        "index": "31",
        "is_ignore": "false",
        "is_row_identifier": "false",
        "is_target": "false",
        "name": "nS",
        "number_of_missing_values": "0"
      },
      {
        "data_type": "numeric",
        "index": "32",
        "is_ignore": "false",
        "is_row_identifier": "false",
        "is_target": "false",
        "name": "nSK",
        "number_of_missing_values": "0"
      },
      {
        "data_type": "numeric",
        "index": "33",
        "is_ignore": "false",
        "is_row_identifier": "false",
        "is_target": "false",
        "name": "nTB",
        "number_of_missing_values": "0"
      },
      {
        "data_type": "numeric",
        "index": "34",
        "is_ignore": "false",
        "is_row_identifier": "false",
        "is_target": "false",
        "name": "nX",
        "number_of_missing_values": "0"
      },
      {
        "data_type": "numeric",
        "index": "35",
        "is_ignore": "false",
        "is_row_identifier": "false",
        "is_target": "false",
        "name": "O.",
        "number_of_missing_values": "0"
      },
      {
        "data_type": "numeric",
        "index": "36",
        "is_ignore": "false",
        "is_row_identifier": "false",
        "is_target": "false",
        "name": "RBF",
        "number_of_missing_values": "0"
      },
      {
        "data_type": "numeric",
        "index": "37",
        "is_ignore": "false",
        "is_row_identifier": "false",
        "is_target": "false",
        "name": "RBN",
        "number_of_missing_values": "0"
      },
      {
        "data_type": "numeric",
        "index": "38",
        "is_ignore": "false",
        "is_row_identifier": "false",
        "is_target": "false",
        "name": "SCBO",
        "number_of_missing_values": "0"
      },
      {
        "data_type": "numeric",
        "index": "39",
        "is_ignore": "false",
        "is_row_identifier": "false",
        "is_target": "false",
        "name": "Se",
        "number_of_missing_values": "0"
      },
      {
        "data_type": "numeric",
        "index": "40",
        "is_ignore": "false",
        "is_row_identifier": "false",
        "is_target": "false",
        "name": "Si",
        "number_of_missing_values": "0"
      },
      {
        "data_type": "numeric",
        "index": "41",
        "is_ignore": "false",
        "is_row_identifier": "false",
        "is_target": "false",
        "name": "Sp",
        "number_of_missing_values": "0"
      },
      {
        "data_type": "numeric",
        "index": "42",
        "is_ignore": "false",
        "is_row_identifier": "false",
        "is_target": "false",
        "name": "Sv",
        "number_of_missing_values": "0"
      },
      {
        "data_type": "numeric",
        "index": "43",
        "is_ignore": "false",
        "is_row_identifier": "false",
        "is_target": "false",
        "name": "X.",
        "number_of_missing_values": "0"
      },
      {
        "data_type": "numeric",
        "index": "44",
        "is_ignore": "false",
        "is_row_identifier": "false",
        "is_target": "true",
        "name": "pXC50",
        "number_of_missing_values": "0"
      }
    ]
  }
}