{
  "data_features": {
    "feature": [
      {
        "data_type": "nominal",
        "index": "0",
        "is_ignore": "false",
        "is_row_identifier": "true",
        "is_target": "false",
        "name": "molecule_id",
        "nominal_value": [
          "CHEMBL10",
          "CHEMBL101253",
          "CHEMBL103667",
          "CHEMBL105442",
          "CHEMBL1082158",
          "CHEMBL1088751",
          "CHEMBL1088752",
          "CHEMBL1088897",
          "CHEMBL1088914",
          "CHEMBL1089172",
          "CHEMBL1089173",
          "CHEMBL1089197",
          "CHEMBL1089198",
          "CHEMBL1089520",
          "CHEMBL1089865",
          "CHEMBL1090089",
          "CHEMBL1090090",
          "CHEMBL1090173",
          "CHEMBL1090174",
          "CHEMBL1090511",
          "CHEMBL1090512",
          "CHEMBL1090836",
          "CHEMBL1090837",
          "CHEMBL1091552",
          "CHEMBL1091560",
          "CHEMBL1091667",
          "CHEMBL1091668",
          "CHEMBL1091912",
          "CHEMBL1091921",
          "CHEMBL1091922",
          "CHEMBL1091923",
          "CHEMBL1092001",
          "CHEMBL1092246",
          "CHEMBL1092383",
          "CHEMBL1092648",
          "CHEMBL1092722",
          "CHEMBL1092901",
          "CHEMBL1092902",
          "CHEMBL1092903",
          "CHEMBL1092906",
          "CHEMBL1092907",
          "CHEMBL1093007",
          "CHEMBL1093301",
          "CHEMBL1093456",
          "CHEMBL1171204",
          "CHEMBL1173655",
          "CHEMBL119385",
          "CHEMBL1209288",
          "CHEMBL1222044",
          "CHEMBL1230020",
          "CHEMBL1230122",
          "CHEMBL1232769",
          "CHEMBL1236107",
          "CHEMBL1236810",
          "CHEMBL1240703",
          "CHEMBL1241674",
          "CHEMBL124660",
          "CHEMBL1270230",
          "CHEMBL128239",
          "CHEMBL128257",
          "CHEMBL128414",
          "CHEMBL128440",
          "CHEMBL128516",
          "CHEMBL128756",
          "CHEMBL1287853",
          "CHEMBL128813",
          "CHEMBL1289926",
          "CHEMBL129174",
          "CHEMBL129305",
          "CHEMBL129375",
          "CHEMBL129628",
          "CHEMBL129704",
          "CHEMBL129720",
          "CHEMBL129775",
          "CHEMBL131176",
          "CHEMBL131194",
          "CHEMBL1336",
          "CHEMBL1421",
          "CHEMBL14762",
          "CHEMBL1614701",
          "CHEMBL162",
          "CHEMBL1721885",
          "CHEMBL1738710",
          "CHEMBL1765781",
          "CHEMBL1773329",
          "CHEMBL1773334",
          "CHEMBL1784172",
          "CHEMBL1784173",
          "CHEMBL1789941",
          "CHEMBL1795685",
          "CHEMBL1795686",
          "CHEMBL180022",
          "CHEMBL1807446",
          "CHEMBL186526",
          "CHEMBL1908391",
          "CHEMBL1908392",
          "CHEMBL1908393",
          "CHEMBL1908394",
          "CHEMBL1908395",
          "CHEMBL1908396",
          "CHEMBL1908397",
          "CHEMBL191003",
          "CHEMBL1916359",
          "CHEMBL1929238",
          "CHEMBL1938400",
          "CHEMBL199679",
          "CHEMBL203567",
          "CHEMBL2070412",
          "CHEMBL2070413",
          "CHEMBL2070416",
          "CHEMBL215152",
          "CHEMBL215803",
          "CHEMBL2170294",
          "CHEMBL218661",
          "CHEMBL2205766",
          "CHEMBL221071",
          "CHEMBL221246",
          "CHEMBL221312",
          "CHEMBL221546",
          "CHEMBL221547",
          "CHEMBL221595",
          "CHEMBL221648",
          "CHEMBL221700",
          "CHEMBL221791",
          "CHEMBL221959",
          "CHEMBL222109",
          "CHEMBL223360",
          "CHEMBL225088",
          "CHEMBL225519",
          "CHEMBL22978",
          "CHEMBL230011",
          "CHEMBL2309006",
          "CHEMBL2309609",
          "CHEMBL231568",
          "CHEMBL24828",
          "CHEMBL249697",
          "CHEMBL252128",
          "CHEMBL255863",
          "CHEMBL258202",
          "CHEMBL259084",
          "CHEMBL261849",
          "CHEMBL271271",
          "CHEMBL273158",
          "CHEMBL278041",
          "CHEMBL288441",
          "CHEMBL288812",
          "CHEMBL296468",
          "CHEMBL300138",
          "CHEMBL303144",
          "CHEMBL316275",
          "CHEMBL31965",
          "CHEMBL335878",
          "CHEMBL338612",
          "CHEMBL339095",
          "CHEMBL340687",
          "CHEMBL363648",
          "CHEMBL365847",
          "CHEMBL373767",
          "CHEMBL373934",
          "CHEMBL374216",
          "CHEMBL376045",
          "CHEMBL377300",
          "CHEMBL379218",
          "CHEMBL383172",
          "CHEMBL384304",
          "CHEMBL386051",
          "CHEMBL412281",
          "CHEMBL428690",
          "CHEMBL434434",
          "CHEMBL440084",
          "CHEMBL443285",
          "CHEMBL445813",
          "CHEMBL450786",
          "CHEMBL464552",
          "CHEMBL475251",
          "CHEMBL476124",
          "CHEMBL476141",
          "CHEMBL477772",
          "CHEMBL478649",
          "CHEMBL483321",
          "CHEMBL491473",
          "CHEMBL494089",
          "CHEMBL509032",
          "CHEMBL513909",
          "CHEMBL514201",
          "CHEMBL521851",
          "CHEMBL522892",
          "CHEMBL523374",
          "CHEMBL524266",
          "CHEMBL525191",
          "CHEMBL535",
          "CHEMBL553",
          "CHEMBL554",
          "CHEMBL558752",
          "CHEMBL561932",
          "CHEMBL564829",
          "CHEMBL572878",
          "CHEMBL572881",
          "CHEMBL573339",
          "CHEMBL574738",
          "CHEMBL576620",
          "CHEMBL576982",
          "CHEMBL601719",
          "CHEMBL607707",
          "CHEMBL608154",
          "CHEMBL64040",
          "CHEMBL88486",
          "CHEMBL91829",
          "CHEMBL92788",
          "CHEMBL939",
          "CHEMBL941",
          "CHEMBL97162"
        ],
        "number_of_missing_values": "0"
      },
      {
        "data_type": "numeric",
        "index": "1",
        "is_ignore": "false",
        "is_row_identifier": "false",
        "is_target": "false",
        "name": "X.",
        "number_of_missing_values": "0"
      },
      {
        "data_type": "numeric",
        "index": "2",
        "is_ignore": "false",
        "is_row_identifier": "false",
        "is_target": "false",
        "name": "SCBO",
        "number_of_missing_values": "0"
      },
      {
        "data_type": "numeric",
        "index": "3",
        "is_ignore": "false",
        "is_row_identifier": "false",
        "is_target": "false",
        "name": "Se",
        "number_of_missing_values": "0"
      },
      {
        "data_type": "numeric",
        "index": "4",
        "is_ignore": "false",
        "is_row_identifier": "false",
        "is_target": "false",
        "name": "Mp",
        "number_of_missing_values": "0"
      },
      {
        "data_type": "numeric",
        "index": "5",
        "is_ignore": "false",
        "is_row_identifier": "false",
        "is_target": "false",
        "name": "nN",
        "number_of_missing_values": "0"
      },
      {
        "data_type": "numeric",
        "index": "6",
        "is_ignore": "false",
        "is_row_identifier": "false",
        "is_target": "false",
        "name": "MW",
        "number_of_missing_values": "0"
      },
      {
        "data_type": "numeric",
        "index": "7",
        "is_ignore": "false",
        "is_row_identifier": "false",
        "is_target": "true",
        "name": "pXC50",
        "number_of_missing_values": "0"
      }
    ]
  }
}