{
  "data_set_description": {
    "collection_date": "November 2013",
    "creator": "Dr Jeremy Besnard, Dr Ivan Olier, Dr Noureddin Sadawi, Dr Larisa Soldatova, Dr Crina Grosan, Prof Ross King, Dr Richard Bickerton, Prof Andrew Hopkins and Dr Willem van Hoorn",
    "default_target_attribute": "pXC50",
    "description": "This dataset contains QSAR data (from ChEMBL version 17) showing activity values (unit is pseudo-pCI50) of several compounds on drug target ChEMBL_ID: CHEMBL2096663 (TID: 104818), and it has 61 rows and 102 features (not including molecule IDs and class feature: molecule_id and pXC50). The features represent FCFP 1024-bit Molecular Fingerprints which were generated from SMILES strings. Feature selection was applied to this dataset. The fingerprints were obtained using the Pipeline Pilot program, Dassault Systèmes BIOVIA. Generating Fingerprints do not usually require missing value imputation as all bits are generated.",
    "description_version": "1",
    "file_id": "3642593",
    "format": "ARFF",
    "id": "38498",
    "licence": "Public",
    "md5_checksum": "6d96b6a6a9a0ed1e3a64e76cf73cb008",
    "minio_url": "https://data.openml.org/datasets/0003/38498/dataset_38498.pq",
    "name": "QSAR-DATASET-FOR-DRUG-TARGET-CHEMBL2096663",
    "original_data_url": "https://www.ebi.ac.uk/chembl/target/inspect/CHEMBL2096663",
    "parquet_url": "https://data.openml.org/datasets/0003/38498/dataset_38498.pq",
    "processing_date": "2018-10-04 05:59:14",
    "row_id_attribute": "molecule_id",
    "status": "deactivated",
    "tag": [
      "MetaQSAR",
      "study_13"
    ],
    "upload_date": "2016-07-16T04:25:11",
    "url": "https://api.openml.org/data/v1/download/3642593/QSAR-DATASET-FOR-DRUG-TARGET-CHEMBL2096663.arff",
    "version": "4",
    "visibility": "public"
  }
}