"molecule_id","AMW","C.","H.","Me","Mi","Mp","Mv","MW","N.","nAB","nAT","nB","nBM","nBO","nBR","nBT","nC","nCL","nCsp","nCsp2","nCsp3","nDB","nF","nH","nHet","nHM","nI","nN","nO","nP","nS","nSK","nTB","nX","O.","RBF","RBN","SCBO","Se","Si","Sp","Sv","X.","pXC50"
{1 6.847,2 32.4,3 51.4,4 1.01,5 1.147,6 0.607,7 0.579,8 253.34,9 8.1,11 37,13 4,14 18,16 37,17 12,20 5,21 7,22 4,24 19,25 6,28 3,29 3,32 18,35 8.1,36 0.135,37 5,38 22,39 37.356,40 42.445,41 22.472,42 21.423,44 5.836}
{0 CHEMBL2333032,1 8.051,2 32.4,3 47.1,4 1.023,5 1.146,6 0.634,7 0.61,8 273.75,9 8.8,11 34,13 4,14 18,16 34,17 11,18 1,20 5,21 6,22 4,24 16,25 7,26 1,28 3,29 3,32 18,34 1,35 8.8,36 0.147,37 5,38 22,39 34.796,40 38.974,41 21.568,42 20.724,43 2.9,44 7.174}
{0 CHEMBL2333033,1 8.306,2 32.4,3 43.2,4 1.051,5 1.175,6 0.602,7 0.61,8 307.31,9 8.1,11 37,13 4,14 21,16 37,17 12,20 5,21 7,22 4,23 3,24 16,25 9,28 3,29 3,32 21,34 3,35 8.1,36 0.135,37 5,38 25,39 38.894,40 43.464,41 22.284,42 22.573,43 8.1,44 7.921}
{0 CHEMBL2333034,1 6.684,2 32.5,3 52.5,4 1.006,5 1.146,6 0.606,7 0.574,8 267.37,9 7.5,11 40,13 4,14 19,16 40,17 13,20 5,21 8,22 4,24 21,25 6,28 3,29 3,32 19,35 7.5,36 0.15,37 6,38 23,39 40.24,40 45.86,41 24.233,42 22.95,44 6.135}
{0 CHEMBL2333035,1 7.088,2 31.6,3 50,4 1.018,5 1.149,6 0.603,7 0.583,8 269.34,9 7.9,11 38,13 4,14 19,16 38,17 12,20 5,21 7,22 4,24 19,25 7,28 3,29 4,32 19,35 10.5,36 0.158,37 6,38 23,39 38.683,40 43.654,41 22.926,42 22.138,44 6.38}
{0 CHEMBL2333036,1 7.088,2 31.6,3 50,4 1.018,5 1.149,6 0.603,7 0.583,8 269.34,9 7.9,11 38,13 4,14 19,16 38,17 12,20 5,21 7,22 4,24 19,25 7,28 3,29 4,32 19,35 10.5,36 0.158,37 6,38 23,39 38.683,40 43.654,41 22.926,42 22.138,44 5.959}
{0 CHEMBL2333037,1 6.894,2 36.5,3 50,4 1.002,5 1.138,6 0.63,7 0.597,8 358.49,9 7.7,10 6,11 52,13 10,14 27,16 53,17 19,20 11,21 8,22 4,24 26,25 7,28 4,29 3,32 26,35 5.8,36 0.151,37 8,38 34,39 52.109,40 59.189,41 32.762,42 31.025,44 5.26}
{0 CHEMBL2333038,1 6.903,2 31.9,3 51.1,4 1.012,5 1.149,6 0.605,7 0.579,8 324.43,9 8.5,11 47,13 4,14 24,16 48,17 15,20 5,21 10,22 4,24 24,25 8,28 4,29 4,32 23,35 8.5,36 0.125,37 6,38 28,39 47.552,40 53.983,41 28.455,42 27.213,44 6.058}
{0 CHEMBL2333039,1 6.617,2 31.4,3 52.9,4 1.004,5 1.151,6 0.603,7 0.57,8 337.48,9 9.8,11 51,13 4,14 25,16 52,17 16,20 5,21 11,22 4,24 27,25 8,28 5,29 3,32 24,35 5.9,36 0.115,37 6,38 29,39 51.211,40 58.687,41 30.767,42 29.046,44 5.854}
{0 CHEMBL2333040,1 7.168,2 38.6,3 47.7,4 1.005,5 1.133,6 0.642,7 0.612,8 315.41,9 6.8,10 6,11 44,13 10,14 24,16 45,17 17,20 11,21 6,22 4,24 21,25 6,28 3,29 3,32 23,35 6.8,36 0.133,37 6,38 31,39 44.24,40 49.86,41 28.233,42 26.95,44 6.752}
{0 CHEMBL2333041,1 10.741,2 32.4,3 47.1,4 1.016,5 1.14,6 0.687,7 0.624,8 365.2,9 8.8,11 34,13 4,14 18,16 34,17 11,20 5,21 6,22 4,24 16,25 7,26 1,27 1,28 3,29 3,32 18,34 1,35 8.8,36 0.147,37 5,38 22,39 34.542,40 38.75,41 23.37,42 21.213,43 2.9,44 6.833}
{0 CHEMBL2333042,1 9.359,2 32.4,3 47.1,4 1.021,5 1.143,6 0.649,7 0.615,8 318.2,9 8.8,11 34,13 4,14 18,15 1,16 34,17 11,20 5,21 6,22 4,24 16,25 7,26 1,28 3,29 3,32 18,34 1,35 8.8,36 0.147,37 5,38 22,39 34.702,40 38.871,41 22.063,42 20.921,43 2.9,44 7.292}
{0 CHEMBL2333044,1 6.881,2 30.8,3 51.3,4 1.012,5 1.152,6 0.602,7 0.575,8 268.36,9 10.3,11 39,13 4,14 19,16 39,17 12,20 5,21 7,22 4,24 20,25 7,28 4,29 3,32 19,35 7.7,36 0.154,37 6,38 23,39 39.458,40 44.943,41 23.478,42 22.444,44 5.469}
{0 CHEMBL2333048,1 7.333,2 32.4,3 48.6,4 1.023,5 1.156,6 0.606,7 0.589,8 271.33,9 8.1,11 37,13 4,14 19,16 37,17 12,20 5,21 7,22 4,23 1,24 18,25 7,28 3,29 3,32 19,34 1,35 8.1,36 0.135,37 5,38 23,39 37.869,40 42.784,41 22.409,42 21.806,43 2.7,44 7.886}
{0 CHEMBL2333049,1 6.847,2 32.4,3 51.4,4 1.01,5 1.147,6 0.607,7 0.579,8 253.34,9 8.1,11 37,13 4,14 18,16 37,17 12,20 5,21 7,22 4,24 19,25 6,28 3,29 3,32 18,35 8.1,36 0.135,37 5,38 22,39 37.356,40 42.445,41 22.472,42 21.423,44 7.276}
{0 CHEMBL2333050,1 7.134,2 32.5,3 50,4 1.019,5 1.155,6 0.604,7 0.583,8 285.36,9 7.5,11 40,13 4,14 20,16 40,17 13,20 5,21 8,22 4,23 1,24 20,25 7,28 3,29 3,32 20,34 1,35 7.5,36 0.15,37 6,38 24,39 40.752,40 46.2,41 24.171,42 23.333,43 2.5,44 7.745}
{0 CHEMBL2333051,1 7.077,2 34.1,3 50,4 1.014,5 1.15,6 0.612,7 0.588,8 311.4,9 6.8,11 44,13 4,14 23,16 45,17 15,20 5,21 10,22 4,23 1,24 22,25 7,28 3,29 3,32 22,34 1,35 6.8,36 0.156,37 7,38 27,39 44.636,40 50.615,41 26.932,42 25.86,43 2.3,44 7.215}
{0 CHEMBL2333052,1 7.276,2 33.3,3 48.9,4 1.021,5 1.152,6 0.609,7 0.591,8 327.4,9 6.7,11 45,13 5,14 23,16 45,17 15,20 6,21 9,22 5,23 1,24 22,25 8,28 3,29 4,32 23,34 1,35 8.9,36 0.133,37 6,38 28,39 45.963,40 51.824,41 27.387,42 26.575,43 2.2,44 7.678}
{0 CHEMBL2333053,1 7.883,2 32.5,3 45,4 1.038,5 1.155,6 0.608,7 0.606,8 315.34,9 7.5,11 40,13 5,14 22,16 40,17 13,20 6,21 7,22 5,23 1,24 18,25 9,28 3,29 5,32 22,34 1,35 12.5,36 0.15,37 6,38 27,39 41.523,40 46.203,41 24.318,42 24.236,43 2.5,44 8.155}
{0 CHEMBL2333054,1 7.66,2 32.6,3 46.5,4 1.033,5 1.154,6 0.607,7 0.599,8 329.37,9 7,11 43,13 5,14 23,16 43,17 14,20 6,21 8,22 5,23 1,24 20,25 9,28 3,29 5,32 23,34 1,35 11.6,36 0.163,37 7,38 28,39 44.407,40 49.618,41 26.08,42 25.763,43 2.3,44 7.921}
{0 CHEMBL2333055,1 7.294,2 32.7,3 49,4 1.024,5 1.152,6 0.604,7 0.588,8 357.43,9 6.1,11 49,13 5,14 25,16 49,17 16,20 6,21 10,22 5,23 1,24 24,25 9,28 3,29 5,32 25,34 1,35 10.2,36 0.163,37 8,38 30,39 50.174,40 56.449,41 29.603,42 28.816,43 2,44 7.796}
{0 CHEMBL2333056,1 7.857,2 39.1,3 43.5,4 1.023,5 1.139,6 0.644,7 0.631,8 361.41,9 6.5,10 6,11 46,13 11,14 27,16 47,17 18,20 12,21 6,22 5,23 1,24 20,25 8,28 3,29 4,32 26,34 1,35 8.7,36 0.128,37 6,38 35,39 47.08,40 52.409,41 29.625,42 29.048,43 2.2,44 7.699}
{0 CHEMBL2333057,1 7.545,2 32.1,3 46.4,4 1.025,5 1.15,6 0.614,7 0.602,8 211.25,9 10.7,11 28,13 4,14 15,16 28,17 9,20 5,21 4,22 4,24 13,25 6,28 3,29 3,32 15,35 10.7,36 0.107,37 3,38 19,39 28.705,40 32.199,41 17.188,42 16.843,44 5.071}
{0 CHEMBL2333058,1 7.267,2 32.3,3 48.4,4 1.019,5 1.149,6 0.611,7 0.593,8 225.28,9 9.7,11 31,13 4,14 16,16 31,17 10,20 5,21 5,22 4,24 15,25 6,28 3,29 3,32 16,35 9.7,36 0.129,37 4,38 20,39 31.589,40 35.614,41 18.949,42 18.369,44 5.678}
{0 CHEMBL2333059,1 6.847,2 32.4,3 51.4,4 1.01,5 1.147,6 0.607,7 0.579,8 253.34,9 8.1,11 37,13 4,14 18,16 37,17 12,20 5,21 7,22 4,24 19,25 6,28 3,29 3,32 18,35 8.1,36 0.162,37 6,38 22,39 37.356,40 42.445,41 22.472,42 21.423,44 6.488}
{0 CHEMBL2333060,1 7.134,2 32.5,3 50,4 1.019,5 1.155,6 0.604,7 0.583,8 285.36,9 7.5,11 40,13 4,14 20,16 40,17 13,20 5,21 8,22 4,23 1,24 20,25 7,28 3,29 3,32 20,34 1,35 7.5,36 0.175,37 7,38 24,39 40.752,40 46.2,41 24.171,42 23.333,43 2.5,44 7.337}
{0 CHEMBL2333061,1 6.684,2 32.5,3 52.5,4 1.006,5 1.146,6 0.606,7 0.574,8 267.37,9 7.5,11 40,13 4,14 19,16 40,17 13,20 5,21 8,22 4,24 21,25 6,28 3,29 3,32 19,35 7.5,36 0.175,37 7,38 23,39 40.24,40 45.86,41 24.233,42 22.95,44 6.548}
{0 CHEMBL2333062,1 7.799,2 32.6,3 46.5,4 1.039,5 1.17,6 0.6,7 0.596,8 335.37,9 7,11 43,13 4,14 23,16 43,17 14,20 5,21 9,22 4,23 3,24 20,25 9,28 3,29 3,32 23,34 3,35 7,36 0.163,37 7,38 27,39 44.661,40 50.294,41 25.807,42 25.627,43 7,44 8.155}
{0 CHEMBL2333063,1 6.544,2 32.6,3 53.5,4 1.003,5 1.146,6 0.605,7 0.569,8 281.4,9 7,11 43,13 4,14 20,16 43,17 14,20 5,21 9,22 4,24 23,25 6,28 3,29 3,32 20,35 7,36 0.186,37 8,38 24,39 43.123,40 49.275,41 25.995,42 24.477,44 6.333}
{0 CHEMBL2333064,1 7.465,2 32.6,3 47.8,4 1.028,5 1.153,6 0.605,7 0.593,8 343.4,9 6.5,11 46,13 5,14 24,16 46,17 15,20 6,21 9,22 5,23 1,24 22,25 9,28 3,29 5,32 24,34 1,35 10.9,36 0.174,37 8,38 29,39 47.291,40 53.034,41 27.841,42 27.29,43 2.2,44 8.398}
{0 CHEMBL2333065,1 7.039,2 32.4,3 50,4 1.014,5 1.148,6 0.609,7 0.585,8 239.31,9 8.8,11 34,13 4,14 17,16 34,17 11,20 5,21 6,22 4,24 17,25 6,28 3,29 3,32 17,35 8.8,36 0.147,37 5,38 21,39 34.473,40 39.03,41 20.71,42 19.896,44 6.371}
{0 CHEMBL460499,1 7.568,2 32.4,3 47.1,4 1.029,5 1.158,6 0.607,7 0.596,8 257.3,9 8.8,11 34,13 4,14 18,16 34,17 11,20 5,21 6,22 4,23 1,24 16,25 7,28 3,29 3,32 18,34 1,35 8.8,36 0.147,37 5,38 22,39 34.985,40 39.369,41 20.648,42 20.28,43 2.9,44 7.538}
