{
  "data_set_description": {
    "collection_date": "November 2013",
    "creator": "Dr Jeremy Besnard, Dr Ivan Olier, Dr Noureddin Sadawi, Dr Larisa Soldatova, Dr Crina Grosan, Prof Ross King, Dr Richard Bickerton, Prof Andrew Hopkins and Dr Willem van Hoorn",
    "default_target_attribute": "pXC50",
    "description": "This dataset contains QSAR data (from ChEMBL version 17) showing activity values (unit is pseudo-pCI50) of several compounds on drug target ChEMBL_ID: CHEMBL4315 (TID: 10544), and it has 203 rows and 1325 features (not including molecule IDs and class feature: molecule_id and pXC50). The features represent Molecular Descriptors which were generated from SMILES strings. Missing value imputation was applied to this dataset (By choosing the Median).",
    "description_version": "1",
    "file_id": "3642093",
    "format": "ARFF",
    "id": "38476",
    "licence": "Public",
    "md5_checksum": "5ffeed1b2c9fa8ffe25d4d31138cecdc",
    "minio_url": "https://data.openml.org/datasets/0003/38476/dataset_38476.pq",
    "name": "QSAR-DATASET-FOR-DRUG-TARGET-CHEMBL4315",
    "original_data_url": "https://www.ebi.ac.uk/chembl/target/inspect/CHEMBL4315",
    "parquet_url": "https://data.openml.org/datasets/0003/38476/dataset_38476.pq",
    "processing_date": "2018-10-04 06:00:08",
    "row_id_attribute": "molecule_id",
    "status": "deactivated",
    "tag": [
      "MetaQSAR",
      "study_13"
    ],
    "upload_date": "2016-07-16T04:20:37",
    "url": "https://api.openml.org/data/v1/download/3642093/QSAR-DATASET-FOR-DRUG-TARGET-CHEMBL4315.arff",
    "version": "12",
    "visibility": "public"
  }
}