{
  "data_set_description": {
    "collection_date": "November 2013",
    "creator": "Dr Jeremy Besnard, Dr Ivan Olier, Dr Noureddin Sadawi, Dr Larisa Soldatova, Dr Crina Grosan, Prof Ross King, Dr Richard Bickerton, Prof Andrew Hopkins and Dr Willem van Hoorn",
    "default_target_attribute": "pXC50",
    "description": "This dataset contains QSAR data (from ChEMBL version 17) showing activity values (unit is pseudo-pCI50) of several compounds on drug target ChEMBL_ID: CHEMBL5865 (TID: 101588), and it has 36 rows and 1127 features (not including molecule IDs and class feature: molecule_id and pXC50). The features represent Molecular Descriptors which were generated from SMILES strings. Missing value imputation was applied to this dataset (By choosing the Median).",
    "description_version": "1",
    "file_id": "3641707",
    "format": "ARFF",
    "id": "38470",
    "licence": "Public",
    "md5_checksum": "53a859ee58f000107cf4d76cf0ca580e",
    "minio_url": "https://data.openml.org/datasets/0003/38470/dataset_38470.pq",
    "name": "QSAR-DATASET-FOR-DRUG-TARGET-CHEMBL5865",
    "original_data_url": "https://www.ebi.ac.uk/chembl/target/inspect/CHEMBL5865",
    "parquet_url": "https://data.openml.org/datasets/0003/38470/dataset_38470.pq",
    "processing_date": "2018-10-04 05:59:05",
    "row_id_attribute": "molecule_id",
    "status": "deactivated",
    "tag": [
      "MetaQSAR",
      "study_13"
    ],
    "upload_date": "2016-07-16T04:19:00",
    "url": "https://api.openml.org/data/v1/download/3641707/QSAR-DATASET-FOR-DRUG-TARGET-CHEMBL5865.arff",
    "version": "12",
    "visibility": "public"
  }
}