"molecule_id","FCFP4_1024b201","FCFP4_1024b1","FCFP4_1024b10","FCFP4_1024b100","FCFP4_1024b1000","FCFP4_1024b1001","FCFP4_1024b1002","FCFP4_1024b1003","FCFP4_1024b1004","FCFP4_1024b1005","FCFP4_1024b1006","FCFP4_1024b1007","FCFP4_1024b1008","FCFP4_1024b1009","FCFP4_1024b101","FCFP4_1024b1010","FCFP4_1024b1011","FCFP4_1024b1012","FCFP4_1024b1013","FCFP4_1024b1014","FCFP4_1024b1015","FCFP4_1024b1016","FCFP4_1024b1017","FCFP4_1024b1018","FCFP4_1024b1019","FCFP4_1024b102","FCFP4_1024b1020","FCFP4_1024b1021","FCFP4_1024b1022","FCFP4_1024b1023","FCFP4_1024b1024","FCFP4_1024b103","FCFP4_1024b104","FCFP4_1024b105","FCFP4_1024b106","FCFP4_1024b107","FCFP4_1024b108","FCFP4_1024b109","FCFP4_1024b11","FCFP4_1024b110","FCFP4_1024b111","FCFP4_1024b112","FCFP4_1024b113","FCFP4_1024b114","FCFP4_1024b115","FCFP4_1024b116","FCFP4_1024b117","FCFP4_1024b118","FCFP4_1024b119","FCFP4_1024b12","FCFP4_1024b120","pXC50"
{2 1,8 1,52 6.1}
{0 CHEMBL1210703,2 1,25 1,36 1,52 6}
{0 CHEMBL1823380,1 1,2 1,52 5.377}
{0 CHEMBL1823381,1 1,2 1,52 5.26}
{0 CHEMBL1823382,2 1,52 5.108}
{0 CHEMBL1823383,1 1,2 1,52 5}
{0 CHEMBL1823384,1 1,2 1,52 5}
{0 CHEMBL1823385,1 1,2 1,52 5}
{0 CHEMBL1823386,2 1,52 5}
{0 CHEMBL1823387,2 1,52 5}
{0 CHEMBL2022495,2 1,3 1,36 1,52 5.4}
{0 CHEMBL2022739,2 1,3 1,36 1,52 5.2}
{0 CHEMBL454407,2 1,3 1,27 1,52 4.9}
{0 CHEMBL459689,2 1,3 1,27 1,52 5.4}
{0 CHEMBL459900,2 1,3 1,27 1,52 4}
{0 CHEMBL503427,2 1,3 1,25 1,27 1,52 5.2}
{0 CHEMBL84149,2 1,3 1,52 4.469}
{0 CHEMBL93883,2 1,3 1,52 4}
