"molecule_id","AMW","C.","H.","Me","Mi","Mp","Mv","MW","N.","nAB","nAT","nB","nBM","nBO","nBR","nBT","nC","nCL","nCsp","nCsp2","nCsp3","nDB","nF","nH","nHet","nHM","nI","nN","pXC50"
{1 8.778,2 48.8,3 37.2,4 1.009,5 1.113,6 0.73,7 0.699,8 377.47,9 7,10 23,11 43,13 24,14 30,16 46,17 21,20 20,21 1,22 1,23 1,24 16,25 6,26 1,28 3,29 5.35}
{0 CHEMBL101253,1 8.671,2 50,3 37.5,4 1.001,5 1.111,6 0.736,7 0.702,8 346.84,9 10,10 23,11 40,13 23,14 28,16 43,17 20,18 1,20 19,21 1,24 15,25 5,26 1,28 4,29 5.35}
{0 CHEMBL103667,1 6.944,2 40.8,3 48.7,4 0.995,5 1.128,6 0.652,7 0.614,8 527.73,9 6.6,10 22,11 76,13 23,14 43,16 80,17 31,20 20,21 11,22 1,24 37,25 8,28 5,29 4.523}
{0 CHEMBL105442,1 12.274,2 43.6,3 35.9,4 1.034,5 1.13,6 0.754,7 0.708,8 478.68,9 5.1,10 12,11 39,13 13,14 27,16 41,17 17,18 1,20 13,21 4,22 1,23 2,24 14,25 8,26 2,27 1,28 2,29 5}
{0 CHEMBL1082440,1 7.43,2 37.2,3 48.8,4 1,5 1.13,6 0.661,7 0.614,8 319.47,9 7,10 11,11 43,13 13,14 24,16 45,17 16,20 9,21 7,22 2,24 21,25 6,26 1,28 3,29 6}
{0 CHEMBL1084546,1 9.228,2 38.2,3 36.4,4 1.043,5 1.152,6 0.672,7 0.67,8 507.55,9 12.7,10 18,11 55,13 21,14 38,16 58,17 21,20 16,21 5,22 3,23 3,24 20,25 14,26 1,28 7,29 5.7}
{0 CHEMBL1090356,1 8.163,2 45.8,3 40.3,4 1.002,5 1.117,6 0.708,7 0.674,8 587.76,9 9.7,10 33,11 72,13 34,14 49,16 78,17 33,20 28,21 5,22 1,24 29,25 10,26 1,28 7,29 5.7}
{0 CHEMBL1090360,1 8.163,2 45.8,3 40.3,4 1.002,5 1.117,6 0.708,7 0.674,8 587.76,9 9.7,10 33,11 72,13 34,14 49,16 78,17 33,20 28,21 5,22 1,24 29,25 10,26 1,28 7,29 5.7}
{0 CHEMBL116070,1 12.042,2 48.3,3 31,4 1.024,5 1.098,6 0.792,7 0.751,8 349.22,9 6.9,10 16,11 29,13 17,14 22,15 1,16 31,17 14,20 14,22 1,24 9,25 6,26 2,28 2,29 5.7}
{0 CHEMBL1173655,1 8.237,2 40.7,3 42.4,4 1.018,5 1.135,6 0.671,7 0.648,8 485.99,9 8.5,10 17,11 59,13 19,14 37,16 62,17 24,18 1,20 17,21 7,22 2,23 1,24 25,25 10,26 1,28 5,29 5}
{0 CHEMBL117697,1 7.853,2 46.9,3 40.6,4 1.002,5 1.118,6 0.696,7 0.669,8 251.31,9 9.4,10 17,11 32,13 17,14 21,16 34,17 15,20 14,21 1,24 13,25 4,28 3,29 5.7}
{0 CHEMBL1190711,1 8.307,2 42.6,3 38.3,4 1.019,5 1.13,6 0.68,7 0.669,8 390.44,9 12.8,10 22,11 47,13 23,14 32,16 50,17 20,20 18,21 2,22 1,24 18,25 9,28 6,29 5.7}
{0 CHEMBL119385,1 11.791,2 51.4,3 24.3,4 1.049,5 1.115,6 0.798,7 0.784,8 436.28,9 8.1,10 12,11 37,13 17,14 31,16 40,17 19,18 2,20 19,22 5,23 2,24 9,25 9,26 3,28 3,29 5}
{0 CHEMBL1230020,1 10.094,2 41.5,3 34.1,4 1.046,5 1.136,6 0.71,7 0.699,8 413.86,9 7.3,10 16,11 41,13 19,14 29,16 43,17 17,18 1,20 14,21 3,22 3,23 2,24 14,25 10,26 2,28 3,29 5}
{0 CHEMBL1230122,1 8.444,2 41.3,3 39.1,4 1.032,5 1.144,6 0.66,7 0.657,8 388.41,9 8.7,10 12,11 46,13 14,14 31,16 49,17 19,20 13,21 6,22 2,23 2,24 18,25 9,28 4,29 5.7}
{0 CHEMBL1236107,1 9.217,2 46.2,3 33.3,4 1.011,5 1.119,6 0.743,7 0.716,8 359.45,9 17.9,10 26,11 39,13 26,14 30,16 43,17 18,20 17,21 1,24 13,25 8,26 1,28 7,29 5}
{0 CHEMBL1236126,1 7.866,2 39.3,3 42.9,4 1.022,5 1.132,6 0.649,7 0.636,8 440.5,9 7.1,10 16,11 56,13 20,14 34,16 58,17 22,20 15,21 7,22 4,24 24,25 10,28 4,29 5.7}
{0 CHEMBL1240703,1 7.928,2 47.3,3 40.5,4 1.007,5 1.114,6 0.692,7 0.669,8 586.69,9 5.4,10 30,11 74,13 32,14 52,16 82,17 35,20 26,21 9,22 2,24 30,25 9,28 4,29 5}
{0 CHEMBL1241473,1 8.47,2 38.5,3 38.5,4 1.034,5 1.138,6 0.656,7 0.656,8 440.46,9 11.5,10 18,11 52,13 21,14 34,16 54,17 20,20 17,21 3,22 3,24 20,25 12,28 6,29 5.7}
{0 CHEMBL1241674,1 7.907,2 41,3 41,4 1.009,5 1.135,6 0.674,7 0.653,8 308.38,9 15.4,10 20,11 39,13 20,14 26,16 42,17 16,20 13,21 3,24 16,25 7,28 6,29 5}
{0 CHEMBL1242373,1 8.365,2 45.8,3 39.6,4 1.002,5 1.115,6 0.718,7 0.681,8 401.53,9 10.4,10 22,11 48,13 23,14 33,16 52,17 22,20 19,21 3,22 1,24 19,25 7,26 1,28 5,29 5.7}
{0 CHEMBL124660,1 6.781,2 37.3,3 50.6,4 0.998,5 1.136,6 0.633,7 0.596,8 562.79,9 7.2,10 17,11 83,13 18,14 45,16 87,17 31,20 15,21 16,22 1,24 42,25 10,28 6,29 5}
{0 CHEMBL127898,1 8.957,2 46.6,3 34.5,4 1.034,5 1.136,6 0.691,7 0.692,8 519.52,9 8.6,10 17,11 58,13 22,14 41,16 61,17 27,19 2,20 20,21 5,22 3,23 3,24 20,25 11,28 5,29 5.7}
{0 CHEMBL1287853,1 7.188,2 37,3 49.3,4 0.999,5 1.134,6 0.65,7 0.608,8 524.76,9 8.2,10 18,11 73,13 20,14 40,16 76,17 27,20 16,21 11,22 2,24 36,25 10,26 1,28 6,29 5.42}
{0 CHEMBL1289926,1 8.402,2 47.8,3 39.1,4 1,5 1.109,6 0.727,7 0.689,8 386.51,9 8.7,10 22,11 46,13 24,14 31,16 49,17 22,20 21,21 1,22 2,24 18,25 6,26 1,28 4,29 5}
{0 CHEMBL1336,1 9.685,2 43.8,3 33.3,4 1.048,5 1.144,6 0.691,7 0.696,8 464.86,9 8.3,10 18,11 48,13 20,14 34,16 50,17 21,18 1,20 19,21 2,22 2,23 3,24 16,25 11,26 1,28 4,29 5.35}
{0 CHEMBL1375640,1 9.51,2 42.9,3 37.1,4 1.016,5 1.118,6 0.737,7 0.699,8 332.84,9 11.4,10 17,11 35,13 17,14 24,16 37,17 15,18 1,20 13,21 2,24 13,25 7,26 2,28 4,29 5.7}
{0 CHEMBL1421,1 8.272,2 37.3,3 44.1,4 1.01,5 1.134,6 0.679,7 0.642,8 488.07,9 11.9,10 17,11 59,13 18,14 36,16 62,17 22,18 1,20 14,21 8,22 1,24 26,25 11,26 2,28 7,29 5.35}
{0 CHEMBL14762,1 6.817,2 36.5,3 50,4 0.996,5 1.141,6 0.637,7 0.598,8 354.51,9 11.5,10 16,11 52,13 16,14 28,16 54,17 19,20 11,21 8,24 26,25 7,28 6,29 5}
{0 CHEMBL1516890,1 8.098,2 50,3 38.2,4 1.001,5 1.111,6 0.714,7 0.689,8 275.33,9 8.8,10 16,11 34,13 18,14 24,16 37,17 17,20 16,21 1,22 2,24 13,25 4,28 3,29 5.7}
{0 CHEMBL1614701,1 10.898,2 40.5,3 35.7,4 1.039,5 1.135,6 0.711,7 0.694,8 457.71,9 9.5,10 16,11 42,13 17,14 29,15 1,16 44,17 17,18 1,20 14,21 3,22 1,23 1,24 15,25 10,26 2,28 4,29 5}
{0 CHEMBL1614705,1 8.664,2 41.7,3 39.6,4 1.022,5 1.136,6 0.684,7 0.666,8 415.89,9 10.4,10 17,11 48,13 18,14 32,16 51,17 20,18 1,20 14,21 6,22 1,23 1,24 19,25 9,26 1,28 5,29 5.7}
{0 CHEMBL162,1 7.649,2 45.9,3 42.6,4 1.002,5 1.118,6 0.685,7 0.656,8 466.58,9 6.6,10 24,11 61,13 25,14 42,16 68,17 28,20 19,21 9,22 1,24 26,25 7,28 4,29 7.495}
{0 CHEMBL1624529,1 9.253,2 44.4,3 33.3,4 1.047,5 1.145,6 0.678,7 0.69,8 416.39,9 8.9,10 12,11 45,13 15,14 34,16 49,17 20,20 15,21 5,22 3,23 3,24 15,25 10,28 4,29 5.7}
{0 CHEMBL1682540,1 8.714,2 48.1,3 33.3,4 1.01,5 1.123,6 0.724,7 0.71,8 235.27,9 18.5,10 20,11 27,13 20,14 21,16 30,17 13,20 13,24 9,25 5,28 5,29 5.7}
{0 CHEMBL1682545,1 8.86,2 48.5,3 36.4,4 1.001,5 1.108,6 0.749,7 0.708,8 292.39,9 12.1,10 21,11 33,13 21,14 24,16 36,17 16,20 16,24 12,25 5,26 1,28 4,29 5.7}
{0 CHEMBL1682546,1 8.512,2 47.2,3 38.9,4 0.997,5 1.111,6 0.735,7 0.692,8 306.42,9 11.1,10 21,11 36,13 21,14 25,16 39,17 17,20 16,21 1,24 14,25 5,26 1,28 4,29 5.7}
{0 CHEMBL1682552,1 7.388,2 42.2,3 44.4,4 0.995,5 1.131,6 0.675,7 0.64,8 332.45,9 13.3,10 20,11 45,13 20,14 29,16 49,17 19,20 13,21 6,24 20,25 6,28 6,29 7.6}
{0 CHEMBL1682553,1 7.694,2 42.1,3 42.1,4 1.001,5 1.133,6 0.68,7 0.652,8 292.38,9 15.8,10 20,11 38,13 20,14 25,16 41,17 16,20 13,21 3,24 16,25 6,28 6,29 7.5}
{0 CHEMBL1682558,1 7.676,2 43.1,3 43.1,4 1.006,5 1.133,6 0.672,7 0.646,8 391.49,9 9.8,10 21,11 51,13 21,14 33,16 55,17 22,20 16,21 6,23 1,24 22,25 7,28 5,29 5.7}
{0 CHEMBL1721885,1 7.501,2 39,3 45.8,4 1.014,5 1.138,6 0.643,7 0.621,8 442.54,9 6.8,10 11,11 59,13 14,14 35,16 62,17 23,20 14,21 9,22 3,23 1,24 27,25 9,28 4,29 5}
{0 CHEMBL17370,1 8.606,2 50,3 38.1,4 1.002,5 1.111,6 0.736,7 0.698,8 361.47,9 7.1,10 23,11 42,13 23,14 29,16 45,17 21,20 20,21 1,23 1,24 16,25 5,26 1,28 3,29 5.7}
{0 CHEMBL1789941,1 7.473,2 41.5,3 43.9,4 0.998,5 1.134,6 0.673,7 0.641,8 306.41,9 14.6,10 15,11 41,13 16,14 26,16 44,17 17,19 1,20 9,21 7,24 18,25 6,28 6,29 5}
{0 CHEMBL180022,1 8.074,2 43.5,3 42,4 1.008,5 1.124,6 0.687,7 0.658,8 557.1,9 8.7,10 23,11 69,13 26,14 43,16 72,17 30,18 1,19 1,20 23,21 6,22 2,24 29,25 10,26 1,28 6,29 5}
{0 CHEMBL1825138,1 8.661,2 40.4,3 42.3,4 1.016,5 1.136,6 0.688,7 0.656,8 450.38,9 9.6,10 17,11 52,13 17,14 33,16 55,17 21,18 2,20 14,21 7,23 1,24 22,25 9,26 2,28 5,29 5.7}
{0 CHEMBL183844,1 7.581,2 46.9,3 42.9,4 0.998,5 1.115,6 0.689,7 0.658,8 371.47,9 6.1,10 18,11 49,13 20,14 31,16 52,17 23,20 20,21 3,22 2,24 21,25 5,28 3,29 5.7}
{0 CHEMBL184847,1 7.581,2 46.9,3 42.9,4 0.998,5 1.115,6 0.689,7 0.658,8 371.47,9 6.1,10 18,11 49,13 20,14 31,16 52,17 23,20 20,21 3,22 2,24 21,25 5,28 3,29 5.7}
{0 CHEMBL185569,1 7.77,2 47.8,3 41.3,4 1.001,5 1.114,6 0.696,7 0.668,8 357.44,9 6.5,10 18,11 46,13 20,14 30,16 49,17 22,20 20,21 2,22 2,24 19,25 5,28 3,29 5.7}
{0 CHEMBL1908391,1 7.556,2 42.4,3 45.5,4 0.994,5 1.123,6 0.686,7 0.642,8 498.71,9 9.1,10 23,11 66,13 24,14 40,16 70,17 28,20 21,21 7,22 1,24 30,25 8,26 1,28 6,29 5}
{0 CHEMBL1908392,1 7.189,2 43.3,3 46.3,4 0.995,5 1.124,6 0.669,7 0.633,8 481.65,9 7.5,10 22,11 67,13 24,14 40,16 71,17 29,20 22,21 7,22 2,24 31,25 7,28 5,29 7.854}
{0 CHEMBL1908393,1 7.741,2 41.5,3 43.9,4 1.017,5 1.134,6 0.653,7 0.635,8 634.74,9 4.9,10 17,11 82,13 21,14 51,16 87,17 34,20 21,21 13,22 4,23 2,24 36,25 12,28 4,29 5}
{0 CHEMBL1908394,1 8.237,2 40.9,3 42.4,4 1.019,5 1.14,6 0.671,7 0.647,8 543.67,9 7.6,10 21,11 66,13 22,14 42,16 70,17 27,20 18,21 9,22 1,23 3,24 28,25 11,26 1,28 5,29 5}
{0 CHEMBL1908395,1 6.979,2 39.4,3 48.5,4 0.996,5 1.133,6 0.649,7 0.612,8 460.64,9 9.1,10 11,11 66,13 15,14 37,16 69,17 26,19 1,20 13,21 12,22 3,24 32,25 8,28 6,29 5}
{0 CHEMBL1908396,1 8.286,2 41.4,3 41.4,4 1.016,5 1.123,6 0.682,7 0.657,8 480.59,9 6.9,10 22,11 58,13 23,14 37,16 61,17 24,20 19,21 5,22 1,24 24,25 10,26 1,28 4,29 5}
{0 CHEMBL1908397,1 7.388,2 44.4,3 44.4,4 0.996,5 1.123,6 0.679,7 0.645,8 332.44,9 8.9,10 16,11 45,13 18,14 28,16 48,17 20,20 16,21 4,22 2,24 20,25 5,28 4,29 5.602}
{0 CHEMBL191003,1 10.113,2 38.5,3 30.8,4 1.057,5 1.151,6 0.691,7 0.701,8 394.4,9 15.4,10 17,11 39,13 20,14 29,16 41,17 15,20 15,22 3,23 2,24 12,25 12,26 1,28 6,29 5}
{0 CHEMBL1929238,1 8.038,2 36.2,3 47.8,4 1.007,5 1.133,6 0.669,7 0.623,8 554.6,9 7.2,10 11,11 69,13 14,14 38,16 71,17 25,18 2,20 13,21 12,22 3,24 33,25 11,26 3,28 5,29 4.523}
{0 CHEMBL1958401,1 7.115,2 39.5,3 47.4,4 0.998,5 1.134,6 0.653,7 0.618,8 270.37,9 10.5,10 6,11 38,13 9,14 22,16 40,17 15,20 9,21 6,22 3,24 18,25 5,28 4,29 5.7}
{0 CHEMBL196363,1 8.534,2 45.5,3 38.6,4 1.005,5 1.116,6 0.72,7 0.686,8 375.49,9 11.4,10 22,11 44,13 23,14 30,16 47,17 20,20 19,21 1,22 1,24 17,25 7,26 1,28 5,29 5.7}
{0 CHEMBL1964290,1 7.685,2 42.5,3 42.5,4 1.003,5 1.13,6 0.676,7 0.65,8 307.39,9 12.5,10 17,11 40,13 18,14 25,16 42,17 17,20 15,21 2,22 1,24 17,25 6,28 5,29 6.1}
{0 CHEMBL1964413,1 10.283,2 45,3 27.5,4 1.072,5 1.176,6 0.681,7 0.714,8 411.34,9 12.5,10 21,11 40,13 21,14 32,16 43,17 18,20 15,21 3,23 6,24 11,25 11,28 5,29 5.7}
{0 CHEMBL1964444,1 9.114,2 44.7,3 34.2,4 1.041,5 1.15,6 0.68,7 0.687,8 346.34,9 10.5,10 17,11 38,13 18,14 27,16 40,17 17,20 15,21 2,22 1,23 3,24 13,25 8,28 4,29 5.7}
{0 CHEMBL1964644,1 9.597,2 37.9,3 34.5,4 1.038,5 1.131,6 0.701,7 0.69,8 278.32,9 13.8,10 11,11 29,13 14,14 20,16 30,17 11,20 10,21 1,22 3,24 10,25 8,26 1,28 4,29 5.7}
{0 CHEMBL1964687,1 8.148,2 45.1,3 41.2,4 1,5 1.117,6 0.71,7 0.671,8 415.56,9 9.8,10 22,11 51,13 23,14 34,16 55,17 23,20 19,21 4,22 1,24 21,25 7,26 1,28 5,29 5.7}
{0 CHEMBL1964692,1 8.884,2 43.8,3 35.4,4 1.035,5 1.148,6 0.68,7 0.681,8 426.44,9 12.5,10 22,11 48,13 23,14 34,16 51,17 21,20 19,21 2,22 1,23 3,24 17,25 10,28 6,29 5.7}
{0 CHEMBL1964804,1 8.377,2 41.5,3 41.5,4 1.013,5 1.121,6 0.692,7 0.661,8 343.44,9 7.3,10 17,11 41,13 19,14 26,16 43,17 17,20 14,21 3,22 2,24 17,25 7,26 1,28 3,29 6.6}
{0 CHEMBL1964937,1 7.397,2 42.9,3 44.9,4 1,5 1.125,6 0.669,7 0.638,8 362.47,9 8.2,10 16,11 49,13 18,14 30,16 52,17 21,20 16,21 5,22 2,24 22,25 6,28 4,29 7}
{0 CHEMBL1965131,1 10.536,2 47.2,3 33.3,4 1.025,5 1.103,6 0.774,7 0.735,8 379.28,9 5.6,10 16,11 36,13 18,14 26,16 38,17 17,18 2,20 16,21 1,22 2,24 12,25 7,26 3,28 2,29 6.5}
{0 CHEMBL1965423,1 8.276,2 44.9,3 40.8,4 1.003,5 1.124,6 0.708,7 0.671,8 405.54,9 10.2,10 25,11 49,13 25,14 33,16 53,17 22,20 18,21 4,23 1,24 20,25 7,26 1,28 5,29 5.7}
{0 CHEMBL1965507,1 8.719,2 43.8,3 37.5,4 1.013,5 1.121,6 0.712,7 0.686,8 418.52,9 12.5,10 22,11 48,13 24,14 33,16 51,17 21,20 20,21 1,22 2,24 18,25 9,26 1,28 6,29 6.8}
{0 CHEMBL1965570,1 9.072,2 49,3 34.7,4 1.017,5 1.114,6 0.732,7 0.71,8 444.52,9 8.2,10 27,11 49,13 28,14 36,16 53,17 24,20 24,22 1,23 1,24 17,25 8,26 1,28 4,29 5.7}
{0 CHEMBL1965589,1 8.509,2 43.8,3 37.5,4 1.024,5 1.141,6 0.681,7 0.673,8 408.45,9 12.5,10 22,11 48,13 22,14 34,16 52,17 21,20 16,21 5,23 2,24 18,25 9,28 6,29 5.7}
{0 CHEMBL1965631,1 7.663,2 40.8,3 42.9,4 1.005,5 1.135,6 0.67,7 0.644,8 375.48,9 14.3,10 21,11 49,13 22,14 31,16 52,17 20,20 16,21 4,22 1,24 21,25 8,28 7,29 5.7}
{0 CHEMBL1965660,1 10.241,2 44.1,3 32.4,4 1.03,5 1.125,6 0.742,7 0.723,8 348.21,9 14.7,10 17,11 34,13 18,14 25,16 36,17 15,18 2,20 15,22 1,24 11,25 8,26 2,28 5,29 6.1}
{0 CHEMBL1965836,1 8.349,2 43.4,3 39.6,4 1.027,5 1.143,6 0.667,7 0.659,8 442.48,9 7.5,10 22,11 53,13 22,14 35,16 56,17 23,20 18,21 5,23 3,24 21,25 9,28 4,29 8.1}
{0 CHEMBL1965845,1 7.24,2 42.3,3 46.2,4 0.998,5 1.126,6 0.664,7 0.63,8 376.5,9 7.7,10 16,11 52,13 18,14 31,16 55,17 22,20 16,21 6,22 2,24 24,25 6,28 4,29 6.5}
{0 CHEMBL1965988,1 8.222,2 46.2,3 40.4,4 1,5 1.114,6 0.716,7 0.677,8 427.57,9 9.6,10 22,11 52,13 24,14 34,16 55,17 24,19 2,20 20,21 2,22 1,24 21,25 7,26 1,28 5,29 5.7}
{0 CHEMBL1966087,1 7.226,2 43.2,3 45.9,4 0.995,5 1.125,6 0.67,7 0.634,8 267.36,9 8.1,10 12,11 37,13 13,14 22,16 39,17 16,20 12,21 4,22 1,24 17,25 4,28 3,29 6.2}
{0 CHEMBL1966279,1 8.379,2 42.1,3 40.4,4 1.015,5 1.123,6 0.69,7 0.665,8 477.59,9 8.8,10 18,11 57,13 23,14 37,16 60,17 24,20 21,21 3,22 5,24 23,25 10,26 1,28 5,29 5.7}
{0 CHEMBL1966343,1 7.324,2 40,3 45.7,4 1.001,5 1.134,6 0.658,7 0.627,8 256.34,9 11.4,10 15,11 35,13 15,14 21,16 37,17 14,20 10,21 4,24 16,25 5,28 4,29 6.9}
{0 CHEMBL1966514,1 9.072,2 49,3 34.7,4 1.017,5 1.114,6 0.732,7 0.71,8 444.52,9 8.2,10 27,11 49,13 28,14 36,16 53,17 24,20 24,22 1,23 1,24 17,25 8,26 1,28 4,29 5.7}
{0 CHEMBL1966628,1 7.173,2 39.5,3 46.5,4 0.995,5 1.137,6 0.66,7 0.624,8 308.43,9 14,10 16,11 43,13 16,14 26,16 46,17 17,20 11,21 6,24 20,25 6,28 6,29 7}
{0 CHEMBL1966703,1 7.396,2 43.2,3 45.5,4 1.002,5 1.131,6 0.665,7 0.634,8 325.42,9 6.8,10 11,11 44,13 13,14 27,16 47,17 19,20 12,21 7,22 2,23 1,24 20,25 5,28 3,29 5.7}
{0 CHEMBL1966722,1 8.955,2 45.7,3 39.1,4 1.009,5 1.111,6 0.729,7 0.69,8 411.94,9 6.5,10 18,11 46,13 20,14 30,16 48,17 21,18 1,20 20,21 1,22 2,24 18,25 7,26 2,28 3,29 5.7}
{0 CHEMBL1966808,1 8.984,2 44.4,3 36.1,4 1.012,5 1.119,6 0.727,7 0.698,8 323.41,9 13.9,10 16,11 36,13 17,14 27,16 40,17 16,20 12,21 4,22 1,24 13,25 7,26 1,28 5,29 5.7}
{0 CHEMBL1966816,1 10.009,2 45.7,3 28.6,4 1.063,5 1.161,6 0.687,7 0.713,8 350.3,9 11.4,10 17,11 35,13 18,14 27,16 37,17 16,20 15,21 1,22 1,23 4,24 10,25 9,28 4,29 5.7}
{0 CHEMBL1967094,1 9.433,2 48.7,3 35.9,4 1.009,5 1.104,6 0.758,7 0.717,8 367.88,9 7.7,10 21,11 39,13 22,14 28,16 42,17 19,18 1,20 18,21 1,22 1,24 14,25 6,26 2,28 3,29 5.7}
{0 CHEMBL1967116,1 8.265,2 45.5,3 40,4 1.002,5 1.117,6 0.713,7 0.677,8 454.6,9 10.9,10 27,11 55,13 28,14 37,16 59,17 25,20 23,21 2,22 1,24 22,25 8,26 1,28 6,29 5.7}
{0 CHEMBL1967302,1 7.663,2 46.2,3 42.3,4 1,5 1.118,6 0.688,7 0.659,8 398.5,9 7.7,10 22,11 52,13 23,14 34,16 56,17 24,20 20,21 4,22 1,24 22,25 6,28 4,29 6.5}
{0 CHEMBL1967531,1 8.816,2 46.3,3 36.6,4 1.008,5 1.115,6 0.73,7 0.699,8 361.46,9 12.2,10 22,11 41,13 23,14 29,16 44,17 19,20 19,22 1,24 15,25 7,26 1,28 5,29 5.7}
{0 CHEMBL1967544,1 7.9,2 44.4,3 42.9,4 0.999,5 1.117,6 0.698,7 0.659,8 497.67,9 7.9,10 28,11 63,13 30,14 40,16 67,17 28,20 24,21 4,22 2,24 27,25 8,26 1,28 5,29 7.1}
{0 CHEMBL1967560,1 6.878,2 35.5,3 50,4 1.001,5 1.143,6 0.629,7 0.595,8 522.73,9 10.5,10 12,11 76,13 14,14 42,16 80,17 27,20 12,21 15,22 2,24 38,25 11,28 8,29 5.7}
{0 CHEMBL1967564,1 7.707,2 42.4,3 42.4,4 1.005,5 1.13,6 0.675,7 0.65,8 254.32,9 12.1,10 15,11 33,13 16,14 21,16 35,17 14,20 11,21 3,22 1,24 14,25 5,28 4,29 5.7}
{0 CHEMBL1967720,1 8.543,2 43.5,3 38.7,4 1.015,5 1.127,6 0.7,7 0.676,8 529.65,9 11.3,10 27,11 62,13 29,14 42,16 66,17 27,20 24,21 3,22 2,23 1,24 24,25 11,26 1,28 7,29 5.7}
{0 CHEMBL1967878,1 7.168,2 38.1,3 47.6,4 1.002,5 1.143,6 0.644,7 0.612,8 451.61,9 11.1,10 12,11 63,13 14,14 37,16 67,17 24,20 13,21 11,22 2,23 1,24 30,25 9,28 7,29 5.8}
{0 CHEMBL1967887,1 7.454,2 41.7,3 44.4,4 1.001,5 1.13,6 0.668,7 0.638,8 268.35,9 11.1,10 16,11 36,13 16,14 22,16 38,17 15,20 12,21 3,24 16,25 5,28 4,29 6.6}
{0 CHEMBL1968127,1 7.428,2 40,3 45.5,4 1.005,5 1.14,6 0.655,7 0.627,8 408.53,9 10.9,10 21,11 55,13 21,14 33,16 58,17 22,20 15,21 7,23 1,24 25,25 8,28 6,29 5.7}
{0 CHEMBL1968151,1 10.358,2 46.2,3 26.9,4 1.031,5 1.117,6 0.765,7 0.751,8 269.31,9 19.2,10 16,11 26,13 17,14 22,16 29,17 12,20 12,22 1,24 7,25 7,26 1,28 5,29 5.7}
{0 CHEMBL1968380,1 6.776,2 36.4,3 50.6,4 0.998,5 1.14,6 0.631,7 0.594,8 521.74,9 9.1,10 12,11 77,13 14,14 42,16 81,17 28,20 12,21 16,22 2,24 39,25 10,28 7,29 5.7}
{0 CHEMBL1968406,1 8.148,2 45.1,3 41.2,4 1,5 1.117,6 0.71,7 0.671,8 415.56,9 9.8,10 22,11 51,13 23,14 34,16 55,17 23,20 19,21 4,22 1,24 21,25 7,26 1,28 5,29 5.7}
{0 CHEMBL1968590,1 9.06,2 45.2,3 38.1,4 1.004,5 1.108,6 0.746,7 0.698,8 380.53,9 9.5,10 20,11 42,13 22,14 29,16 45,17 19,20 17,21 2,22 2,24 16,25 7,26 2,28 4,29 5.7}
{0 CHEMBL1968705,1 7.338,2 42.5,3 45.2,4 0.998,5 1.127,6 0.669,7 0.636,8 535.71,9 9.6,10 27,11 73,13 28,14 45,16 78,17 31,20 22,21 9,22 1,24 33,25 9,28 7,29 5.9}
{0 CHEMBL1968791,1 6.877,2 42.6,3 48.5,4 0.988,5 1.125,6 0.664,7 0.621,8 467.67,9 7.4,10 22,11 68,13 22,14 40,16 73,17 29,20 18,21 11,24 33,25 6,28 5,29 5.7}
{0 CHEMBL1969042,1 8.168,2 47.7,3 38.6,4 1.011,5 1.114,6 0.698,7 0.679,8 359.41,9 6.8,10 23,11 44,13 23,14 30,16 47,17 21,20 21,24 17,25 6,28 3,29 6.2}
{0 CHEMBL1969049,1 7.218,2 45.8,3 45.8,4 0.994,5 1.116,6 0.678,7 0.64,8 346.46,9 4.2,10 18,11 48,13 19,14 28,16 50,17 22,20 18,21 4,22 1,24 22,25 4,28 2,29 7.2}
{0 CHEMBL1969126,1 8.823,2 46.5,3 34.9,4 1.027,5 1.137,6 0.696,7 0.692,8 379.4,9 11.6,10 25,11 43,13 25,14 32,16 47,17 20,20 17,21 3,23 2,24 15,25 8,28 5,29 5.7}
{0 CHEMBL1969190,1 8.922,2 45.7,3 34.8,4 1.035,5 1.135,6 0.687,7 0.689,8 410.41,9 8.7,10 22,11 46,13 23,14 33,16 49,17 21,20 20,21 1,22 1,23 2,24 16,25 9,28 4,29 5.7}
{0 CHEMBL1969301,1 7.04,2 41.5,3 47.7,4 0.995,5 1.128,6 0.659,7 0.621,8 457.63,9 7.7,10 16,11 65,13 19,14 37,16 68,17 27,19 1,20 15,21 11,22 2,24 31,25 7,28 5,29 5.7}
{0 CHEMBL1969372,1 8.282,2 43.2,3 38.6,4 1.017,5 1.137,6 0.682,7 0.668,8 364.42,9 13.6,10 22,11 44,13 22,14 30,16 47,17 19,20 16,21 3,23 1,24 17,25 8,28 6,29 5.7}
{0 CHEMBL1969502,1 8.2,2 47.6,3 38.1,4 1.009,5 1.117,6 0.702,7 0.683,8 344.4,9 9.5,10 16,11 42,13 19,14 30,16 46,17 20,20 17,21 3,22 3,24 16,25 6,28 4,29 7}
{0 CHEMBL1969506,1 8.579,2 39.7,3 39.7,4 1.026,5 1.128,6 0.677,7 0.661,8 497.58,9 8.6,10 16,11 58,13 22,14 38,16 61,17 23,20 18,21 5,22 6,24 23,25 12,26 1,28 5,29 5.7}
{0 CHEMBL1969523,1 7.161,2 39.6,3 47.2,4 1,5 1.133,6 0.652,7 0.619,8 379.51,9 9.4,10 12,11 53,13 15,14 30,16 55,17 21,20 14,21 7,22 3,24 25,25 7,28 5,29 5.7}
{0 CHEMBL1969537,1 11.445,2 39.3,3 28.6,4 1.026,5 1.113,6 0.812,7 0.758,8 320.46,9 21.4,10 18,11 28,13 18,14 24,16 32,17 11,20 8,21 3,24 8,25 9,26 3,28 6,29 5.7}
{0 CHEMBL1969561,1 7.49,2 42,3 44,4 1,5 1.13,6 0.672,7 0.641,8 374.49,9 12,10 21,11 50,13 22,14 31,16 53,17 21,20 16,21 5,22 1,24 22,25 7,28 6,29 7.1}
{0 CHEMBL1969588,1 8.585,2 48.7,3 38.5,4 1.001,5 1.114,6 0.729,7 0.694,8 334.83,9 10.3,10 22,11 39,13 22,14 27,16 42,17 19,18 1,20 18,21 1,24 15,25 5,26 1,28 4,29 6.7}
{0 CHEMBL1969664,1 7.777,2 44.2,3 41.9,4 1.006,5 1.124,6 0.681,7 0.656,8 334.41,9 9.3,10 16,11 43,13 17,14 28,16 46,17 19,19 1,20 13,21 5,24 18,25 6,28 4,29 5.7}
{0 CHEMBL1969735,1 8.538,2 42,3 40,4 1.017,5 1.136,6 0.688,7 0.665,8 426.92,9 12,10 22,11 50,13 22,14 33,16 53,17 21,18 1,20 16,21 5,23 1,24 20,25 9,26 1,28 6,29 5.7}
{0 CHEMBL1969755,1 7.787,2 46.7,3 42.2,4 1.007,5 1.122,6 0.682,7 0.658,8 350.42,9 4.4,10 18,11 45,13 19,14 28,16 47,17 21,20 18,21 3,22 1,23 1,24 19,25 5,28 2,29 5.9}
{0 CHEMBL1969843,1 7.457,2 39.5,3 44.7,4 1.004,5 1.137,6 0.659,7 0.631,8 283.37,9 13.2,10 15,11 38,13 15,14 24,16 41,17 15,20 9,21 6,24 17,25 6,28 5,29 6.2}
{0 CHEMBL1969879,1 7.056,2 34.9,3 48.8,4 1.005,5 1.145,6 0.629,7 0.599,8 303.41,9 11.6,10 10,11 43,13 11,14 24,16 45,17 15,20 7,21 8,22 1,24 21,25 7,28 5,29 5.7}
{0 CHEMBL1970074,1 8.733,2 46.8,3 36.2,4 1.029,5 1.139,6 0.689,7 0.684,8 410.43,9 8.5,10 22,11 47,13 23,14 33,16 50,17 22,20 20,21 2,22 1,23 3,24 17,25 8,28 4,29 5.7}
{0 CHEMBL1970104,1 7.26,2 45,3 45,4 0.99,5 1.122,6 0.684,7 0.644,8 290.4,9 10,10 20,11 40,13 20,14 25,16 43,17 18,20 14,21 4,24 18,25 4,28 4,29 5.7}
{0 CHEMBL1970142,1 8.088,2 43.1,3 41.5,4 1.004,5 1.123,6 0.696,7 0.662,8 525.69,9 10.8,10 27,11 65,13 29,14 42,16 69,17 28,20 24,21 4,22 2,24 27,25 10,26 1,28 7,29 5.7}
{0 CHEMBL1970189,1 9.25,2 45.2,3 35.5,4 1.019,5 1.123,6 0.722,7 0.701,8 286.74,9 12.9,10 11,11 31,13 13,14 22,16 33,17 14,18 1,19 1,20 11,21 2,22 1,24 11,25 6,26 1,28 4,29 5.7}
{0 CHEMBL1970203,1 8.481,2 43.1,3 39.2,4 1.01,5 1.122,6 0.704,7 0.675,8 432.55,9 11.8,10 22,11 51,13 24,14 34,16 54,17 22,20 20,21 2,22 2,24 20,25 9,26 1,28 6,29 5.7}
{0 CHEMBL1970217,1 7.218,2 45.8,3 45.8,4 0.994,5 1.116,6 0.678,7 0.64,8 346.46,9 4.2,10 18,11 48,13 19,14 28,16 50,17 22,20 18,21 4,22 1,24 22,25 4,28 2,29 6}
{0 CHEMBL1970314,1 7.979,2 48.5,3 39.4,4 1.002,5 1.115,6 0.705,7 0.679,8 263.32,9 9.1,10 17,11 33,13 18,14 22,16 35,17 16,20 16,22 1,24 13,25 4,28 3,29 5.7}
{0 CHEMBL1970340,1 8.38,2 48.1,3 37,4 1.015,5 1.114,6 0.702,7 0.688,8 226.25,9 7.4,10 16,11 27,13 16,14 19,16 29,17 13,20 13,24 10,25 4,28 2,29 5.7}
{0 CHEMBL1970522,1 8.822,2 45.9,3 37.8,4 1.015,5 1.109,6 0.719,7 0.69,8 326.4,9 5.4,10 12,11 37,13 15,14 25,16 39,17 17,20 16,21 1,22 3,24 14,25 6,26 1,28 2,29 5.7}
{0 CHEMBL1970709,1 10.154,2 44.1,3 38.2,4 1.011,5 1.121,6 0.725,7 0.69,8 345.22,9 11.8,10 16,11 34,13 17,14 23,15 1,16 36,17 15,20 14,21 1,22 1,24 13,25 6,26 1,28 4,29 5.7}
{0 CHEMBL1970806,1 8.984,2 44.4,3 36.1,4 1.012,5 1.119,6 0.727,7 0.698,8 323.41,9 13.9,10 16,11 36,13 17,14 27,16 40,17 16,20 12,21 4,22 1,24 13,25 7,26 1,28 5,29 5.7}
{0 CHEMBL1970903,1 7.5,2 45.3,3 43.4,4 0.996,5 1.121,6 0.686,7 0.652,8 397.52,9 9.4,10 26,11 53,13 26,14 34,16 57,17 24,20 20,21 4,24 23,25 6,28 5,29 6.6}
{0 CHEMBL1970913,1 7.57,2 41.5,3 43.9,4 1.006,5 1.13,6 0.665,7 0.639,8 310.39,9 9.8,10 15,11 41,13 17,14 25,16 43,17 17,20 12,21 5,22 2,24 18,25 6,28 4,29 5.7}
{0 CHEMBL1971021,1 8.451,2 46.2,3 38.5,4 1.026,5 1.136,6 0.68,7 0.671,8 439.47,9 5.8,10 18,11 52,13 20,14 35,16 55,17 24,20 20,21 4,22 2,23 3,24 20,25 8,28 3,29 5.7}
{0 CHEMBL1971029,1 9.086,2 36.9,3 43.1,4 1.016,5 1.133,6 0.681,7 0.646,8 590.56,9 10.8,10 18,11 65,13 21,14 40,15 1,16 68,17 24,20 17,21 7,22 3,24 28,25 13,26 2,28 7,29 5.7}
{0 CHEMBL1971141,1 7.676,2 46.7,3 42.2,4 1.001,5 1.116,6 0.689,7 0.66,8 345.43,9 6.7,10 18,11 45,13 20,14 28,16 47,17 21,20 20,21 1,22 2,24 19,25 5,28 3,29 5.7}
{0 CHEMBL1971149,1 8.432,2 42.3,3 38.5,4 1.026,5 1.142,6 0.671,7 0.664,8 438.48,9 11.5,10 22,11 52,13 23,14 35,16 55,17 22,20 17,21 5,22 1,23 2,24 20,25 10,28 6,29 5.7}
{0 CHEMBL1971186,1 8.052,2 42.6,3 40.4,4 1.014,5 1.137,6 0.676,7 0.658,8 378.45,9 12.8,10 21,11 47,13 21,14 32,16 51,17 20,20 15,21 5,23 1,24 19,25 8,28 6,29 5.7}
{0 CHEMBL1971245,1 7.653,2 41.1,3 42.9,4 1.004,5 1.134,6 0.671,7 0.645,8 428.55,9 14.3,10 22,11 56,13 23,14 36,16 60,17 23,20 18,21 5,22 1,24 24,25 9,28 8,29 5.7}
{0 CHEMBL1971649,1 8.244,2 46.8,3 38.3,4 1.011,5 1.127,6 0.697,7 0.679,8 387.45,9 10.6,10 23,11 47,13 24,14 32,16 50,17 22,20 21,21 1,22 1,23 1,24 18,25 7,28 5,29 5.7}
{0 CHEMBL1971694,1 8.305,2 35.3,3 44.1,4 1.018,5 1.146,6 0.666,7 0.633,8 282.38,9 11.8,10 11,11 34,13 12,14 20,16 35,17 12,20 8,21 4,22 1,23 1,24 15,25 7,26 1,28 4,29 5.7}
{0 CHEMBL1971943,1 9.825,2 43.9,3 31.7,4 1.042,5 1.144,6 0.708,7 0.709,8 402.82,9 14.6,10 22,11 41,13 22,14 31,16 44,17 18,18 1,20 17,21 1,23 2,24 13,25 10,26 1,28 6,29 7.4}
{0 CHEMBL1972119,1 8.696,2 41.7,3 37.5,4 1.037,5 1.151,6 0.663,7 0.665,8 417.43,9 10.4,10 17,11 48,13 18,14 33,16 51,17 20,20 15,21 5,22 1,23 3,24 18,25 10,28 5,29 5.7}
{0 CHEMBL1972125,1 7.583,2 47.5,3 42.6,4 0.996,5 1.114,6 0.694,7 0.661,8 462.59,9 6.6,10 28,11 61,13 29,14 39,16 65,17 29,20 26,21 3,22 1,24 26,25 6,28 4,29 5.8}
{0 CHEMBL1972142,1 7.795,2 50,3 40.5,4 0.996,5 1.11,6 0.71,7 0.678,8 327.41,9 7.1,10 22,11 42,13 23,14 28,16 45,17 21,20 20,21 1,22 1,24 17,25 4,28 3,29 5.7}
{0 CHEMBL1972158,1 7.967,2 47.8,3 39.1,4 0.998,5 1.119,6 0.709,7 0.68,8 366.46,9 13,10 27,11 46,13 27,14 32,16 50,17 22,20 21,21 1,24 18,25 6,28 6,29 6.5}
{0 CHEMBL1972221,1 7.888,2 38.8,3 44.9,4 1.009,5 1.128,6 0.671,7 0.636,8 386.52,9 8.2,10 16,11 49,13 19,14 29,16 51,17 19,20 14,21 5,22 3,24 22,25 8,26 1,28 4,29 5.7}
{0 CHEMBL1972258,1 7.093,2 41.7,3 47.2,4 0.995,5 1.128,6 0.661,7 0.624,8 255.35,9 8.3,10 12,11 36,13 13,14 20,16 37,17 15,20 12,21 3,22 1,24 17,25 4,28 3,29 5.8}
{0 CHEMBL1972489,1 9.37,2 48.3,3 34.5,4 1.017,5 1.114,6 0.737,7 0.714,8 271.72,9 10.3,10 16,11 29,13 17,14 21,16 31,17 14,18 1,20 14,22 1,24 10,25 5,26 1,28 3,29 5.7}
{0 CHEMBL1972576,1 8.719,2 43.8,3 37.5,4 1.013,5 1.121,6 0.712,7 0.686,8 418.52,9 12.5,10 22,11 48,13 24,14 33,16 51,17 21,20 20,21 1,22 2,24 18,25 9,26 1,28 6,29 5.7}
{0 CHEMBL1972584,1 7.306,2 40.7,3 45.7,4 0.999,5 1.132,6 0.662,7 0.63,8 591.79,9 11.1,10 26,11 81,13 28,14 50,16 87,17 33,20 21,21 12,22 2,24 37,25 11,28 9,29 5.7}
{0 CHEMBL1972659,1 7.316,2 46.9,3 44.9,4 0.994,5 1.114,6 0.684,7 0.648,8 358.47,9 4.1,10 17,11 49,13 19,14 30,16 52,17 23,20 18,21 5,22 2,24 22,25 4,28 2,29 5.9}
{0 CHEMBL1972849,1 8.922,2 43.5,3 34.8,4 1.035,5 1.143,6 0.682,7 0.684,8 410.42,9 13,10 25,11 46,13 25,14 34,16 50,17 20,20 16,21 4,23 2,24 16,25 10,28 6,29 5.7}
{0 CHEMBL1972937,1 8.622,2 47.2,3 38.9,4 1.007,5 1.106,6 0.726,7 0.689,8 310.4,9 5.6,10 12,11 36,13 15,14 24,16 38,17 17,20 16,21 1,22 3,24 14,25 5,26 1,28 2,29 5.7}
{0 CHEMBL1973098,1 10.283,2 42.3,3 34.6,4 1.03,5 1.101,6 0.758,7 0.717,8 267.35,9 3.8,10 6,11 26,13 9,14 18,16 27,17 11,20 10,21 1,22 3,24 9,25 6,26 2,28 1,29 5.7}
{0 CHEMBL1973142,1 11.661,2 42.3,3 30.8,4 1.043,5 1.111,6 0.782,7 0.747,8 303.18,9 7.7,10 10,11 26,13 12,14 19,16 27,17 11,18 2,20 10,21 1,22 2,24 8,25 7,26 3,28 2,29 6.3}
{0 CHEMBL1973145,1 8.489,2 43.5,3 39.1,4 1.007,5 1.122,6 0.711,7 0.678,8 390.51,9 13,10 22,11 46,13 23,14 31,16 49,17 20,20 19,21 1,22 1,24 18,25 8,26 1,28 6,29 5.7}
{0 CHEMBL1973211,1 7.769,2 45.2,3 43.5,4 0.994,5 1.116,6 0.702,7 0.658,8 481.67,9 8.1,10 22,11 62,13 24,14 39,16 66,17 28,19 2,20 20,21 6,22 1,24 27,25 7,26 1,28 5,29 5.7}
{0 CHEMBL1973348,1 8.148,2 47.5,3 41,4 1.002,5 1.113,6 0.708,7 0.674,8 497.03,9 6.6,10 28,11 61,13 29,14 40,16 65,17 29,18 1,20 26,21 3,22 1,24 25,25 7,26 1,28 4,29 5.7}
{0 CHEMBL1973483,1 10.534,2 44.7,3 26.3,4 1.082,5 1.177,6 0.676,7 0.717,8 400.31,9 10.5,10 17,11 38,13 18,14 30,16 40,17 17,20 15,21 2,22 1,23 6,24 10,25 11,28 4,29 5.7}
{0 CHEMBL1973540,1 9.773,2 45.7,3 32.6,4 1.023,5 1.109,6 0.75,7 0.723,8 449.55,9 10.9,10 26,11 46,13 29,14 35,16 50,17 21,20 21,22 3,24 15,25 10,26 2,28 5,29 6.9}
{0 CHEMBL1973808,1 9.37,2 48.3,3 34.5,4 1.017,5 1.114,6 0.737,7 0.714,8 271.72,9 10.3,10 16,11 29,13 17,14 21,16 31,17 14,18 1,20 14,22 1,24 10,25 5,26 1,28 3,29 5.9}
{0 CHEMBL1973860,1 8.193,2 45.5,3 42.4,4 0.997,5 1.11,6 0.718,7 0.67,8 270.38,9 6.1,10 16,11 33,13 16,14 21,16 35,17 15,20 13,21 2,24 14,25 4,26 1,28 2,29 5.7}
{0 CHEMBL1973893,1 8.098,2 39.1,3 43.5,4 1.012,5 1.127,6 0.677,7 0.644,8 372.49,9 8.7,10 16,11 46,13 19,14 28,16 48,17 18,20 14,21 4,22 3,24 20,25 8,26 1,28 4,29 5.7}
{0 CHEMBL1973937,1 9.486,2 45.7,3 39.1,4 1.005,5 1.118,6 0.721,7 0.686,8 436.34,9 10.9,10 22,11 46,13 23,14 31,15 1,16 49,17 21,20 20,21 1,22 1,24 18,25 7,26 1,28 5,29 5.7}
{0 CHEMBL1974254,1 8.214,2 44.1,3 40.7,4 1.005,5 1.12,6 0.702,7 0.669,8 484.63,9 10.2,10 27,11 59,13 28,14 39,16 63,17 26,20 23,21 3,22 1,24 24,25 9,26 1,28 6,29 5.7}
{0 CHEMBL1974288,1 7.581,2 47.6,3 42.9,4 0.998,5 1.113,6 0.691,7 0.659,8 318.4,9 4.8,10 18,11 42,13 19,14 26,16 44,17 20,20 18,21 2,22 1,24 18,25 4,28 2,29 7.8}
{0 CHEMBL1974310,1 9.726,2 50,3 32.1,4 1.023,5 1.112,6 0.753,7 0.73,8 272.32,9 7.1,10 16,11 28,13 17,14 21,16 30,17 14,20 14,22 1,23 1,24 9,25 5,26 1,28 2,29 5.7}
{0 CHEMBL1974328,1 6.949,2 36.7,3 49,4 0.998,5 1.142,6 0.64,7 0.604,8 340.48,9 12.2,10 12,11 49,13 13,14 27,16 51,17 18,20 11,21 7,22 1,24 24,25 7,28 6,29 5.7}
{0 CHEMBL1974416,1 8.958,2 51.3,3 33.3,4 1.025,5 1.125,6 0.716,7 0.71,8 349.36,9 7.7,10 22,11 39,13 23,14 29,16 42,17 20,20 20,22 1,23 2,24 13,25 6,28 3,29 5.7}
{0 CHEMBL1974664,1 8.079,2 44.2,3 39.5,4 1.011,5 1.126,6 0.686,7 0.667,8 347.41,9 11.6,10 21,11 43,13 22,14 29,16 46,17 19,20 17,21 2,22 1,24 17,25 7,28 5,29 5.7}
{0 CHEMBL1974702,1 15.027,2 50,3 22.7,4 1.047,5 1.085,6 0.866,7 0.821,8 330.59,9 4.5,10 10,11 22,13 12,14 19,15 1,16 24,17 11,18 1,20 10,21 1,22 2,24 5,25 6,26 3,28 1,29 5.7}
{0 CHEMBL1974870,1 8.019,2 44.9,3 42.9,4 1,5 1.12,6 0.698,7 0.661,8 392.92,9 8.2,10 22,11 49,13 22,14 31,16 52,17 22,18 1,20 18,21 4,24 21,25 6,26 1,28 4,29 8}
{0 CHEMBL1974935,1 7.41,2 46,3 44,4 0.994,5 1.119,6 0.687,7 0.651,8 370.49,9 8,10 22,11 50,13 23,14 31,16 53,17 23,20 20,21 3,22 1,24 22,25 5,28 4,29 7.5}
{0 CHEMBL1975121,1 7.387,2 46.7,3 44.4,4 0.996,5 1.114,6 0.684,7 0.649,8 332.43,9 4.4,10 18,11 45,13 19,14 27,16 47,17 21,20 18,21 3,22 1,24 20,25 4,28 2,29 8.1}
{0 CHEMBL1975128,1 11.562,2 44.4,3 36.1,4 1.006,5 1.121,6 0.771,7 0.71,8 416.25,9 16.7,10 21,11 36,13 21,14 26,16 39,17 16,20 15,21 1,24 13,25 7,26 1,27 1,28 6,29 8}
{0 CHEMBL1975138,1 8.598,2 45.7,3 39.1,4 1.013,5 1.119,6 0.709,7 0.68,8 395.49,9 6.5,10 18,11 46,13 20,14 30,16 48,17 21,20 20,21 1,22 2,23 1,24 18,25 7,26 1,28 3,29 5.7}
{0 CHEMBL1975233,1 9.346,2 41.2,3 35.3,4 1.03,5 1.133,6 0.701,7 0.69,8 317.76,9 14.7,10 12,11 34,13 14,14 23,16 35,17 14,18 1,19 1,20 11,21 2,22 1,24 12,25 8,26 1,28 5,29 5.7}
{0 CHEMBL1975256,1 10.735,2 38.9,3 27.8,4 1.042,5 1.129,6 0.75,7 0.736,8 386.46,9 22.2,10 20,11 36,13 22,14 29,16 39,17 14,20 14,22 2,24 10,25 12,26 2,28 8,29 5.7}
{0 CHEMBL1975490,1 7.821,2 45.3,3 41.5,4 1.006,5 1.12,6 0.684,7 0.66,8 414.5,9 7.5,10 22,11 53,13 23,14 35,16 57,17 24,20 20,21 4,22 1,24 22,25 7,28 4,29 5.7}
{0 CHEMBL1975500,1 7.94,2 43.1,3 41.4,4 1.015,5 1.124,6 0.671,7 0.654,8 460.53,9 6.9,10 18,11 58,13 21,14 37,16 61,17 25,20 21,21 4,22 3,24 24,25 9,28 4,29 5.7}
{0 CHEMBL1975534,1 11.35,2 31.3,3 43.8,4 1.02,5 1.147,6 0.7,7 0.64,8 363.19,9 15.6,10 10,11 32,13 10,14 19,16 33,17 10,20 6,21 4,24 14,25 8,26 1,27 1,28 5,29 5.7}
{0 CHEMBL1975647,1 9.138,2 45.2,3 32.3,4 1.032,5 1.138,6 0.7,7 0.703,8 283.29,9 16.1,10 17,11 31,13 18,14 23,16 33,17 14,20 14,22 1,23 1,24 10,25 7,28 5,29 5.8}
{0 CHEMBL1975900,1 10.241,2 47.1,3 32.4,4 1.03,5 1.114,6 0.748,7 0.729,8 348.2,9 8.8,10 12,11 34,13 15,14 25,16 36,17 16,18 2,20 15,21 1,22 3,24 11,25 7,26 2,28 3,29 6.9}
{0 CHEMBL1976090,1 10.394,2 38.1,3 28.6,4 1.033,5 1.139,6 0.747,7 0.729,8 218.27,9 28.6,10 15,11 21,13 15,14 17,16 23,17 8,20 8,24 6,25 7,26 1,28 6,29 5.7}
{0 CHEMBL1976093,1 7.361,2 40.4,3 45.6,4 1.001,5 1.14,6 0.659,7 0.628,8 419.56,9 12.3,10 22,11 57,13 22,14 34,16 60,17 23,20 16,21 7,23 1,24 26,25 8,28 7,29 5.7}
{0 CHEMBL1976134,1 8.367,2 50,3 35.7,4 1.002,5 1.116,6 0.725,7 0.702,8 234.28,9 14.3,10 20,11 28,13 20,14 21,16 31,17 14,20 14,24 10,25 4,28 4,29 6.1}
{0 CHEMBL1976220,1 10.461,2 47.6,3 35.7,4 1.008,5 1.106,6 0.763,7 0.718,8 439.36,9 9.5,10 22,11 42,13 23,14 30,15 1,16 45,17 20,20 20,22 1,24 15,25 7,26 2,28 4,29 5.7}
{0 CHEMBL1976240,1 7.393,2 44.7,3 44.7,4 0.998,5 1.12,6 0.676,7 0.643,8 347.45,9 6.4,10 18,11 47,13 19,14 28,16 49,17 21,20 18,21 3,22 1,24 21,25 5,28 3,29 8.6}
{0 CHEMBL1976420,1 7.035,2 42.5,3 47.5,4 0.993,5 1.126,6 0.664,7 0.625,8 281.39,9 7.5,10 16,11 40,13 16,14 23,16 42,17 17,20 12,21 5,24 19,25 4,28 3,29 5.7}
{0 CHEMBL1976455,1 9.803,2 44.1,3 29.4,4 1.056,5 1.158,6 0.687,7 0.708,8 333.3,9 14.7,10 17,11 34,13 18,14 26,16 36,17 15,20 14,21 1,22 1,23 3,24 10,25 9,28 5,29 5.7}
{0 CHEMBL1976732,1 8.922,2 43.5,3 34.8,4 1.035,5 1.143,6 0.682,7 0.684,8 410.42,9 13,10 25,11 46,13 25,14 34,16 50,17 20,20 16,21 4,23 2,24 16,25 10,28 6,29 5.7}
{0 CHEMBL1977135,1 7.589,2 50,3 42.1,4 0.993,5 1.108,6 0.705,7 0.67,8 288.37,9 5.3,10 18,11 38,13 19,14 24,16 40,17 19,20 18,21 1,22 1,24 16,25 3,28 2,29 7}
{0 CHEMBL1977148,1 8.344,2 43.3,3 40,4 1.01,5 1.121,6 0.698,7 0.67,8 500.63,9 10,10 27,11 60,13 28,14 40,16 64,17 26,20 23,21 3,22 1,24 24,25 10,26 1,28 6,29 5.7}
{0 CHEMBL1977223,1 7.669,2 42.6,3 42.6,4 1.003,5 1.13,6 0.677,7 0.65,8 360.46,9 12.8,10 21,11 47,13 22,14 30,16 50,17 20,20 16,21 4,22 1,24 20,25 7,28 6,29 5.7}
{0 CHEMBL1977346,1 14.088,2 45.8,3 29.2,4 1.024,5 1.115,6 0.819,7 0.757,8 338.12,9 16.7,10 12,11 24,13 13,14 19,16 26,17 11,20 11,22 1,24 7,25 6,26 1,27 1,28 4,29 5.7}
{0 CHEMBL1977681,1 9.494,2 44.8,3 34.5,4 1.026,5 1.125,6 0.728,7 0.705,8 275.33,9 10.3,10 15,11 29,13 16,14 21,16 31,17 13,20 12,21 1,22 1,23 1,24 10,25 6,26 1,28 3,29 5.7}
{0 CHEMBL1978014,1 7.421,2 41.1,3 44.6,4 1,5 1.133,6 0.667,7 0.636,8 415.55,9 12.5,10 21,11 56,13 22,14 35,16 60,17 23,20 16,21 7,22 1,24 25,25 8,28 7,29 5.9}
{0 CHEMBL1978099,1 8.689,2 37.7,3 39.6,4 1.03,5 1.14,6 0.67,7 0.656,8 460.54,9 11.3,10 18,11 53,13 21,14 34,16 55,17 20,20 17,21 3,22 3,23 1,24 21,25 12,26 1,28 6,29 5.7}
{0 CHEMBL1978200,1 8.009,2 41.5,3 41.5,4 1.017,5 1.144,6 0.664,7 0.648,8 424.5,9 11.3,10 22,11 53,13 22,14 34,16 56,17 22,20 16,21 6,23 2,24 22,25 9,28 6,29 5.7}
{0 CHEMBL1978448,1 8.286,2 40,3 42.5,4 1.014,5 1.124,6 0.684,7 0.652,8 331.43,9 7.5,10 11,11 40,13 14,14 26,16 43,17 16,20 11,21 5,22 3,24 17,25 7,26 1,28 3,29 6.6}
{0 CHEMBL1979057,1 8.105,2 50,3 38.1,4 1.001,5 1.112,6 0.715,7 0.69,8 340.41,9 9.5,10 22,11 42,13 23,14 30,16 46,17 21,20 20,21 1,22 1,24 16,25 5,28 4,29 5.7}
{0 CHEMBL1979093,1 8.295,2 44.9,3 38.8,4 1.02,5 1.128,6 0.682,7 0.67,8 406.45,9 8.2,10 22,11 49,13 23,14 33,16 52,17 22,20 20,21 2,22 1,23 1,24 19,25 8,28 4,29 5.7}
{0 CHEMBL1979176,1 9.291,2 43.6,3 33.3,4 1.049,5 1.152,6 0.675,7 0.688,8 362.34,9 10.3,10 17,11 39,13 18,14 28,16 41,17 17,20 15,21 2,22 1,23 3,24 13,25 9,28 4,29 5.7}
{0 CHEMBL1979252,1 9.387,2 45.9,3 32.4,4 1.049,5 1.147,6 0.684,7 0.697,8 347.32,9 8.1,10 12,11 37,13 15,14 27,16 39,17 17,20 15,21 2,22 3,23 3,24 12,25 8,28 3,29 7.5}
{0 CHEMBL1979357,1 7.234,2 46.9,3 44.9,4 0.987,5 1.117,6 0.691,7 0.65,8 354.49,9 8.2,10 22,11 49,13 23,14 30,16 52,17 23,20 20,21 3,22 1,24 22,25 4,28 4,29 7.4}
{0 CHEMBL1979516,1 8.645,2 44.2,3 38.5,4 1.016,5 1.125,6 0.704,7 0.679,8 449.55,9 9.6,10 22,11 52,13 24,14 35,16 55,17 23,20 21,21 2,22 2,23 1,24 20,25 9,26 1,28 5,29 5.7}
{0 CHEMBL1979577,1 7.856,2 44.8,3 43.1,4 0.996,5 1.117,6 0.702,7 0.66,8 455.63,9 8.6,10 22,11 58,13 24,14 36,16 61,17 26,19 2,20 20,21 4,22 1,24 25,25 7,26 1,28 5,29 5.7}
{0 CHEMBL1979855,1 7.649,2 44.3,3 42.6,4 1.002,5 1.124,6 0.681,7 0.653,8 466.59,9 9.8,10 22,11 61,13 25,14 38,16 64,17 27,19 1,20 21,21 5,22 2,24 26,25 8,28 6,29 5.7}
{0 CHEMBL1979883,1 7.856,2 44.8,3 43.1,4 0.996,5 1.117,6 0.702,7 0.66,8 455.63,9 8.6,10 22,11 58,13 24,14 36,16 61,17 26,19 2,20 20,21 4,22 1,24 25,25 7,26 1,28 5,29 5.7}
{0 CHEMBL1979970,1 8.815,2 41.7,3 36.1,4 1.036,5 1.152,6 0.671,7 0.673,8 317.33,9 13.9,10 16,11 36,13 17,14 25,16 38,17 15,20 12,21 3,22 1,23 2,24 13,25 8,28 5,29 5.7}
{0 CHEMBL1980142,1 10.534,2 44.7,3 26.3,4 1.082,5 1.177,6 0.676,7 0.717,8 400.31,9 10.5,10 17,11 38,13 18,14 30,16 40,17 17,20 15,21 2,22 1,23 6,24 10,25 11,28 4,29 5.9}
{0 CHEMBL1980144,1 8.719,2 43.8,3 37.5,4 1.013,5 1.121,6 0.712,7 0.686,8 418.52,9 12.5,10 22,11 48,13 24,14 33,16 51,17 21,20 20,21 1,22 2,24 18,25 9,26 1,28 6,29 6.3}
{0 CHEMBL1980163,1 7.795,2 50,3 40.5,4 0.996,5 1.11,6 0.71,7 0.678,8 327.41,9 7.1,10 23,11 42,13 23,14 28,16 45,17 21,20 20,21 1,24 17,25 4,28 3,29 5.7}
{0 CHEMBL1980297,1 8.725,2 44.6,3 37.5,4 1.016,5 1.125,6 0.707,7 0.685,8 488.59,9 10.7,10 27,11 56,13 28,14 39,16 60,17 25,20 23,21 2,22 1,23 1,24 21,25 10,26 1,28 6,29 5.7}
{0 CHEMBL1980391,1 9.149,2 46.2,3 35.9,4 1.022,5 1.128,6 0.714,7 0.697,8 356.81,9 10.3,10 17,11 39,13 18,14 28,16 42,17 18,18 1,20 16,21 2,22 1,23 1,24 14,25 7,26 1,28 4,29 5.7}
{0 CHEMBL1980489,1 9.228,2 47.1,3 35.3,4 1.021,5 1.116,6 0.723,7 0.705,8 313.76,9 8.8,10 12,11 34,13 15,14 24,16 36,17 16,18 1,20 15,21 1,22 3,24 12,25 6,26 1,28 3,29 7.5}
{0 CHEMBL1980540,1 10.479,2 45.7,3 28.6,4 1.058,5 1.15,6 0.713,7 0.726,8 366.75,9 11.4,10 17,11 35,13 18,14 27,16 37,17 16,18 1,20 15,21 1,22 1,23 3,24 10,25 9,26 1,28 4,29 5.7}
{0 CHEMBL1980704,1 8.636,2 47.5,3 37.5,4 1,5 1.112,6 0.737,7 0.698,8 345.46,9 12.5,10 25,11 40,13 25,14 29,16 44,17 19,20 17,21 2,24 15,25 6,26 1,28 5,29 5.7}
{0 CHEMBL1980896,1 11.281,2 47.6,3 33.3,4 1.016,5 1.105,6 0.783,7 0.738,8 473.8,9 9.5,10 22,11 42,13 23,14 31,15 1,16 45,17 20,18 1,20 19,21 1,22 1,24 14,25 8,26 3,28 4,29 5.7}
{0 CHEMBL1981047,1 7.302,2 40,3 46.2,4 1.003,5 1.132,6 0.654,7 0.625,8 474.62,9 9.2,10 17,11 65,13 19,14 39,16 69,17 26,20 17,21 9,22 2,24 30,25 9,28 6,29 5.7}
{0 CHEMBL1981079,1 9.758,2 44.1,3 32.4,4 1.036,5 1.137,6 0.715,7 0.71,8 331.76,9 14.7,10 17,11 34,13 18,14 25,16 36,17 15,18 1,20 15,22 1,23 1,24 11,25 8,26 1,28 5,29 6.3}
{0 CHEMBL1981410,1 8.594,2 41.5,3 37.7,4 1.031,5 1.152,6 0.668,7 0.665,8 455.49,9 13.2,10 18,11 53,13 20,14 36,16 56,17 22,20 18,21 4,22 2,23 3,24 20,25 11,28 7,29 5.7}
{0 CHEMBL1981720,1 8.558,2 45.2,3 35.5,4 1.016,5 1.127,6 0.702,7 0.69,8 265.3,9 16.1,10 17,11 31,13 18,14 22,16 33,17 14,20 14,22 1,24 11,25 6,28 5,29 5.7}
{0 CHEMBL1981725,1 7.757,2 45.6,3 41.8,4 1.002,5 1.126,6 0.688,7 0.66,8 612.77,9 10.1,10 34,11 79,13 35,14 52,16 85,17 36,20 30,21 6,22 1,23 1,24 33,25 10,28 8,29 5.7}
{0 CHEMBL1981782,1 9.859,2 44.1,3 35.3,4 1.024,5 1.123,6 0.735,7 0.709,8 335.21,9 11.8,10 16,11 34,13 17,14 24,16 36,17 15,18 2,20 14,21 1,22 1,24 12,25 7,26 2,28 4,29 7.3}
{0 CHEMBL1982122,1 8.033,2 46.7,3 42.2,4 0.995,5 1.11,6 0.716,7 0.671,8 361.5,9 6.7,10 22,11 45,13 22,14 29,16 48,17 21,20 18,21 3,24 19,25 5,26 1,28 3,29 5.8}
{0 CHEMBL1982135,1 8.365,2 45.8,3 39.6,4 1.002,5 1.115,6 0.718,7 0.681,8 401.53,9 10.4,10 22,11 48,13 23,14 33,16 52,17 22,20 19,21 3,22 1,24 19,25 7,26 1,28 5,29 5.7}
{0 CHEMBL1982361,1 8.744,2 47.1,3 35.3,4 1.026,5 1.127,6 0.696,7 0.692,8 297.31,9 8.8,10 12,11 34,13 15,14 24,16 36,17 16,20 15,21 1,22 3,23 1,24 12,25 6,28 3,29 7.1}
{0 CHEMBL1982383,1 7.51,2 39.7,3 44.8,4 1.007,5 1.141,6 0.656,7 0.63,8 435.56,9 12.1,10 22,11 58,13 22,14 35,16 61,17 23,20 16,21 7,23 1,24 26,25 9,28 7,29 5.7}
{0 CHEMBL1982465,1 7.9,2 44.4,3 42.9,4 0.999,5 1.117,6 0.698,7 0.659,8 497.67,9 7.9,10 22,11 63,13 24,14 40,16 67,17 28,19 2,20 20,21 6,22 1,24 27,25 8,26 1,28 5,29 5.7}
{0 CHEMBL1982466,1 8.265,2 45.5,3 40,4 1.002,5 1.117,6 0.713,7 0.677,8 454.6,9 10.9,10 27,11 55,13 28,14 37,16 59,17 25,20 23,21 2,22 1,24 22,25 8,26 1,28 6,29 5.7}
{0 CHEMBL1982506,1 8.905,2 44.8,3 34.5,4 1.036,5 1.121,6 0.685,7 0.69,8 258.25,9 6.9,10 11,11 29,13 13,14 21,16 31,17 13,20 11,21 2,22 2,24 10,25 6,28 2,29 5.7}
{0 CHEMBL1982563,1 7.51,2 41.1,3 44.6,4 1.005,5 1.137,6 0.661,7 0.634,8 420.54,9 10.7,10 22,11 56,13 22,14 34,16 59,17 23,20 16,21 7,23 1,24 25,25 8,28 6,29 5.7}
{0 CHEMBL1982610,1 14.863,2 48,3 28,4 1.027,5 1.105,6 0.851,7 0.78,8 371.57,9 12,10 11,11 25,13 13,14 20,16 27,17 12,18 1,20 12,22 2,24 7,25 6,26 2,27 1,28 3,29 5.7}
{0 CHEMBL1982660,1 9.291,2 43.6,3 33.3,4 1.049,5 1.152,6 0.675,7 0.688,8 362.34,9 10.3,10 17,11 39,13 18,14 28,16 41,17 17,20 15,21 2,22 1,23 3,24 13,25 9,28 4,29 5.7}
{0 CHEMBL1982711,1 9.37,2 48.3,3 34.5,4 1.017,5 1.114,6 0.737,7 0.714,8 271.72,9 10.3,10 16,11 29,13 17,14 21,16 31,17 14,18 1,20 14,22 1,24 10,25 5,26 1,28 3,29 7.9}
{0 CHEMBL1982866,1 8.508,2 43.2,3 40.5,4 1.01,5 1.125,6 0.7,7 0.67,8 314.8,9 10.8,10 17,11 37,13 17,14 24,16 39,17 16,18 1,20 13,21 3,24 15,25 6,26 1,28 4,29 5.7}
{0 CHEMBL1982874,1 8.586,2 46.8,3 38.3,4 1.006,5 1.12,6 0.722,7 0.689,8 403.52,9 10.6,10 25,11 47,13 25,14 34,16 52,17 22,20 18,21 4,23 1,24 18,25 7,26 1,28 5,29 5.7}
{0 CHEMBL1982924,1 7.986,2 48.8,3 39.5,4 1.003,5 1.112,6 0.704,7 0.679,8 343.41,9 7,10 22,11 43,13 23,14 29,16 46,17 21,20 20,21 1,22 1,24 17,25 5,28 3,29 5.7}
{0 CHEMBL1982957,1 8.035,2 51.3,3 38.5,4 0.998,5 1.108,6 0.719,7 0.691,8 313.38,9 7.7,10 22,11 39,13 23,14 27,16 42,17 20,20 20,22 1,24 15,25 4,28 3,29 5.7}
{0 CHEMBL1982992,1 10.683,2 46.2,3 30.8,4 1.026,5 1.108,6 0.779,7 0.745,8 277.75,9 11.5,10 16,11 26,13 16,14 20,16 28,17 12,18 1,20 12,24 8,25 6,26 2,28 3,29 5.7}
{0 CHEMBL1983025,1 7.558,2 43.8,3 45.3,4 0.992,5 1.119,6 0.692,7 0.646,8 483.69,9 7.8,10 22,11 64,13 24,14 38,16 67,17 28,19 2,20 20,21 6,22 1,24 29,25 7,26 1,28 5,29 5.7}
{0 CHEMBL1983111,1 8.043,2 39,3 42.4,4 1.026,5 1.152,6 0.646,7 0.636,8 474.54,9 10.2,10 12,11 59,13 14,14 38,16 63,17 23,20 12,21 11,22 2,23 3,24 25,25 11,28 6,29 5.7}
{0 CHEMBL1983449,1 7.684,2 45,3 42.5,4 1.004,5 1.121,6 0.681,7 0.655,8 307.38,9 7.5,10 12,11 40,13 15,14 25,16 42,17 18,20 15,21 3,22 3,24 17,25 5,28 3,29 6.6}
{0 CHEMBL1983534,1 8.354,2 50,3 39.5,4 0.992,5 1.103,6 0.743,7 0.695,8 317.44,9 7.9,10 22,11 38,13 22,14 26,16 41,17 19,20 18,21 1,24 15,25 4,26 1,28 3,29 5.7}
{0 CHEMBL1983923,1 7.085,2 39.6,3 47.2,4 0.994,5 1.136,6 0.658,7 0.621,8 375.53,9 13.2,10 17,11 53,13 18,14 31,16 56,17 21,20 15,21 6,22 1,24 25,25 7,28 7,29 5.7}
{0 CHEMBL1983932,1 10.368,2 44.4,3 36.1,4 1.02,5 1.12,6 0.725,7 0.699,8 373.23,9 11.1,10 17,11 36,13 18,14 25,15 1,16 38,17 16,20 15,21 1,22 1,24 13,25 7,26 1,28 4,29 5.7}
{0 CHEMBL1983945,1 7.67,2 46,3 42,4 0.998,5 1.12,6 0.691,7 0.661,8 383.49,9 10,10 22,11 50,13 24,14 32,16 53,17 23,20 21,21 2,22 2,24 21,25 6,28 5,29 6.6}
{0 CHEMBL1983963,1 8.169,2 45.5,3 38.6,4 1.011,5 1.123,6 0.693,7 0.675,8 359.42,9 11.4,10 22,11 44,13 23,14 30,16 47,17 20,20 19,21 1,22 1,24 17,25 7,28 5,29 5.7}
{0 CHEMBL1984038,1 8.268,2 43.9,3 40.9,4 1.014,5 1.116,6 0.69,7 0.665,8 545.66,9 4.5,10 24,11 66,13 27,14 43,16 70,17 29,20 25,21 4,22 3,24 27,25 10,26 1,28 3,29 5.7}
{0 CHEMBL1984162,1 7.329,2 40.3,3 45.8,4 1.003,5 1.132,6 0.657,7 0.627,8 527.69,9 9.7,10 26,11 72,13 26,14 44,16 77,17 29,20 18,21 11,24 33,25 10,28 7,29 5.7}
{0 CHEMBL1984191,1 10.783,2 48.1,3 29.6,4 1.026,5 1.116,6 0.779,7 0.753,8 291.15,9 14.8,10 17,11 27,13 17,14 21,16 29,17 13,18 2,20 13,24 8,25 6,26 2,28 4,29 5.7}
{0 CHEMBL1984363,1 7.967,2 46.8,3 40.4,4 1.007,5 1.125,6 0.692,7 0.668,8 374.45,9 8.5,10 22,11 47,13 23,14 31,16 50,17 22,20 20,21 2,22 1,23 1,24 19,25 6,28 4,29 6.4}
{0 CHEMBL1984367,1 8.011,2 44.7,3 42.6,4 0.997,5 1.116,6 0.707,7 0.664,8 376.52,9 8.5,10 21,11 47,13 22,14 30,16 50,17 21,20 18,21 3,22 1,24 20,25 6,26 1,28 4,29 5.7}
{0 CHEMBL1984586,1 8.169,2 45.5,3 38.6,4 1.011,5 1.123,6 0.693,7 0.675,8 359.42,9 11.4,10 22,11 44,13 23,14 30,16 47,17 20,20 19,21 1,22 1,24 17,25 7,28 5,29 5.7}
{0 CHEMBL1984633,1 8.279,2 43.9,3 41.5,4 1.005,5 1.116,6 0.705,7 0.668,8 339.45,9 7.3,10 17,11 41,13 18,14 26,16 43,17 18,20 15,21 3,22 1,24 17,25 6,26 1,28 3,29 6.4}
{0 CHEMBL1984700,1 7.974,2 40.4,3 42.1,4 1.02,5 1.145,6 0.657,7 0.642,8 454.53,9 10.5,10 22,11 57,13 22,14 36,16 60,17 23,20 16,21 7,23 2,24 24,25 10,28 6,29 5.7}
{0 CHEMBL1984711,1 7.337,2 37.9,3 46.6,4 1.009,5 1.136,6 0.642,7 0.617,8 425.54,9 8.6,10 17,11 58,13 17,14 34,16 61,17 22,20 13,21 9,24 27,25 9,28 5,29 5.7}
{0 CHEMBL1985074,1 9.613,2 44.8,3 37.9,4 1.012,5 1.108,6 0.751,7 0.704,8 278.78,9 6.9,10 11,11 29,13 12,14 20,16 31,17 13,18 1,20 10,21 3,22 1,24 11,25 5,26 2,28 2,29 5.7}
{0 CHEMBL1985092,1 8.787,2 48.8,3 37.2,4 1.011,5 1.111,6 0.724,7 0.698,8 377.85,9 7,10 23,11 43,13 23,14 30,16 46,17 21,18 1,20 21,24 16,25 6,26 1,28 3,29 5.8}
{0 CHEMBL1985095,1 8.97,2 46.9,3 34.7,4 1.011,5 1.116,6 0.734,7 0.708,8 439.54,9 14.3,10 30,11 49,13 31,14 37,16 54,17 23,20 22,21 1,22 1,24 17,25 9,26 1,28 7,29 6.4}
{0 CHEMBL1985406,1 8.299,2 44.7,3 39.5,4 1.022,5 1.139,6 0.676,7 0.664,8 315.35,9 7.9,10 16,11 38,13 17,14 25,16 40,17 17,20 14,21 3,22 1,23 2,24 15,25 6,28 3,29 5.7}
{0 CHEMBL1986139,1 10.47,2 48,3 32,4 1.014,5 1.104,6 0.792,7 0.746,8 261.75,9 12,10 16,11 25,13 16,14 19,16 27,17 12,18 1,20 12,24 8,25 5,26 2,28 3,29 5.7}
{0 CHEMBL1986186,1 7.009,2 38.5,3 48.7,4 1.001,5 1.134,6 0.641,7 0.608,8 273.37,9 7.7,10 6,11 39,13 9,14 21,16 40,17 15,20 9,21 6,22 3,24 19,25 5,28 3,29 5.7}
{0 CHEMBL1986263,1 8.154,2 40.5,3 42.9,4 1.008,5 1.125,6 0.688,7 0.652,8 342.46,9 9.5,10 12,11 42,13 14,14 26,16 44,17 17,20 13,21 4,22 2,24 18,25 7,26 1,28 4,29 5.7}
{0 CHEMBL1986328,1 8.295,2 45.2,3 38.1,4 1.016,5 1.122,6 0.689,7 0.676,8 348.39,9 9.5,10 21,11 42,13 22,14 29,16 45,17 19,20 17,21 2,22 1,24 16,25 7,28 4,29 5.7}
{0 CHEMBL1986499,1 8.358,2 47.8,3 37,4 1.009,5 1.127,6 0.707,7 0.689,8 384.45,9 13,10 27,11 46,13 27,14 33,16 50,17 22,20 21,21 1,23 1,24 17,25 7,28 6,29 6.5}
{0 CHEMBL1986530,1 7.734,2 41.4,3 43.1,4 1.011,5 1.136,6 0.664,7 0.642,8 448.55,9 10.3,10 12,11 58,13 16,14 37,16 62,17 24,20 15,21 9,22 4,23 1,24 25,25 9,28 6,29 5.7}
{0 CHEMBL1986597,1 8.569,2 42.4,3 39,4 1.02,5 1.122,6 0.692,7 0.671,8 505.6,9 8.5,10 22,11 59,13 26,14 40,16 63,17 25,20 21,21 4,22 4,24 23,25 11,26 1,28 5,29 5.7}
{0 CHEMBL1986603,1 8.52,2 39.6,3 39.6,4 1.018,5 1.131,6 0.686,7 0.664,8 451.56,9 13.2,10 21,11 53,13 23,14 35,16 56,17 21,20 17,21 4,22 2,24 21,25 11,26 1,28 7,29 5.7}
{0 CHEMBL1986781,1 8.086,2 42.3,3 40.4,4 1.016,5 1.136,6 0.673,7 0.657,8 420.49,9 11.5,10 21,11 52,13 22,14 35,16 56,17 22,20 16,21 6,22 1,23 1,24 21,25 9,28 6,29 5.7}
{0 CHEMBL1986869,1 9.671,2 44.7,3 34.2,4 1.014,5 1.111,6 0.759,7 0.719,8 367.49,9 13.2,10 21,11 38,13 22,14 28,16 41,17 17,20 16,21 1,22 1,24 13,25 8,26 2,28 5,29 5.7}
{0 CHEMBL1986943,1 8.187,2 40.5,3 42.9,4 1.008,5 1.132,6 0.683,7 0.651,8 343.85,9 11.9,10 16,11 42,13 16,14 27,16 45,17 17,18 1,20 11,21 6,24 18,25 7,26 1,28 5,29 7}
{0 CHEMBL1986970,1 7.657,2 41.2,3 43.1,4 1.007,5 1.132,6 0.667,7 0.643,8 390.49,9 11.8,10 21,11 51,13 22,14 32,16 54,17 21,20 16,21 5,22 1,24 22,25 8,28 6,29 6.1}
{0 CHEMBL1987007,1 7.738,2 40.9,3 45.5,4 0.997,5 1.124,6 0.687,7 0.641,8 340.49,9 9.1,10 15,11 44,13 16,14 27,16 47,17 18,20 12,21 6,22 1,24 20,25 6,26 1,28 4,29 5.7}
{0 CHEMBL1987009,1 8.453,2 46.5,3 39.5,4 1.005,5 1.11,6 0.719,7 0.683,8 363.47,9 7,10 21,11 43,13 22,14 29,16 46,17 20,20 18,21 2,22 1,24 17,25 6,26 1,28 3,29 5.7}
{0 CHEMBL1987034,1 10.804,2 40.9,3 34.1,4 1.03,5 1.124,6 0.732,7 0.707,8 475.36,9 13.6,10 18,11 44,13 21,14 31,15 1,16 46,17 18,19 1,20 16,21 1,22 2,24 15,25 11,26 2,28 6,29 5.9}
{0 CHEMBL1987359,1 6.97,2 39.2,3 49,4 1,5 1.131,6 0.642,7 0.608,8 355.48,9 5.9,10 11,11 51,13 13,14 28,16 53,17 20,20 12,21 8,22 2,24 25,25 6,28 3,29 5.7}
{0 CHEMBL1987679,1 8.009,2 46,3 40,4 1.009,5 1.119,6 0.69,7 0.669,8 400.47,9 8,10 22,11 50,13 23,14 34,16 54,17 23,20 20,21 3,22 1,24 20,25 7,28 4,29 6.1}
{0 CHEMBL1987910,1 9.522,2 46.7,3 33.3,4 1.034,5 1.134,6 0.717,7 0.707,8 428.47,9 8.9,10 22,11 45,13 23,14 33,16 48,17 21,20 20,21 1,22 1,23 3,24 15,25 9,26 1,28 4,29 5.7}
{0 CHEMBL1988075,1 8.696,2 48.1,3 37,4 1.009,5 1.116,6 0.725,7 0.696,8 469.58,9 9.3,10 28,11 54,13 29,14 38,16 58,17 26,20 25,21 1,22 1,23 1,24 20,25 8,26 1,28 5,29 5.7}
{0 CHEMBL1988153,1 10.483,2 47.2,3 27.8,4 1.055,5 1.137,6 0.728,7 0.735,8 377.37,9 8.3,10 21,11 36,13 21,14 29,16 39,17 17,20 15,21 2,23 3,24 10,25 9,26 1,28 3,29 5.7}
{0 CHEMBL1988163,1 8.913,2 43.9,3 36.6,4 1.016,5 1.12,6 0.717,7 0.692,8 365.45,9 12.2,10 22,11 41,13 24,14 29,16 44,17 18,20 18,22 2,24 15,25 8,26 1,28 5,29 5.7}
{0 CHEMBL1988173,1 8.693,2 44.9,3 40.8,4 1.006,5 1.113,6 0.72,7 0.679,8 425.97,9 6.1,10 18,11 49,13 20,14 31,16 51,17 22,18 1,20 20,21 2,22 2,24 20,25 7,26 2,28 3,29 5.7}
{0 CHEMBL1988300,1 8.522,2 48.9,3 37.8,4 0.997,5 1.109,6 0.739,7 0.699,8 383.51,9 11.1,10 26,11 45,13 27,14 32,16 49,17 22,20 22,22 1,24 17,25 6,26 1,28 5,29 5.7}
{0 CHEMBL1988387,1 9.046,2 44.6,3 35.7,4 1.026,5 1.131,6 0.706,7 0.692,8 506.58,9 10.7,10 27,11 56,13 28,14 40,16 60,17 25,20 23,21 2,22 1,23 2,24 20,25 11,26 1,28 6,29 5.7}
{0 CHEMBL1988437,1 8.402,2 47.8,3 39.1,4 1,5 1.109,6 0.727,7 0.689,8 386.51,9 8.7,10 22,11 46,13 24,14 31,16 49,17 22,20 21,21 1,22 2,24 18,25 6,26 1,28 4,29 5.7}
{0 CHEMBL1988537,1 9.707,2 50,3 34.2,4 1.015,5 1.099,6 0.763,7 0.728,8 368.86,9 5.3,10 18,11 38,13 19,14 28,16 41,17 19,18 1,20 18,21 1,22 1,24 13,25 6,26 2,28 2,29 5.7}
{0 CHEMBL1988594,1 8.989,2 44.4,3 35.6,4 1.017,5 1.12,6 0.72,7 0.697,8 404.49,9 13.3,10 22,11 45,13 24,14 32,16 48,17 20,20 20,22 2,24 16,25 9,26 1,28 6,29 6.7}
{0 CHEMBL1988608,1 8.343,2 44.4,3 37.8,4 1.018,5 1.125,6 0.688,7 0.676,8 375.42,9 11.1,10 16,11 45,13 20,14 31,16 48,17 20,20 18,21 2,22 4,24 17,25 8,28 5,29 8.3}
{0 CHEMBL1988717,1 8.955,2 43.6,3 34.5,4 1.034,5 1.148,6 0.684,7 0.686,8 492.51,9 14.5,10 27,11 55,13 28,14 40,16 59,17 24,20 22,21 2,22 1,23 3,24 19,25 12,28 8,29 5.7}
{0 CHEMBL1988838,1 8.57,2 38,3 40,4 1.024,5 1.133,6 0.677,7 0.657,8 428.52,9 12,10 18,11 50,13 21,14 32,16 52,17 19,20 17,21 2,22 3,24 20,25 11,26 1,28 6,29 5.7}
{0 CHEMBL1989029,1 7.695,2 42.9,3 42.9,4 1.007,5 1.126,6 0.671,7 0.647,8 269.33,9 8.6,10 11,11 35,13 13,14 22,16 37,17 15,20 12,21 3,22 2,24 15,25 5,28 3,29 5.7}
{0 CHEMBL1989474,1 8.476,2 46.7,3 36.7,4 1.015,5 1.133,6 0.7,7 0.686,8 254.29,9 13.3,10 17,11 30,13 17,14 21,16 32,17 14,20 13,21 1,23 1,24 11,25 5,28 4,29 5.7}
{0 CHEMBL1989518,1 7.313,2 42.4,3 45.5,4 0.998,5 1.127,6 0.668,7 0.635,8 241.32,9 9.1,10 12,11 33,13 13,14 19,16 34,17 14,20 12,21 2,22 1,24 15,25 4,28 3,29 6.6}
{0 CHEMBL1989646,1 7.805,2 43.6,3 41,4 1.001,5 1.13,6 0.688,7 0.661,8 304.39,9 15.4,10 21,11 39,13 21,14 26,16 42,17 17,20 15,21 2,24 16,25 6,28 6,29 6.6}
{0 CHEMBL1989708,1 8.043,2 43.5,3 41.9,4 1.003,5 1.121,6 0.697,7 0.662,8 498.66,9 9.7,10 27,11 62,13 28,14 40,16 66,17 27,20 23,21 4,22 1,24 26,25 9,26 1,28 6,29 5.7}
{0 CHEMBL1989805,1 9.754,2 46.2,3 30.8,4 1.034,5 1.113,6 0.732,7 0.724,8 380.41,9 10.3,10 10,11 39,13 16,14 30,16 42,17 18,19 1,20 16,21 1,22 5,24 12,25 9,26 1,28 4,29 5.7}
{0 CHEMBL1990254,1 7.382,2 46.5,3 44.2,4 0.993,5 1.117,6 0.688,7 0.651,8 317.42,9 7,10 18,11 43,13 19,14 26,16 45,17 20,20 18,21 2,22 1,24 19,25 4,28 3,29 8.9}
{0 CHEMBL1990288,1 8.322,2 47.9,3 37.5,4 1.011,5 1.124,6 0.703,7 0.685,8 399.46,9 10.4,10 27,11 48,13 27,14 34,16 52,17 23,20 21,21 2,23 1,24 18,25 7,28 5,29 5.7}
{0 CHEMBL1990482,1 8.51,2 46.4,3 35.7,4 1.014,5 1.123,6 0.706,7 0.692,8 238.27,9 14.3,10 16,11 28,13 17,14 20,16 30,17 13,20 13,22 1,24 10,25 5,28 4,29 6.5}
{0 CHEMBL1990496,1 7.445,2 46.8,3 43.5,4 0.993,5 1.117,6 0.691,7 0.655,8 461.61,9 8.1,10 23,11 62,13 26,14 39,16 66,17 29,20 25,21 4,22 3,24 27,25 6,28 5,29 5.7}
{0 CHEMBL1990884,1 8.134,2 45.8,3 39.6,4 1.013,5 1.127,6 0.687,7 0.669,8 390.45,9 8.3,10 22,11 48,13 23,14 32,16 51,17 22,20 20,21 2,22 1,23 1,24 19,25 7,28 4,29 5.7}
{0 CHEMBL1990885,1 7.117,2 39.3,3 48.2,4 1.003,5 1.138,6 0.643,7 0.611,8 398.53,9 7.1,10 11,11 56,13 14,14 31,16 58,17 22,20 14,21 8,22 3,23 1,24 27,25 7,28 4,29 5.7}
{0 CHEMBL1990904,1 8.192,2 45.5,3 38.6,4 1.01,5 1.132,6 0.694,7 0.674,8 360.43,9 13.6,10 22,11 44,13 22,14 31,16 48,17 20,20 16,21 4,23 1,24 17,25 7,28 6,29 5.7}
{0 CHEMBL1990912,1 7.581,2 45.7,3 42.9,4 0.998,5 1.12,6 0.687,7 0.655,8 265.34,9 8.6,10 17,11 35,13 17,14 22,16 37,17 16,20 14,21 2,24 15,25 4,28 3,29 5.7}
{0 CHEMBL1991063,1 8.722,2 44.9,3 40.8,4 1.007,5 1.119,6 0.715,7 0.677,8 427.36,9 8.2,10 22,11 49,13 22,14 32,16 52,17 22,18 2,20 18,21 4,24 20,25 7,26 2,28 4,29 8.1}
{0 CHEMBL1991078,1 8.117,2 44.6,3 39.3,4 1.012,5 1.124,6 0.687,7 0.669,8 454.53,9 10.7,10 27,11 56,13 28,14 38,16 60,17 25,20 22,21 3,22 1,24 22,25 9,28 6,29 6.2}
{0 CHEMBL1991138,1 6.979,2 43.1,3 47.7,4 0.99,5 1.125,6 0.667,7 0.626,8 453.64,9 7.7,10 22,11 65,13 22,14 39,16 70,17 28,20 18,21 10,24 31,25 6,28 5,29 5.7}
{0 CHEMBL1991188,1 7.764,2 44.9,3 42.9,4 1.011,5 1.125,6 0.672,7 0.65,8 380.45,9 4.1,10 18,11 49,13 19,14 30,16 51,17 22,20 18,21 4,22 1,23 1,24 21,25 6,28 2,29 7.6}
{0 CHEMBL1991285,1 8.598,2 40,3 40,4 1.024,5 1.132,6 0.676,7 0.66,8 429.9,9 10,10 12,11 50,13 15,14 32,16 52,17 20,18 1,19 1,20 12,21 7,22 2,24 20,25 10,26 1,28 5,29 5.7}
{0 CHEMBL1991356,1 8.065,2 50,3 38.9,4 1.004,5 1.109,6 0.708,7 0.684,8 290.34,9 5.6,10 17,11 36,13 18,14 25,16 39,17 18,20 17,21 1,22 1,24 14,25 4,28 2,29 5.7}
{0 CHEMBL1991395,1 7.85,2 42,3 42,4 1.01,5 1.137,6 0.67,7 0.649,8 392.48,9 12,10 22,11 50,13 22,14 32,16 53,17 21,20 16,21 5,23 1,24 21,25 8,28 6,29 5.7}
{0 CHEMBL1991429,1 8.368,2 47.1,3 38.6,4 1.004,5 1.114,6 0.717,7 0.686,8 585.74,9 10,10 33,11 70,13 35,14 49,16 76,17 33,20 29,21 4,22 2,24 27,25 10,26 1,28 7,29 5.7}
{0 CHEMBL1991434,1 10.217,2 47.4,3 36.8,4 1.022,5 1.107,6 0.724,7 0.7,8 388.23,9 2.6,10 12,11 38,13 15,14 26,15 1,16 40,17 18,20 16,21 2,22 3,24 14,25 6,26 1,28 1,29 5.7}
{0 CHEMBL1991674,1 8.187,2 40.5,3 42.9,4 1.008,5 1.132,6 0.683,7 0.651,8 343.85,9 11.9,10 16,11 42,13 16,14 27,16 45,17 17,18 1,20 11,21 6,24 18,25 7,26 1,28 5,29 5.9}
{0 CHEMBL1991678,1 8.009,2 41.5,3 41.5,4 1.017,5 1.144,6 0.664,7 0.648,8 424.5,9 11.3,10 22,11 53,13 22,14 34,16 56,17 22,20 16,21 6,23 2,24 22,25 9,28 6,29 5.7}
{0 CHEMBL1991725,1 7.379,2 44.6,3 44.6,4 0.996,5 1.121,6 0.678,7 0.644,8 479.63,9 7.7,10 27,11 65,13 28,14 40,16 69,17 29,20 23,21 6,22 1,24 29,25 7,28 5,29 5.7}
{0 CHEMBL1991800,1 7.443,2 41.7,3 45,4 1.003,5 1.135,6 0.663,7 0.634,8 446.58,9 10,10 22,11 60,13 22,14 37,16 64,17 25,20 16,21 9,23 1,24 27,25 8,28 6,29 5.7}
{0 CHEMBL1992242,1 8.12,2 47.8,3 41.3,4 0.995,5 1.108,6 0.722,7 0.678,8 373.51,9 6.5,10 22,11 46,13 23,14 30,16 49,17 22,20 20,21 2,22 1,24 19,25 5,26 1,28 3,29 5.7}
{0 CHEMBL1992306,1 8.967,2 43.8,3 35.4,4 1.042,5 1.145,6 0.673,7 0.679,8 430.42,9 8.3,10 18,11 48,13 20,14 33,16 50,17 21,20 19,21 2,22 2,23 3,24 17,25 10,28 4,29 5.7}
{0 CHEMBL1992323,1 11.031,2 50,3 25,4 1.047,5 1.109,6 0.765,7 0.768,8 220.62,9 10,10 10,11 20,13 12,14 17,16 22,17 10,18 1,20 10,22 2,24 5,25 5,26 1,28 2,29 5.7}
{0 CHEMBL1992342,1 8.06,2 39,3 43.9,4 1.008,5 1.128,6 0.681,7 0.644,8 330.45,9 9.8,10 16,11 41,13 18,14 25,16 43,17 16,20 13,21 3,22 2,24 18,25 7,26 1,28 4,29 6.3}
{0 CHEMBL1992536,1 8.295,2 45.2,3 38.1,4 1.016,5 1.122,6 0.689,7 0.676,8 348.39,9 9.5,10 16,11 42,13 19,14 29,16 45,17 19,20 17,21 2,22 3,24 16,25 7,28 4,29 6.8}
{0 CHEMBL1992634,1 10.926,2 52,3 36,4 0.999,5 1.1,6 0.776,7 0.727,8 273.14,9 8,10 16,11 25,13 16,14 18,15 1,16 27,17 13,20 13,24 9,25 3,26 1,28 2,29 5.7}
{0 CHEMBL1992740,1 7.67,2 37.5,3 44.6,4 1.016,5 1.152,6 0.643,7 0.623,8 429.53,9 12.5,10 16,11 56,13 17,14 34,16 59,17 21,20 12,21 9,22 1,23 2,24 25,25 10,28 7,29 5.7}
{0 CHEMBL1992922,1 7.685,2 40.5,3 43.2,4 1.01,5 1.133,6 0.662,7 0.64,8 284.35,9 10.8,10 16,11 37,13 16,14 23,16 39,17 15,20 12,21 3,24 16,25 6,28 4,29 5.7}
{0 CHEMBL1992937,1 8.687,2 41.9,3 35.5,4 1.026,5 1.134,6 0.685,7 0.681,8 269.29,9 16.1,10 16,11 31,13 18,14 22,16 33,17 13,20 12,21 1,22 2,24 11,25 7,28 5,29 5.7}
{0 CHEMBL1993243,1 8.836,2 45,3 37.5,4 1.017,5 1.113,6 0.715,7 0.689,8 353.43,9 7.5,10 16,11 40,13 18,14 28,16 43,17 18,20 16,21 2,22 2,24 15,25 7,26 1,28 3,29 5.7}
{0 CHEMBL1993424,1 8.625,2 43.2,3 38.6,4 1.012,5 1.121,6 0.708,7 0.679,8 379.48,9 11.4,10 22,11 44,13 24,14 30,16 47,17 19,20 18,21 1,22 2,24 17,25 8,26 1,28 5,29 5.7}
{0 CHEMBL1993548,1 8.05,2 41.7,3 44.4,4 1.004,5 1.127,6 0.685,7 0.647,8 289.79,9 8.3,10 12,11 36,13 13,14 21,16 37,17 15,18 1,20 12,21 3,22 1,24 16,25 5,26 1,28 3,29 7.3}
{0 CHEMBL1993584,1 7.581,2 46.9,3 42.9,4 0.998,5 1.115,6 0.689,7 0.658,8 371.47,9 6.1,10 22,11 49,13 23,14 31,16 52,17 23,20 20,21 3,22 1,24 21,25 5,28 3,29 6.2}
{0 CHEMBL1993661,1 8.889,2 37,3 40.7,4 1.028,5 1.132,6 0.679,7 0.656,8 479.99,9 9.3,10 18,11 54,13 20,14 34,16 56,17 20,18 1,20 16,21 4,22 2,24 22,25 12,26 2,28 5,29 5.7}
{0 CHEMBL1993722,1 8.813,2 45.7,3 34.8,4 1.028,5 1.129,6 0.693,7 0.691,8 405.42,9 10.9,10 22,11 46,13 24,14 33,16 49,17 21,20 21,22 2,23 1,24 16,25 9,28 5,29 6.1}
{0 CHEMBL1993781,1 7.23,2 44,3 46,4 0.996,5 1.121,6 0.671,7 0.635,8 361.48,9 6,10 18,11 50,13 19,14 29,16 52,17 22,20 18,21 4,22 1,24 23,25 5,28 3,29 7.1}
{0 CHEMBL1993941,1 8.39,2 44.8,3 39.7,4 1.008,5 1.124,6 0.706,7 0.675,8 486.62,9 10.3,10 27,11 58,13 28,14 39,16 62,17 26,20 23,21 3,22 1,23 1,24 23,25 9,26 1,28 6,29 5.7}
{0 CHEMBL1994040,1 7.904,2 42.1,3 42.1,4 1.014,5 1.141,6 0.666,7 0.647,8 450.54,9 10.5,10 22,11 57,13 22,14 37,16 61,17 24,20 16,21 8,23 2,24 24,25 9,28 6,29 5.7}
{0 CHEMBL1994074,1 10.926,2 52,3 36,4 0.999,5 1.1,6 0.776,7 0.727,8 273.14,9 8,10 16,11 25,13 16,14 18,15 1,16 27,17 13,20 13,24 9,25 3,26 1,28 2,29 5.7}
{0 CHEMBL1994241,1 10.578,2 48.6,3 34.3,4 1.017,5 1.109,6 0.745,7 0.719,8 370.22,9 8.6,10 16,11 35,13 18,14 25,15 1,16 37,17 17,19 1,20 15,21 1,22 1,24 12,25 6,26 1,28 3,29 5.7}
{0 CHEMBL1994321,1 8.718,2 43.1,3 39.7,4 1.01,5 1.115,6 0.716,7 0.679,8 505.67,9 8.6,10 22,11 58,13 26,14 38,16 61,17 25,19 2,20 20,21 3,22 3,24 23,25 10,26 2,28 5,29 5.7}
{0 CHEMBL1994526,1 6.343,2 35.9,3 53.8,4 0.989,5 1.14,6 0.624,7 0.577,8 247.38,9 7.7,10 6,11 39,13 7,14 19,16 40,17 14,20 6,21 8,22 1,24 21,25 4,28 3,29 5.7}
{0 CHEMBL1994538,1 9.803,2 44.1,3 29.4,4 1.056,5 1.158,6 0.687,7 0.708,8 333.3,9 14.7,10 17,11 34,13 18,14 26,16 36,17 15,20 14,21 1,22 1,23 3,24 10,25 9,28 5,29 5.7}
{0 CHEMBL1994693,1 8.611,2 46.7,3 37.8,4 1.005,5 1.114,6 0.727,7 0.693,8 387.5,9 11.1,10 22,11 45,13 23,14 32,16 49,17 21,20 19,21 2,22 1,24 17,25 7,26 1,28 5,29 5.7}
{0 CHEMBL1994830,1 10.775,2 46.9,3 28.1,4 1.035,5 1.11,6 0.773,7 0.753,8 344.8,9 12.5,10 21,11 32,13 21,14 26,16 35,17 15,18 1,20 15,24 9,25 8,26 2,28 4,29 5.7}
{0 CHEMBL1994864,1 7.928,2 45.9,3 40.5,4 1.007,5 1.119,6 0.689,7 0.666,8 293.35,9 8.1,10 12,11 37,13 15,14 24,16 39,17 17,20 15,21 2,22 3,24 15,25 5,28 3,29 6.9}
{0 CHEMBL1994938,1 9.649,2 44,3 40,4 1.004,5 1.116,6 0.731,7 0.685,8 482.44,9 10,10 21,11 50,13 23,14 33,15 1,16 53,17 22,20 19,21 3,22 2,24 20,25 8,26 2,28 5,29 5.7}
{0 CHEMBL1995740,1 8.776,2 46.5,3 34.9,4 1.029,5 1.117,6 0.694,7 0.693,8 377.38,9 7,10 18,11 43,13 21,14 31,16 46,17 20,20 19,21 1,22 3,24 15,25 8,28 3,29 5.7}
{0 CHEMBL1995813,1 7.173,2 39.5,3 46.5,4 0.995,5 1.137,6 0.66,7 0.624,8 308.43,9 14,10 16,11 43,13 16,14 26,16 46,17 17,20 11,21 6,24 20,25 6,28 6,29 6.8}
{0 CHEMBL1995832,1 8.157,2 40.7,3 40.7,4 1.023,5 1.145,6 0.661,7 0.649,8 440.5,9 11.1,10 22,11 54,13 22,14 35,16 57,17 22,20 16,21 6,23 2,24 22,25 10,28 6,29 5.7}
{0 CHEMBL1996066,1 9.335,2 50,3 32.4,4 1.007,5 1.108,6 0.764,7 0.732,8 317.4,9 14.7,10 21,11 34,13 22,14 26,16 37,17 17,19 1,20 16,24 11,25 6,26 1,28 5,29 5.7}
{0 CHEMBL1996111,1 7.873,2 43.2,3 40.9,4 1.005,5 1.129,6 0.683,7 0.659,8 346.43,9 13.6,10 21,11 44,13 22,14 29,16 47,17 19,20 16,21 3,22 1,24 18,25 7,28 6,29 6.3}
{0 CHEMBL1996234,1 7.664,2 47.3,3 41.8,4 0.996,5 1.117,6 0.697,7 0.665,8 421.54,9 9.1,10 27,11 55,13 27,14 37,16 60,17 26,20 21,21 5,24 23,25 6,28 5,29 5.7}
{0 CHEMBL1996500,1 8.209,2 42,3 40,4 1.021,5 1.144,6 0.669,7 0.656,8 410.47,9 12,10 22,11 50,13 22,14 33,16 53,17 21,20 16,21 5,23 2,24 20,25 9,28 6,29 5.7}
{0 CHEMBL1996587,1 8.209,2 42,3 40,4 1.021,5 1.144,6 0.669,7 0.656,8 410.47,9 12,10 21,11 50,13 21,14 34,16 54,17 21,20 14,21 7,23 2,24 20,25 9,28 6,29 5.7}
{0 CHEMBL1996791,1 11.225,2 34.4,3 43.8,4 1.01,5 1.141,6 0.717,7 0.649,8 359.2,9 15.6,10 10,11 32,13 10,14 20,16 34,17 11,20 5,21 6,24 14,25 7,26 1,27 1,28 5,29 5.7}
{0 CHEMBL1996817,1 7.226,2 43.2,3 45.9,4 0.995,5 1.125,6 0.67,7 0.634,8 267.36,9 8.1,10 16,11 37,13 16,14 22,16 39,17 16,20 12,21 4,24 17,25 4,28 3,29 5.9}
{0 CHEMBL1996831,1 7.352,2 47.4,3 44.7,4 0.995,5 1.112,6 0.684,7 0.649,8 279.36,9 2.6,10 11,11 38,13 13,14 24,16 41,17 18,20 12,21 6,22 2,24 17,25 3,28 1,29 5.7}
{0 CHEMBL1996931,1 8.153,2 46.7,3 42.2,4 1.003,5 1.113,6 0.703,7 0.668,8 366.87,9 4.4,10 18,11 45,13 19,14 28,16 47,17 21,18 1,20 18,21 3,22 1,24 19,25 5,26 1,28 2,29 6.7}
{0 CHEMBL1996979,1 8.958,2 51.3,3 33.3,4 1.025,5 1.125,6 0.716,7 0.71,8 349.36,9 7.7,10 22,11 39,13 23,14 29,16 42,17 20,20 20,22 1,23 2,24 13,25 6,28 3,29 5.7}
{0 CHEMBL1997023,1 9.149,2 37.9,3 37.9,4 1.031,5 1.128,6 0.692,7 0.673,8 265.32,9 10.3,10 10,11 29,13 12,14 19,16 30,17 11,20 9,21 2,22 2,24 11,25 7,26 1,28 3,29 5.7}
{0 CHEMBL1997129,1 7.693,2 48.8,3 41.5,4 0.996,5 1.112,6 0.702,7 0.67,8 315.4,9 7.3,10 17,11 41,13 19,14 27,16 44,17 20,20 18,21 2,22 2,24 17,25 4,28 3,29 5.7}
{0 CHEMBL1997340,1 8.009,2 41,3 41,4 1.018,5 1.131,6 0.666,7 0.651,8 312.36,9 10.3,10 15,11 39,13 16,14 26,16 42,17 16,20 11,21 5,22 1,24 16,25 7,28 4,29 5.7}
{0 CHEMBL1997534,1 7.799,2 44.2,3 44.2,4 0.998,5 1.115,6 0.696,7 0.653,8 405.56,9 5.8,10 21,11 52,13 22,14 32,16 55,17 23,20 18,21 5,22 1,24 23,25 6,26 1,28 3,29 5.9}
{0 CHEMBL1997597,1 8.327,2 39.5,3 42.1,4 1.012,5 1.127,6 0.688,7 0.654,8 316.42,9 10.5,10 16,11 38,13 18,14 24,16 40,17 15,20 13,21 2,22 2,24 16,25 7,26 1,28 4,29 5.7}
{0 CHEMBL1997617,1 6.896,2 41.4,3 48.6,4 0.99,5 1.129,6 0.659,7 0.617,8 482.69,9 8.6,10 22,11 70,13 22,14 41,16 75,17 29,20 18,21 11,24 34,25 7,28 6,29 5.7}
{0 CHEMBL1997764,1 7.986,2 48.8,3 39.5,4 1.003,5 1.112,6 0.704,7 0.679,8 343.41,9 7,10 22,11 43,13 23,14 29,16 46,17 21,20 20,21 1,22 1,24 17,25 5,28 3,29 5.7}
{0 CHEMBL1997822,1 8.849,2 46.9,3 38.8,4 1.004,5 1.104,6 0.741,7 0.696,8 433.59,9 6.1,10 26,11 49,13 28,14 34,16 53,17 23,20 21,21 2,22 2,24 19,25 7,26 2,28 3,29 5.7}
{0 CHEMBL1997846,1 7.996,2 41.5,3 43.9,4 1,5 1.13,6 0.688,7 0.649,8 327.85,9 12.2,10 16,11 41,13 16,14 26,16 44,17 17,18 1,20 11,21 6,24 18,25 6,26 1,28 5,29 6.3}
{0 CHEMBL1997872,1 7.684,2 45,3 42.5,4 1.004,5 1.121,6 0.681,7 0.655,8 307.38,9 7.5,10 16,11 40,13 17,14 26,16 43,17 18,20 14,21 4,22 1,24 17,25 5,28 3,29 5.7}
{0 CHEMBL1998112,1 8.114,2 43.8,3 39.6,4 1.014,5 1.126,6 0.682,7 0.665,8 389.45,9 10.4,10 22,11 48,13 23,14 32,16 51,17 21,20 19,21 2,22 1,24 19,25 8,28 5,29 5.7}
{0 CHEMBL1998121,1 9.082,2 42.5,3 40,4 1.014,5 1.125,6 0.713,7 0.679,8 363.27,9 10,10 16,11 40,13 17,14 26,16 42,17 17,18 2,20 14,21 3,22 1,24 16,25 7,26 2,28 4,29 8.9}
{0 CHEMBL1998159,1 8.382,2 43.1,3 39.2,4 1.026,5 1.146,6 0.67,7 0.661,8 427.47,9 9.8,10 22,11 51,13 22,14 34,16 54,17 22,20 17,21 5,23 3,24 20,25 9,28 5,29 7.8}
{0 CHEMBL1998193,1 7.13,2 36,3 48,4 1.004,5 1.143,6 0.636,7 0.606,8 356.48,9 12,10 12,11 50,13 14,14 27,16 51,17 18,20 12,21 6,22 2,24 24,25 8,28 6,29 5.7}
{0 CHEMBL1998545,1 7.387,2 46.7,3 44.4,4 0.996,5 1.114,6 0.684,7 0.649,8 332.43,9 4.4,10 18,11 45,13 19,14 27,16 47,17 21,20 18,21 3,22 1,24 20,25 4,28 2,29 6.2}
{0 CHEMBL1998585,1 10.169,2 45.5,3 29.5,4 1.051,5 1.147,6 0.715,7 0.721,8 447.45,9 11.4,10 22,11 44,13 23,14 34,16 47,17 20,20 19,21 1,22 1,23 4,24 13,25 11,26 1,28 5,29 5.7}
{0 CHEMBL1998611,1 14.552,2 42.9,3 28.6,4 1.039,5 1.103,6 0.838,7 0.78,8 305.59,9 9.5,10 10,11 21,13 11,14 16,15 1,16 22,17 9,18 1,20 9,22 1,24 6,25 6,26 3,28 2,29 6}
{0 CHEMBL1998829,1 8.918,2 51.3,3 35.9,4 1.007,5 1.106,6 0.741,7 0.712,8 347.82,9 7.7,10 22,11 39,13 23,14 28,16 42,17 20,18 1,20 20,22 1,24 14,25 5,26 1,28 3,29 5.7}
{0 CHEMBL1999112,1 9.306,2 45.5,3 34.1,4 1.03,5 1.113,6 0.716,7 0.704,8 409.45,9 6.8,10 10,11 44,13 16,14 32,16 47,17 20,19 1,20 16,21 3,22 5,24 15,25 9,26 1,28 3,29 5.7}
{0 CHEMBL1999321,1 8.03,2 47.9,3 39.6,4 1.007,5 1.113,6 0.697,7 0.675,8 385.45,9 6.3,10 18,11 48,13 21,14 32,16 51,17 23,20 21,21 2,22 3,24 19,25 6,28 3,29 5.7}
{0 CHEMBL1999428,1 7.376,2 48.8,3 43.9,4 0.99,5 1.11,6 0.697,7 0.658,8 302.4,9 4.9,10 18,11 41,13 19,14 25,16 43,17 20,20 18,21 2,22 1,24 18,25 3,28 2,29 7.4}
{0 CHEMBL1999496,1 7.135,2 47.9,3 45.8,4 0.987,5 1.112,6 0.689,7 0.646,8 342.47,9 4.2,10 18,11 48,13 19,14 29,16 51,17 23,20 18,21 5,22 1,24 22,25 3,28 2,29 5.7}
{0 CHEMBL1999590,1 8.2,2 45.2,3 38.1,4 1.008,5 1.126,6 0.698,7 0.678,8 344.41,9 14.3,10 22,11 42,13 23,14 29,16 45,17 19,20 18,21 1,22 1,24 16,25 7,28 6,29 5.7}
{0 CHEMBL1999714,1 7.734,2 48.3,3 41.4,4 0.998,5 1.113,6 0.699,7 0.669,8 224.28,9 6.9,10 12,11 29,13 13,14 19,16 31,17 14,20 13,21 1,22 1,24 12,25 3,28 2,29 5.7}
{0 CHEMBL1999718,1 9.926,2 47.2,3 27.8,4 1.053,5 1.149,6 0.704,7 0.724,8 357.32,9 13.9,10 17,11 36,13 19,14 28,16 38,17 17,19 1,20 15,21 1,22 1,23 3,24 10,25 9,28 5,29 5.7}
{0 CHEMBL1999811,1 9.687,2 41.2,3 32.4,4 1.036,5 1.126,6 0.715,7 0.706,8 329.37,9 14.7,10 16,11 34,13 18,14 25,16 36,17 14,20 14,22 2,24 11,25 9,26 1,28 5,29 6}
{0 CHEMBL1999931,1 8.218,2 47.9,3 37.5,4 1.005,5 1.119,6 0.71,7 0.688,8 394.47,9 12.5,10 27,11 48,13 28,14 34,16 52,17 23,20 22,21 1,22 1,24 18,25 7,28 6,29 6.5}
{0 CHEMBL2000071,1 7.454,2 41.7,3 44.4,4 1.001,5 1.13,6 0.668,7 0.638,8 268.35,9 11.1,10 16,11 36,13 16,14 22,16 38,17 15,20 12,21 3,24 16,25 5,28 4,29 5.7}
{0 CHEMBL2000114,1 7.945,2 33.3,3 46.7,4 1.008,5 1.14,6 0.664,7 0.621,8 238.35,9 13.3,10 10,11 30,13 10,14 17,16 31,17 10,20 6,21 4,24 14,25 6,26 1,28 4,29 5.7}
{0 CHEMBL2000335,1 8.288,2 44.7,3 40.4,4 1.002,5 1.118,6 0.712,7 0.674,8 389.52,9 10.6,10 22,11 47,13 23,14 31,16 50,17 21,20 19,21 2,22 1,24 19,25 7,26 1,28 5,29 5.7}
{0 CHEMBL2000345,1 10.112,2 47.4,3 36.8,4 1.013,5 1.112,6 0.733,7 0.702,8 384.25,9 7.9,10 16,11 38,13 18,14 26,15 1,16 40,17 18,19 1,20 15,21 2,22 1,24 14,25 6,26 1,28 3,29 5.7}
{0 CHEMBL2000354,1 8.822,2 45.9,3 37.8,4 1.015,5 1.109,6 0.719,7 0.69,8 326.4,9 5.4,10 12,11 37,13 15,14 25,16 39,17 17,20 16,21 1,22 3,24 14,25 6,26 1,28 2,29 5.7}
{0 CHEMBL2000393,1 9.342,2 46.7,3 31.1,4 1.038,5 1.137,6 0.703,7 0.71,8 420.41,9 13.3,10 22,11 45,13 23,14 36,16 50,17 21,20 18,21 3,22 1,23 2,24 14,25 10,28 6,29 5.7}
{0 CHEMBL2000408,1 7.831,2 41.1,3 42.9,4 1.014,5 1.143,6 0.66,7 0.641,8 438.53,9 10.7,10 22,11 56,13 22,14 35,16 59,17 23,20 16,21 7,23 2,24 24,25 9,28 6,29 5.7}
{0 CHEMBL2000429,1 7.809,2 40,3 43.3,4 1.017,5 1.144,6 0.653,7 0.635,8 468.56,9 10,10 22,11 60,13 22,14 37,16 63,17 24,20 16,21 8,23 2,24 26,25 10,28 6,29 5.7}
{0 CHEMBL2000481,1 8.584,2 42.6,3 38.9,4 1.018,5 1.122,6 0.696,7 0.673,8 463.56,9 9.3,10 18,11 54,13 23,14 36,16 57,17 23,20 21,21 2,22 5,24 21,25 10,26 1,28 5,29 5.7}
{0 CHEMBL2000508,1 9.528,2 51.6,3 32.3,4 1.014,5 1.11,6 0.763,7 0.734,8 295.36,9 9.7,10 21,11 31,13 21,14 24,16 34,17 16,20 16,23 1,24 10,25 5,26 1,28 3,29 5.7}
{0 CHEMBL2000568,1 7.876,2 50,3 40,4 0.998,5 1.109,6 0.709,7 0.68,8 236.29,9 6.7,10 16,11 30,13 17,14 20,16 32,17 15,20 14,21 1,22 1,24 12,25 3,28 2,29 5.7}
{0 CHEMBL2000801,1 10.033,2 48.8,3 30.2,4 1.045,5 1.137,6 0.726,7 0.725,8 431.44,9 7,10 22,11 43,13 23,14 33,16 46,17 21,20 20,21 1,22 1,23 4,24 13,25 9,26 1,28 3,29 5.7}
{0 CHEMBL2000832,1 8.337,2 48.3,3 37.9,4 1.017,5 1.118,6 0.696,7 0.682,8 483.53,9 5.2,10 24,11 58,13 26,14 40,16 62,17 28,20 26,21 2,22 2,23 1,24 22,25 8,28 3,29 5.7}
{0 CHEMBL2000894,1 8.222,2 46.8,3 38.3,4 1.012,5 1.118,6 0.696,7 0.679,8 386.44,9 8.5,10 18,11 47,13 21,14 32,16 50,17 22,20 21,21 1,22 3,24 18,25 7,28 4,29 5.9}
{0 CHEMBL2001224,1 8.451,2 40.9,3 40.9,4 1.015,5 1.131,6 0.685,7 0.66,8 371.86,9 11.4,10 12,11 44,13 14,14 28,16 46,17 18,18 1,19 1,20 11,21 6,22 1,24 18,25 8,26 1,28 5,29 5.7}
{0 CHEMBL2001239,1 9.973,2 40.9,3 31.8,4 1.055,5 1.156,6 0.686,7 0.698,8 438.83,9 13.6,10 18,11 44,13 19,14 32,16 46,17 18,18 1,20 16,21 2,22 1,23 3,24 14,25 12,26 1,28 6,29 5.8}
{0 CHEMBL2001257,1 7.558,2 43.8,3 45.3,4 0.992,5 1.119,6 0.692,7 0.646,8 483.69,9 7.8,10 22,11 64,13 24,14 38,16 67,17 28,19 2,20 20,21 6,22 1,24 29,25 7,26 1,28 5,29 5.7}
{0 CHEMBL2001288,1 12.287,2 31.3,3 37.5,4 1.044,5 1.147,6 0.705,7 0.668,8 393.17,9 15.6,10 10,11 32,13 10,14 22,16 34,17 10,20 5,21 5,24 12,25 10,26 1,27 1,28 5,29 5.7}
{0 CHEMBL2001485,1 7.937,2 42.6,3 42.6,4 1.002,5 1.123,6 0.691,7 0.655,8 539.72,9 10.3,10 27,11 68,13 29,14 43,16 72,17 29,20 24,21 5,22 2,24 29,25 10,26 1,28 7,29 5.7}
{0 CHEMBL2001547,1 8.009,2 41.5,3 41.5,4 1.017,5 1.144,6 0.664,7 0.648,8 424.5,9 11.3,10 22,11 53,13 22,14 34,16 56,17 22,20 16,21 6,23 2,24 22,25 9,28 6,29 5.7}
{0 CHEMBL2001751,1 7.943,2 48.3,3 40,4 1.004,5 1.113,6 0.7,7 0.675,8 476.57,9 6.7,10 27,11 60,13 29,14 41,16 65,17 29,20 26,21 3,22 2,24 24,25 7,28 4,29 8.9}
{0 CHEMBL2001920,1 14.836,2 47.8,3 21.7,4 1.044,5 1.084,6 0.874,7 0.823,8 341.22,9 8.7,10 6,11 23,13 10,14 20,15 1,16 25,17 11,20 11,22 4,24 5,25 7,26 3,28 2,29 5.7}
{0 CHEMBL2001957,1 8.605,2 40.4,3 38.6,4 1.038,5 1.156,6 0.655,7 0.655,8 490.51,9 10.5,10 22,11 57,13 22,14 38,16 60,17 23,20 16,21 7,23 4,24 22,25 12,28 6,29 5.7}
{0 CHEMBL2002165,1 8.519,2 44.1,3 39,4 1.014,5 1.126,6 0.701,7 0.676,8 502.62,9 10.2,10 27,11 59,13 28,14 40,16 63,17 26,20 23,21 3,22 1,23 1,24 23,25 10,26 1,28 6,29 5.7}
{0 CHEMBL2002373,1 7.352,2 44.7,3 44.7,4 0.995,5 1.121,6 0.679,7 0.644,8 279.37,9 7.9,10 17,11 38,13 17,14 23,16 40,17 17,20 14,21 3,24 17,25 4,28 3,29 5.7}
{0 CHEMBL2002446,1 7.281,2 42.9,3 47.6,4 0.989,5 1.119,6 0.683,7 0.632,8 458.68,9 6.3,10 16,11 63,13 17,14 38,16 68,17 27,19 2,20 13,21 12,24 30,25 6,26 1,28 4,29 6}
{0 CHEMBL2002479,1 8.471,2 45.3,3 39.6,4 1.013,5 1.119,6 0.7,7 0.675,8 448.94,9 7.5,10 22,11 53,13 23,14 36,16 57,17 24,18 1,20 20,21 4,22 1,24 21,25 8,26 1,28 4,29 6.5}
{0 CHEMBL2002649,1 8.32,2 44.8,3 37.9,4 1.017,5 1.123,6 0.689,7 0.676,8 241.27,9 10.3,10 11,11 29,13 13,14 20,16 31,17 13,20 12,21 1,22 2,24 11,25 5,28 3,29 5.7}
{0 CHEMBL2002702,1 7.447,2 46.9,3 43.8,4 0.995,5 1.116,6 0.689,7 0.654,8 238.31,9 6.3,10 11,11 32,13 13,14 20,16 34,17 15,20 13,21 2,22 2,24 14,25 3,28 2,29 5.7}
{0 CHEMBL2002726,1 7.316,2 44.9,3 44.9,4 0.994,5 1.121,6 0.68,7 0.644,8 358.48,9 8.2,10 22,11 49,13 22,14 30,16 52,17 22,20 18,21 4,24 22,25 5,28 4,29 6.8}
{0 CHEMBL2002992,1 6.661,2 37.2,3 51.2,4 0.993,5 1.138,6 0.636,7 0.594,8 286.42,9 9.3,10 10,11 43,13 11,14 23,16 45,17 16,20 8,21 8,22 1,24 22,25 5,28 4,29 6.2}
{0 CHEMBL2003271,1 12.112,2 48.5,3 27.3,4 1.04,5 1.098,6 0.817,7 0.781,8 399.69,9 6.1,10 16,11 33,13 18,14 26,16 35,17 16,18 3,20 16,22 2,24 9,25 8,26 4,28 2,29 6.3}
{0 CHEMBL2003286,1 9.665,2 42.3,3 34.6,4 1.039,5 1.112,6 0.712,7 0.699,8 251.28,9 3.8,10 6,11 26,13 9,14 18,16 27,17 11,20 10,21 1,22 3,24 9,25 6,26 1,28 1,29 5.7}
{0 CHEMBL2003341,1 9.221,2 47.6,3 38.1,4 1.014,5 1.11,6 0.732,7 0.699,8 387.28,9 4.8,10 18,11 42,13 19,14 28,16 44,17 20,18 2,20 18,21 2,22 1,24 16,25 6,26 2,28 2,29 6.9}
{0 CHEMBL2003420,1 6.867,2 35.7,3 50,4 1,5 1.142,6 0.631,7 0.596,8 384.54,9 10.7,10 12,11 56,13 14,14 29,16 57,17 20,20 12,21 8,22 2,24 28,25 8,28 6,29 5.7}
{0 CHEMBL2003456,1 8.45,2 48,3 36,4 1.011,5 1.118,6 0.71,7 0.694,8 211.24,9 12,10 12,11 25,13 13,14 18,16 27,17 12,20 12,22 1,24 9,25 4,28 3,29 5.7}
{0 CHEMBL2003482,1 8.356,2 42.4,3 42.4,4 1.008,5 1.125,6 0.694,7 0.66,8 275.76,9 9.1,10 11,11 33,13 12,14 21,16 35,17 14,18 1,20 10,21 4,22 1,24 14,25 5,26 1,28 3,29 5.7}
{0 CHEMBL2003638,1 8.593,2 47.9,3 35.4,4 1.016,5 1.126,6 0.708,7 0.696,8 412.46,9 12.5,10 27,11 48,13 28,14 35,16 52,17 23,20 22,21 1,22 1,23 1,24 17,25 8,28 6,29 6.8}
{0 CHEMBL2003817,1 9.803,2 44.1,3 29.4,4 1.056,5 1.158,6 0.687,7 0.708,8 333.3,9 14.7,10 17,11 34,13 18,14 26,16 36,17 15,20 14,21 1,22 1,23 3,24 10,25 9,28 5,29 5.7}
{0 CHEMBL2004290,1 8.01,2 42.4,3 42.4,4 1.006,5 1.123,6 0.688,7 0.655,8 528.69,9 9.1,10 27,11 66,13 28,14 42,16 70,17 28,20 23,21 5,22 1,24 28,25 10,26 1,28 6,29 5.7}
{0 CHEMBL2004311,1 7.413,2 46.2,3 44.2,4 0.996,5 1.117,6 0.683,7 0.649,8 385.5,9 5.8,10 18,11 52,13 20,14 32,16 55,17 24,20 20,21 4,22 2,24 23,25 5,28 3,29 5.7}
{0 CHEMBL2004419,1 8.643,2 44.9,3 38.8,4 1.014,5 1.131,6 0.707,7 0.679,8 423.53,9 10.2,10 25,11 49,13 25,14 34,16 53,17 22,20 18,21 4,23 2,24 19,25 8,26 1,28 5,29 5.7}
{0 CHEMBL2004447,1 7.809,2 42.5,3 42.5,4 1.011,5 1.136,6 0.669,7 0.647,8 312.38,9 10,10 11,11 40,13 13,14 25,16 42,17 17,19 1,20 11,21 5,22 1,23 1,24 17,25 6,28 4,29 5.7}
{0 CHEMBL2004716,1 7.435,2 41.1,3 46.6,4 0.996,5 1.125,6 0.675,7 0.632,8 542.77,9 8.2,10 22,11 73,13 25,14 42,16 76,17 30,20 23,21 7,22 3,24 34,25 9,26 1,28 6,29 5.7}
{0 CHEMBL2004771,1 8.327,2 51.2,3 36.6,4 1.006,5 1.107,6 0.719,7 0.699,8 341.39,9 7.3,10 22,11 41,13 23,14 30,16 45,17 21,20 20,21 1,22 1,24 15,25 5,28 3,29 5.7}
{0 CHEMBL2004871,1 7.825,2 44.7,3 42.1,4 1.009,5 1.13,6 0.677,7 0.654,8 297.36,9 7.9,10 17,11 38,13 17,14 24,16 40,17 17,20 14,21 3,23 1,24 16,25 5,28 3,29 5.7}
{0 CHEMBL2004872,1 7.578,2 45.5,3 43.2,4 1.001,5 1.119,6 0.682,7 0.652,8 333.42,9 6.8,10 18,11 44,13 19,14 27,16 46,17 20,20 17,21 3,22 1,24 19,25 5,28 3,29 6.7}
{0 CHEMBL2004892,1 8.64,2 40,3 40,4 1.016,5 1.126,6 0.697,7 0.667,8 302.39,9 11.4,10 16,11 35,13 18,14 23,16 37,17 14,20 13,21 1,22 2,24 14,25 7,26 1,28 4,29 5.7}
{0 CHEMBL2004934,1 7.787,2 46.7,3 42.2,4 1.007,5 1.122,6 0.682,7 0.658,8 350.42,9 4.4,10 18,11 45,13 19,14 28,16 47,17 21,20 18,21 3,22 1,23 1,24 19,25 5,28 2,29 6.7}
{0 CHEMBL2005186,1 7.803,2 44.8,3 41.4,4 1.004,5 1.123,6 0.686,7 0.66,8 452.56,9 10.3,10 27,11 58,13 28,14 38,16 62,17 26,20 22,21 4,22 1,24 24,25 8,28 6,29 5.7}
{0 CHEMBL2005375,1 6.756,2 37.3,3 50.7,4 0.996,5 1.137,6 0.634,7 0.596,8 506.72,9 8,10 12,11 75,13 14,14 41,16 79,17 28,20 12,21 16,22 2,24 38,25 9,28 6,29 5.7}
{0 CHEMBL2005475,1 7.544,2 42.2,3 46.7,4 0.992,5 1.119,6 0.688,7 0.638,8 339.5,9 6.7,10 15,11 45,13 16,14 27,16 48,17 19,20 12,21 7,22 1,24 21,25 5,26 1,28 3,29 5.7}
{0 CHEMBL2005528,1 7.827,2 42.4,3 42.4,4 1.015,5 1.125,6 0.665,7 0.647,8 258.3,9 6.1,10 10,11 33,13 12,14 21,16 35,17 14,20 10,21 4,22 2,24 14,25 5,28 2,29 5.7}
{0 CHEMBL2005631,1 8.645,2 44.2,3 38.5,4 1.016,5 1.125,6 0.704,7 0.679,8 449.55,9 9.6,10 22,11 52,13 24,14 35,16 55,17 23,20 21,21 2,22 2,23 1,24 20,25 9,26 1,28 5,29 5.7}
{0 CHEMBL2005828,1 8.169,2 45.5,3 38.6,4 1.011,5 1.123,6 0.693,7 0.675,8 359.42,9 11.4,10 22,11 44,13 23,14 30,16 47,17 20,20 19,21 1,22 1,24 17,25 7,28 5,29 5.7}
{0 CHEMBL2005886,1 8,2 41.7,3 43.3,4 1.009,5 1.127,6 0.677,7 0.648,8 480.01,9 8.3,10 16,11 60,13 19,14 38,16 64,17 25,18 1,20 18,21 7,22 3,24 26,25 9,26 1,28 5,29 6.4}
{0 CHEMBL2005899,1 7.168,2 38.6,3 47.7,4 1.005,5 1.133,6 0.642,7 0.612,8 315.41,9 6.8,10 6,11 44,13 10,14 24,16 45,17 17,20 10,21 7,22 4,24 21,25 6,28 3,29 5.8}
{0 CHEMBL2005936,1 7.659,2 45.6,3 42.1,4 0.998,5 1.122,6 0.69,7 0.659,8 436.56,9 10.5,10 27,11 57,13 28,14 37,16 61,17 26,20 22,21 4,22 1,24 24,25 7,28 6,29 7}
{0 CHEMBL2006188,1 6.975,2 41.4,3 48.3,4 0.994,5 1.127,6 0.656,7 0.618,8 404.56,9 6.9,10 18,11 58,13 19,14 32,16 60,17 24,20 18,21 6,22 1,24 28,25 6,28 4,29 7.7}
{0 CHEMBL2006237,1 7.028,2 37.5,3 48.2,4 0.998,5 1.14,6 0.645,7 0.61,8 393.55,9 12.5,10 16,11 56,13 17,14 32,16 59,17 21,20 13,21 8,22 1,24 27,25 8,28 7,29 5.7}
{0 CHEMBL2006263,1 8.421,2 41,3 41,4 1.011,5 1.124,6 0.696,7 0.663,8 328.43,9 10.3,10 17,11 39,13 19,14 25,16 41,17 16,20 14,21 2,22 2,24 16,25 7,26 1,28 4,29 5.7}
{0 CHEMBL2006276,1 8.107,2 46.3,3 39,4 1.009,5 1.12,6 0.695,7 0.675,8 332.39,9 9.8,10 18,11 41,13 19,14 28,16 44,17 19,20 18,21 1,22 1,24 16,25 6,28 4,29 5.7}
{0 CHEMBL2006439,1 7.996,2 41.5,3 43.9,4 1,5 1.13,6 0.688,7 0.649,8 327.85,9 12.2,10 16,11 41,13 16,14 26,16 44,17 17,18 1,20 11,21 6,24 18,25 6,26 1,28 5,29 6.1}
{0 CHEMBL2006493,1 9.732,2 48.3,3 31,4 1.063,5 1.143,6 0.681,7 0.705,8 282.23,10 6,11 29,13 9,14 22,16 31,17 14,20 10,21 4,22 3,23 3,24 9,25 6,29 5.7}
{0 CHEMBL2006715,1 9.07,2 47.8,3 34.3,4 1.021,5 1.123,6 0.721,7 0.706,8 607.69,9 10.4,10 33,11 67,13 35,14 50,16 73,17 32,20 29,21 3,22 2,23 2,24 23,25 12,26 1,28 7,29 5.9}
{0 CHEMBL2006778,1 8.647,2 45.5,3 38.6,4 1.012,5 1.122,6 0.713,7 0.683,8 380.48,9 9.1,10 20,11 44,13 22,14 30,16 47,17 20,20 18,21 2,22 2,23 1,24 17,25 7,26 1,28 4,29 5.7}
{0 CHEMBL2006785,1 10.947,2 51.5,3 30.3,4 1.02,5 1.094,6 0.807,7 0.765,8 361.26,9 6.1,10 16,11 33,13 18,14 25,16 35,17 17,18 2,19 1,20 15,21 1,22 1,24 10,25 6,26 3,28 2,29 5.7}
{0 CHEMBL2007002,1 8.168,2 47.7,3 38.6,4 1.011,5 1.114,6 0.698,7 0.679,8 359.41,9 6.8,10 22,11 44,13 23,14 30,16 47,17 21,20 20,21 1,22 1,24 17,25 6,28 3,29 5.7}
{0 CHEMBL2007044,1 7.5,2 46.9,3 42.9,4 0.991,5 1.119,6 0.696,7 0.66,8 367.49,9 10.2,10 17,11 49,13 19,14 31,16 52,17 23,19 3,20 14,21 6,24 21,25 5,28 5,29 5.7}
{0 CHEMBL2007064,1 7.57,2 43.9,3 43.9,4 1.006,5 1.121,6 0.67,7 0.644,8 310.38,9 4.9,10 11,11 41,13 14,14 25,16 43,17 18,20 14,21 4,22 3,24 18,25 5,28 2,29 5.7}
{0 CHEMBL2007296,1 7.068,2 45.1,3 47.1,4 0.992,5 1.117,6 0.672,7 0.633,8 360.49,9 3.9,10 18,11 51,13 19,14 29,16 53,17 23,20 18,21 5,22 1,24 24,25 4,28 2,29 7.5}
{0 CHEMBL2007592,1 8.714,2 45.9,3 37.8,4 1.006,5 1.113,6 0.728,7 0.692,8 322.42,9 10.8,10 16,11 37,13 17,14 27,16 41,17 17,20 13,21 4,22 1,24 14,25 6,26 1,28 4,29 5.7}
{0 CHEMBL2023714,1 6.962,2 28.3,3 51.3,4 1.01,5 1.16,6 0.603,7 0.573,8 1301.84,9 15,10 11,11 187,13 26,14 92,16 188,17 53,20 22,21 31,22 15,24 96,25 38,26 1,28 28,29 7.633}
{0 CHEMBL2023841,1 6.918,2 32,3 51.2,4 1.005,5 1.149,6 0.618,7 0.583,8 2269.24,9 11.3,10 23,11 328,13 48,14 168,16 336,17 105,20 45,21 60,22 25,24 168,25 55,26 2,28 37,29 8.886}
{0 CHEMBL2023842,1 6.665,2 31.1,3 53.4,4 1.001,5 1.15,6 0.61,7 0.57,8 986.47,9 10.1,10 11,11 148,13 20,14 71,16 150,17 46,20 16,21 30,22 9,24 79,25 23,26 1,28 15,29 5.73}
{0 CHEMBL2023845,1 7.067,2 32.2,3 49.8,4 1.008,5 1.15,6 0.619,7 0.589,8 1844.53,9 12.3,10 23,11 261,13 44,14 136,16 266,17 84,20 43,21 41,22 21,24 130,25 47,26 1,28 32,29 8.495}
{0 CHEMBL207400,1 11.345,2 42.9,3 25,4 1.084,5 1.162,6 0.702,7 0.735,8 317.67,9 10.7,10 11,11 28,13 12,14 23,16 30,17 12,18 1,20 10,21 2,22 1,23 3,24 7,25 9,26 1,28 3,29 5.7}
{0 CHEMBL210618,1 7.748,2 39.1,3 43.5,4 1.017,5 1.134,6 0.651,7 0.634,8 356.42,9 8.7,10 12,11 46,13 14,14 27,16 47,17 18,19 1,20 12,21 5,22 1,24 20,25 8,28 4,29 5.7}
{0 CHEMBL210887,1 8.302,2 41.5,3 39,4 1.025,5 1.13,6 0.669,7 0.661,8 340.37,9 9.8,10 16,11 41,13 19,14 27,16 43,17 17,20 14,21 3,22 3,24 16,25 8,28 4,29 5.7}
{0 CHEMBL210928,1 8.705,2 35.3,3 43.1,4 1.03,5 1.133,6 0.664,7 0.64,8 443.95,9 5.9,10 12,11 51,13 15,14 30,16 52,17 18,18 1,20 12,21 6,22 3,24 22,25 11,26 2,28 3,29 5.7}
{0 CHEMBL210963,1 8.356,2 36.5,3 42.3,4 1.027,5 1.133,6 0.659,7 0.64,8 434.52,9 7.7,10 12,11 52,13 16,14 31,16 53,17 19,19 1,20 12,21 6,22 3,24 22,25 11,26 1,28 4,29 5.7}
{0 CHEMBL211378,1 8.382,2 44.2,3 37.2,4 1.016,5 1.128,6 0.692,7 0.679,8 360.41,9 14,10 22,11 43,13 23,14 30,16 46,17 19,20 18,21 1,22 1,24 16,25 8,28 6,29 5.7}
{0 CHEMBL213505,1 9.637,2 44.2,3 30.2,4 1.052,5 1.151,6 0.688,7 0.706,8 414.38,9 14,10 22,11 43,13 23,14 33,16 46,17 19,20 18,21 1,22 1,23 3,24 13,25 11,28 6,29 5.7}
{0 CHEMBL215152,1 7.577,2 38.8,3 44.8,4 1.012,5 1.141,6 0.649,7 0.627,8 507.63,9 10.4,10 22,11 67,13 23,14 40,16 70,17 26,20 18,21 8,22 1,23 1,24 30,25 11,28 7,29 5}
{0 CHEMBL2177390,1 7.157,2 37.5,3 50,4 0.998,5 1.135,6 0.648,7 0.605,8 458.06,9 7.8,10 12,11 64,13 13,14 35,16 67,17 24,18 1,20 11,21 13,22 1,24 32,25 8,26 1,28 5,29 7.085}
{0 CHEMBL220057,1 7.771,2 45.7,3 41.3,4 1,5 1.122,6 0.692,7 0.663,8 357.45,9 10.9,10 22,11 46,13 23,14 30,16 49,17 21,20 20,21 1,22 1,24 19,25 6,28 5,29 6.1}
{0 CHEMBL220241,1 7.926,2 40.3,3 41.7,4 1.016,5 1.133,6 0.662,7 0.646,8 570.67,9 11.1,10 27,11 72,13 28,14 47,16 77,17 29,20 21,21 8,22 1,24 30,25 13,28 8,29 6.8}
{0 CHEMBL221959,1 7.266,2 37.2,3 46.5,4 1.003,5 1.142,6 0.647,7 0.617,8 312.42,9 14,10 10,11 43,13 12,14 25,16 45,17 16,19 1,20 7,21 8,22 1,24 20,25 7,28 6,29 5}
{0 CHEMBL223360,1 8.162,2 45.7,3 39.1,4 1.012,5 1.129,6 0.69,7 0.672,8 375.44,9 10.9,10 22,11 46,13 23,14 31,16 49,17 21,20 20,21 1,22 1,23 1,24 18,25 7,28 5,29 5.4}
{0 CHEMBL223367,1 8.306,2 38.5,3 42.3,4 1.021,5 1.135,6 0.665,7 0.645,8 431.92,9 9.6,10 12,11 52,13 14,14 32,16 54,17 20,18 1,19 1,20 11,21 8,22 1,24 22,25 10,26 1,28 5,29 5.7}
{0 CHEMBL223460,1 9.339,2 36,3 38,4 1.037,5 1.136,6 0.683,7 0.668,8 466.95,9 12,10 12,11 50,13 16,14 33,16 52,17 18,18 1,19 1,20 11,21 6,22 3,24 19,25 13,26 2,28 6,29 5.7}
{0 CHEMBL225519,1 7.899,2 44.4,3 40.7,4 1.006,5 1.125,6 0.686,7 0.662,8 213.26,9 11.1,10 11,11 27,13 12,14 18,16 29,17 12,20 10,21 2,22 1,24 11,25 4,28 3,29 7.7}
{0 CHEMBL226403,1 8.105,2 50,3 38.1,4 1.001,5 1.112,6 0.715,7 0.69,8 340.41,9 9.5,10 22,11 42,13 23,14 30,16 46,17 21,20 19,21 2,22 1,24 16,25 5,28 4,29 5.7}
{0 CHEMBL226471,1 8.307,2 48.6,3 37.8,4 1.012,5 1.123,6 0.702,7 0.684,8 307.35,9 8.1,10 17,11 37,13 18,14 26,16 40,17 18,20 16,21 2,22 1,23 1,24 14,25 5,28 3,29 5.7}
{0 CHEMBL230011,1 8.659,2 45,3 35,4 1.02,5 1.127,6 0.7,7 0.692,8 346.38,9 15,10 23,11 40,13 23,14 29,16 43,17 18,20 18,24 14,25 8,28 6,29 5}
{0 CHEMBL2309006,1 8.139,2 48.1,3 38.9,4 1.011,5 1.112,6 0.698,7 0.679,8 439.5,9 5.6,10 24,11 54,13 25,14 40,16 61,17 26,20 19,21 7,22 1,24 21,25 7,28 3,29 6.432}
{0 CHEMBL2309609,1 7.818,2 47.9,3 41.1,4 1.003,5 1.113,6 0.695,7 0.668,8 570.69,9 5.5,10 30,11 73,13 32,14 51,16 81,17 35,20 26,21 9,22 2,24 30,25 8,28 4,29 6.602}
{0 CHEMBL231209,1 9.011,2 47.6,3 35.7,4 1.015,5 1.118,6 0.729,7 0.703,8 378.46,9 9.5,10 22,11 42,13 23,14 30,16 45,17 20,20 20,22 1,23 1,24 15,25 7,26 1,28 4,29 5.7}
{0 CHEMBL2333365,1 8.436,2 42.6,3 40.7,4 1.019,5 1.125,6 0.686,7 0.662,8 455.55,9 5.6,10 18,11 54,13 21,14 35,16 57,17 23,20 18,21 5,22 3,23 1,24 22,25 9,26 1,28 3,29 5}
{0 CHEMBL234085,1 7.266,2 37.2,3 46.5,4 1.003,5 1.142,6 0.647,7 0.617,8 312.42,9 14,10 10,11 43,13 12,14 25,16 45,17 16,19 1,20 7,21 8,22 1,24 20,25 7,28 6,29 5.7}
{0 CHEMBL243088,1 8.483,2 44.7,3 36.8,4 1.021,5 1.124,6 0.689,7 0.681,8 322.35,9 10.5,10 18,11 38,13 19,14 26,16 40,17 17,20 17,22 1,24 14,25 7,28 4,29 5.7}
{0 CHEMBL244378,1 8.659,2 45,3 35,4 1.02,5 1.127,6 0.7,7 0.692,8 346.38,9 15,10 22,11 40,13 23,14 29,16 43,17 18,20 18,22 1,24 14,25 8,28 6,29 5.7}
{0 CHEMBL246970,1 7.641,2 35.8,3 47.2,4 1.008,5 1.142,6 0.649,7 0.616,8 404.95,9 11.3,10 12,11 53,13 14,14 30,16 55,17 19,18 1,20 10,21 9,22 2,24 25,25 9,26 1,28 6,29 5.7}
{0 CHEMBL24828,1 8.804,2 40.7,3 44.4,4 1.01,5 1.133,6 0.678,7 0.643,8 475.4,9 7.4,10 17,11 54,13 17,14 33,15 1,16 57,17 22,20 14,21 8,23 1,24 24,25 8,26 1,28 4,29 5}
{0 CHEMBL248757,1 9.439,2 40,3 36,4 1.028,5 1.129,6 0.71,7 0.689,8 471.97,9 14,10 17,11 50,13 19,14 35,16 53,17 20,18 1,19 1,20 14,21 5,22 1,24 18,25 12,26 2,28 7,29 5.7}
{0 CHEMBL249282,1 7.75,2 44,3 42,4 1.005,5 1.125,6 0.681,7 0.655,8 387.48,9 10,10 17,11 50,13 18,14 33,16 54,17 22,19 1,20 14,21 7,24 21,25 7,28 5,29 5.7}
{0 CHEMBL249697,1 7.093,2 38.9,3 47.2,4 0.995,5 1.138,6 0.655,7 0.619,8 255.36,9 13.9,10 15,11 36,13 15,14 21,16 38,17 14,20 10,21 4,24 17,25 5,28 5,29 5}
{0 CHEMBL253969,1 9.508,2 35.7,3 42.9,4 1.028,5 1.145,6 0.672,7 0.643,8 532.46,9 8.9,10 11,11 56,13 13,14 34,15 1,16 58,17 20,20 11,21 9,22 2,23 2,24 24,25 12,26 2,28 5,29 5.7}
{0 CHEMBL255863,1 8.681,2 45.9,3 36.1,4 1.025,5 1.139,6 0.691,7 0.685,8 529.57,9 11.5,10 29,11 61,13 30,14 43,16 65,17 28,20 25,21 3,22 1,23 3,24 22,25 11,28 7,29 5}
{0 CHEMBL256835,1 7.676,2 41.7,3 43.8,4 1.011,5 1.135,6 0.661,7 0.638,8 368.45,9 8.3,10 17,11 48,13 17,14 30,16 51,17 20,20 13,21 7,23 1,24 21,25 7,28 4,29 5.7}
{0 CHEMBL259084,1 9.732,2 51,3 30.6,4 1.033,5 1.121,6 0.735,7 0.731,8 476.89,9 8.2,10 24,11 49,13 26,14 38,16 53,17 25,18 1,20 24,21 1,22 2,23 2,24 15,25 9,26 1,28 4,29 5}
{0 CHEMBL259922,1 8.572,2 45.8,3 35.4,4 1.016,5 1.125,6 0.703,7 0.692,8 411.46,9 14.6,10 27,11 48,13 28,14 35,16 52,17 22,20 21,21 1,22 1,24 17,25 9,28 7,29 5.7}
{0 CHEMBL260135,1 8.21,2 48.6,3 37.1,4 1.001,5 1.119,6 0.716,7 0.692,8 287.35,9 14.3,10 22,11 35,13 22,14 25,16 38,17 17,20 17,24 13,25 5,28 5,29 5.7}
{0 CHEMBL261849,1 7.479,2 40.8,3 44.9,4 1.007,5 1.13,6 0.658,7 0.632,8 366.46,9 8.2,10 18,11 49,13 18,14 29,16 51,17 20,20 16,21 4,24 22,25 7,28 4,29 5}
{0 CHEMBL262433,1 9.174,2 44.2,3 34.9,4 1.022,5 1.129,6 0.718,7 0.699,8 394.47,9 14,10 22,11 43,13 23,14 31,16 46,17 19,20 18,21 1,22 1,23 1,24 15,25 9,26 1,28 6,29 5.7}
{0 CHEMBL271381,1 9.855,2 45.7,3 37,4 1.017,5 1.117,6 0.719,7 0.694,8 453.32,9 8.7,10 22,11 46,13 23,14 32,15 1,16 49,17 21,20 20,21 1,22 1,24 17,25 8,26 1,28 4,29 5.7}
{0 CHEMBL272453,1 8.888,2 45.7,3 37,4 1.02,5 1.119,6 0.708,7 0.69,8 408.87,9 8.7,10 22,11 46,13 23,14 32,16 49,17 21,18 1,20 20,21 1,22 1,24 17,25 8,26 1,28 4,29 5.7}
{0 CHEMBL274064,1 7.692,2 40.9,3 43.2,4 1.007,5 1.142,6 0.666,7 0.641,8 338.43,9 13.6,10 17,11 44,13 17,14 28,16 47,17 18,20 13,21 5,23 1,24 19,25 7,28 6,29 5.7}
{0 CHEMBL278041,1 8.497,2 51.3,3 35.9,4 1.011,5 1.116,6 0.717,7 0.701,8 331.37,9 7.7,10 23,11 39,13 23,14 28,16 42,17 20,20 20,23 1,24 14,25 5,28 3,29 5}
{0 CHEMBL288441,1 8.162,2 40,3 44.6,4 1.01,5 1.129,6 0.677,7 0.642,8 530.5,9 7.7,10 17,11 65,13 18,14 39,16 68,17 26,18 2,19 1,20 15,21 10,24 29,25 10,26 2,28 5,29 5}
{0 CHEMBL296468,1 7.767,2 34.7,3 49,4 1.001,5 1.131,6 0.67,7 0.615,8 380.59,9 8.2,10 10,11 49,13 11,14 27,16 51,17 17,20 7,21 10,22 1,24 24,25 8,26 2,28 4,29 5}
{0 CHEMBL300138,1 7.583,2 47.1,3 42.6,4 0.997,5 1.116,6 0.692,7 0.66,8 515.66,9 7.4,10 26,11 68,13 29,14 45,16 74,17 32,20 25,21 7,22 3,24 29,25 7,28 5,29 5.959}
{0 CHEMBL306380,1 7.035,2 40,3 47.5,4 0.992,5 1.135,6 0.659,7 0.62,8 281.4,9 12.5,10 16,11 40,13 16,14 23,16 42,17 16,20 11,21 5,24 19,25 5,28 5,29 5.7}
{0 CHEMBL316264,1 8.773,2 52.6,3 34.2,4 1.017,5 1.123,6 0.723,7 0.71,8 333.36,9 7.9,10 23,11 38,13 23,14 28,16 41,17 20,20 20,23 2,24 13,25 5,28 3,29 5.7}
{0 CHEMBL31965,1 8.237,2 40.7,3 42.4,4 1.018,5 1.135,6 0.671,7 0.648,8 485.99,9 8.5,10 17,11 59,13 19,14 37,16 62,17 24,18 1,20 17,21 7,22 2,23 1,24 25,25 10,26 1,28 5,29 5}
{0 CHEMBL340384,1 9.329,2 50,3 33.3,4 1.022,5 1.109,6 0.733,7 0.719,8 391.83,9 7.1,10 18,11 42,13 21,14 31,16 45,17 21,18 1,20 21,22 3,24 14,25 7,26 1,28 3,29 6.7}
{0 CHEMBL340921,1 8.254,2 48.9,3 37.8,4 1.011,5 1.112,6 0.705,7 0.687,8 371.42,9 6.7,10 18,11 45,13 21,14 31,16 48,17 22,20 21,21 1,22 3,24 17,25 6,28 3,29 5.8}
{0 CHEMBL363648,1 7.991,2 48,3 42,4 0.993,5 1.107,6 0.719,7 0.674,8 399.55,9 6,10 23,11 50,13 24,14 32,16 53,17 24,20 21,21 3,22 1,24 21,25 5,26 1,28 3,29 5.7}
{0 CHEMBL371206,1 8.071,2 44,3 42,4 1,5 1.119,6 0.704,7 0.664,8 403.55,9 10,10 22,11 50,13 23,14 32,16 53,17 22,20 19,21 3,22 1,24 21,25 7,26 1,28 5,29 5.7}
{0 CHEMBL377300,1 8.053,2 41.3,3 41.3,4 1.021,5 1.137,6 0.661,7 0.648,8 370.42,9 8.7,10 20,11 46,13 20,14 30,16 49,17 19,20 14,21 5,23 1,24 19,25 8,28 4,29 5}
{0 CHEMBL377383,1 8.928,2 37.2,3 41.9,4 1.025,5 1.128,6 0.684,7 0.655,8 383.89,9 7,10 12,11 43,13 15,14 26,16 44,17 16,18 1,20 12,21 4,22 3,24 18,25 9,26 2,28 3,29 5.7}
{0 CHEMBL377408,1 8.731,2 37.2,3 39.5,4 1.028,5 1.133,6 0.676,7 0.658,8 375.45,9 11.6,10 12,11 43,13 16,14 27,16 44,17 16,19 1,20 12,21 3,22 3,24 17,25 10,26 1,28 5,29 5.7}
{0 CHEMBL378627,1 8.155,2 36.4,3 43.6,4 1.023,5 1.133,6 0.655,7 0.633,8 448.55,9 7.3,10 12,11 55,13 16,14 32,16 56,17 20,19 1,20 12,21 7,22 3,24 24,25 11,26 1,28 4,29 5.7}
{0 CHEMBL379218,1 7.316,2 44.9,3 44.9,4 0.994,5 1.121,6 0.68,7 0.644,8 358.48,9 8.2,10 22,11 49,13 22,14 30,16 52,17 22,20 18,21 4,24 22,25 5,28 4,29 6.569}
{0 CHEMBL379835,1 9.308,2 48.6,3 34.3,4 1.02,5 1.112,6 0.731,7 0.713,8 325.77,9 8.6,10 17,11 35,13 18,14 26,16 38,17 17,18 1,20 16,21 1,22 1,24 12,25 6,26 1,28 3,29 5.7}
{0 CHEMBL384304,1 8.657,2 35.3,3 41.2,4 1.037,5 1.15,6 0.651,7 0.64,8 441.51,9 9.8,10 12,11 51,13 15,14 32,16 53,17 18,20 11,21 7,22 3,23 2,24 21,25 12,26 1,28 5,29 5}
{0 CHEMBL386051,1 9.853,2 46.7,3 35.6,4 1.014,5 1.109,6 0.759,7 0.718,8 443.38,9 8.9,10 18,11 45,13 20,14 32,16 48,17 21,18 2,20 19,21 2,22 2,24 16,25 8,26 3,28 4,29 5}
{0 CHEMBL387971,1 7.688,2 41.9,3 45.2,4 1.001,5 1.121,6 0.68,7 0.641,8 476.65,9 6.5,10 16,11 62,13 18,14 38,16 66,17 26,19 2,20 14,21 10,22 1,24 28,25 8,26 1,28 4,29 5.7}
{0 CHEMBL392642,1 7.309,2 35.1,3 49.1,4 1.001,5 1.139,6 0.649,7 0.606,8 416.61,9 10.5,10 12,11 57,13 14,14 31,16 59,17 20,20 10,21 10,22 2,24 28,25 9,26 1,28 6,29 5.7}
{0 CHEMBL394619,1 8.322,2 46.7,3 40,4 1,5 1.112,6 0.721,7 0.682,8 374.5,9 8.9,10 22,11 45,13 23,14 30,16 48,17 21,20 20,21 1,22 1,24 18,25 6,26 1,28 4,29 5.7}
{0 CHEMBL394790,1 9.403,2 47.6,3 35.7,4 1.01,5 1.109,6 0.751,7 0.714,8 394.91,9 9.5,10 22,11 42,13 23,14 30,16 45,17 20,18 1,20 20,22 1,24 15,25 7,26 2,28 4,29 5.7}
{0 CHEMBL396523,1 8.659,2 45,3 35,4 1.02,5 1.127,6 0.7,7 0.692,8 346.38,9 15,10 22,11 40,13 23,14 29,16 43,17 18,20 18,22 1,24 14,25 8,28 6,29 5.7}
{0 CHEMBL398951,1 7.42,2 42.9,3 44.6,4 1,5 1.126,6 0.671,7 0.639,8 415.54,9 8.9,10 17,11 56,13 18,14 35,16 60,17 24,19 1,20 14,21 9,24 25,25 7,28 5,29 5.7}
{0 CHEMBL402846,1 8.135,2 43.8,3 39.6,4 1.013,5 1.134,6 0.682,7 0.665,8 390.46,9 12.5,10 22,11 48,13 23,14 32,16 51,17 21,20 19,21 2,22 1,23 1,24 19,25 8,28 6,29 5.7}
{0 CHEMBL404367,1 7.76,2 43.8,3 41.7,4 1.003,5 1.127,6 0.684,7 0.657,8 372.47,9 12.5,10 22,11 48,13 23,14 31,16 51,17 21,20 19,21 2,22 1,24 20,25 7,28 6,29 5.7}
{0 CHEMBL411903,1 9.189,2 42,3 34,4 1.046,5 1.159,6 0.671,7 0.682,8 459.45,9 14,10 18,11 50,13 20,14 36,16 53,17 21,20 18,21 3,22 2,23 4,24 17,25 12,28 7,29 5.9}
{0 CHEMBL412142,1 9.308,2 44,3 36,4 1.015,5 1.127,6 0.727,7 0.7,8 465.38,9 16,10 23,11 50,13 24,14 35,16 53,17 22,18 2,19 1,20 18,21 3,24 18,25 10,26 2,28 8,29 5.7}
{0 CHEMBL41783,1 8.191,2 38.6,3 40.9,4 1.026,5 1.154,6 0.652,7 0.643,8 360.41,9 13.6,10 16,11 44,13 17,14 28,16 46,17 17,20 12,21 5,22 1,23 2,24 18,25 9,28 6,29 5.7}
{0 CHEMBL422897,1 8.372,2 43.8,3 41.7,4 1.019,5 1.118,6 0.682,7 0.66,8 401.87,9 2.1,10 12,11 48,13 14,14 31,16 51,17 21,18 1,20 15,21 6,22 2,24 20,25 7,26 1,28 1,29 5.7}
{0 CHEMBL424872,1 8.51,2 38.6,3 40.9,4 1.022,5 1.129,6 0.678,7 0.655,8 374.46,9 9.1,10 12,11 44,13 16,14 27,16 45,17 17,19 1,20 12,21 4,22 3,24 18,25 9,26 1,28 4,29 5.7}
{0 CHEMBL428690,1 8.372,2 43.8,3 41.7,4 1.019,5 1.118,6 0.682,7 0.66,8 401.87,9 2.1,10 12,11 48,13 14,14 31,16 51,17 21,18 1,20 15,21 6,22 2,24 20,25 7,26 1,28 1,29 5}
{0 CHEMBL440084,1 8.543,2 48.9,3 35.6,4 1.015,5 1.114,6 0.71,7 0.698,8 384.42,9 8.9,10 23,11 45,13 24,14 33,16 49,17 22,20 21,21 1,22 1,24 16,25 7,28 4,29 5}
{0 CHEMBL443962,1 10.863,2 46.4,3 35.7,4 1.014,5 1.115,6 0.745,7 0.711,8 304.16,9 10.7,10 16,11 28,13 16,14 20,15 1,16 30,17 13,20 12,21 1,24 10,25 5,26 1,28 3,29 5.7}
{0 CHEMBL445813,1 9.102,2 38.1,3 40.5,4 1.024,5 1.136,6 0.69,7 0.664,8 382.28,9 11.9,10 11,11 42,13 13,14 27,16 44,17 16,18 2,20 11,21 5,22 2,24 17,25 9,26 2,28 5,29 5}
{0 CHEMBL450786,1 8.333,2 41.6,3 44.2,4 1.008,5 1.121,6 0.693,7 0.652,8 641.67,9 5.2,10 17,11 77,13 22,14 48,16 82,17 32,18 2,20 20,21 12,22 5,24 34,25 11,26 3,28 4,29 5}
{0 CHEMBL458997,1 8.086,2 39.7,3 43.1,4 1.013,5 1.133,6 0.67,7 0.644,8 468.99,9 10.3,10 18,11 58,13 19,14 36,16 61,17 23,18 1,20 17,21 6,22 1,24 25,25 10,26 1,28 6,29 5.9}
{0 CHEMBL464552,1 7.833,2 39.7,3 42.6,4 1.015,5 1.14,6 0.658,7 0.64,8 532.64,9 11.8,10 22,11 68,13 24,14 43,16 72,17 27,20 20,21 7,22 2,23 1,24 29,25 12,28 8,29 5}
{0 CHEMBL468280,1 10.469,2 44.4,3 29.6,4 1.058,5 1.132,6 0.712,7 0.722,8 282.67,9 7.4,10 11,11 27,13 12,14 21,16 29,17 12,18 1,20 10,21 2,22 1,23 1,24 8,25 7,26 1,28 2,29 5.7}
{0 CHEMBL474432,1 9.57,2 44,3 34,4 1.048,5 1.134,6 0.692,7 0.694,8 478.48,9 4,10 21,11 50,13 22,14 36,16 53,17 22,20 18,21 4,22 1,23 3,24 17,25 11,26 1,28 2,29 5.7}
{0 CHEMBL475251,1 8.255,2 38.6,3 40.4,4 1.03,5 1.142,6 0.651,7 0.646,8 470.51,9 10.5,10 18,11 57,13 19,14 37,16 60,17 22,20 16,21 6,22 1,23 1,24 23,25 12,28 6,29 5.35}
{0 CHEMBL477772,1 8.103,2 38.9,3 42.6,4 1.009,5 1.132,6 0.679,7 0.648,8 437.58,9 13,10 22,11 54,13 24,14 34,16 57,17 21,20 17,21 4,22 2,24 23,25 10,26 1,28 7,29 5}
{0 CHEMBL481491,1 9.708,2 46.5,3 32.6,4 1.041,5 1.134,6 0.714,7 0.71,8 417.44,9 7,10 21,11 43,13 22,14 32,16 46,17 20,20 18,21 2,22 1,23 3,24 14,25 9,26 1,28 3,29 5.7}
{0 CHEMBL482767,1 10.023,2 41.9,3 34.9,4 1.019,5 1.118,6 0.755,7 0.713,8 430.98,9 14,10 21,11 43,13 22,14 31,16 46,17 18,18 1,20 16,21 2,22 1,24 15,25 10,26 3,28 6,29 5.7}
{0 CHEMBL482967,1 8.011,2 39.1,3 43.5,4 1.004,5 1.131,6 0.684,7 0.646,8 368.51,9 13,10 17,11 46,13 17,14 29,16 49,17 18,20 13,21 5,24 20,25 8,26 1,28 6,29 5.7}
{0 CHEMBL483158,1 9.105,2 47.4,3 35.1,4 1.026,5 1.12,6 0.71,7 0.7,8 518.96,9 7,10 24,11 57,13 26,14 41,16 61,17 27,18 1,20 24,21 3,22 2,23 1,24 20,25 10,26 1,28 4,29 5.7}
{0 CHEMBL483321,1 7.574,2 43.5,3 43.5,4 1.003,5 1.124,6 0.674,7 0.646,8 469.59,9 8.1,10 23,11 62,13 25,14 38,16 65,17 27,20 22,21 5,22 2,24 27,25 8,28 5,29 5}
{0 CHEMBL484390,1 7.04,2 41.5,3 47.7,4 0.995,5 1.128,6 0.659,7 0.621,8 457.63,9 7.7,10 16,11 65,13 19,14 37,16 68,17 27,19 1,20 15,21 11,22 2,24 31,25 7,28 5,29 5.7}
{0 CHEMBL491473,1 7.509,2 41.7,3 45,4 1.008,5 1.132,6 0.658,7 0.632,8 450.56,9 6.7,10 21,11 60,13 21,14 37,16 64,17 25,20 16,21 9,23 1,24 27,25 8,28 4,29 5.35}
{0 CHEMBL491758,1 8.245,2 47.1,3 38.2,4 1.01,5 1.13,6 0.699,7 0.679,8 280.33,9 11.8,10 18,11 34,13 18,14 23,16 36,17 16,20 16,23 1,24 13,25 5,28 4,29 5.7}
{0 CHEMBL494089,1 7.337,2 36.2,3 46.6,4 1.009,5 1.143,6 0.638,7 0.613,8 425.55,9 12.1,10 15,11 58,13 16,14 34,16 61,17 21,19 2,20 8,21 11,24 27,25 10,28 7,29 6.678}
{0 CHEMBL497151,1 14.104,2 48.4,3 25.8,4 1.035,5 1.097,6 0.838,7 0.784,8 437.23,9 9.7,10 21,11 31,13 21,14 26,16 34,17 15,20 15,24 8,25 8,26 2,27 1,28 3,29 5.7}
{0 CHEMBL508928,1 7.973,2 43.6,3 40,4 1.006,5 1.129,6 0.688,7 0.665,8 438.54,9 14.5,10 27,11 55,13 28,14 37,16 59,17 24,20 22,21 2,22 1,24 22,25 9,28 8,29 5.7}
{0 CHEMBL50894,1 8.888,2 48.5,3 33.3,4 1.025,5 1.115,6 0.71,7 0.707,8 293.3,9 9.1,10 16,11 33,13 19,14 25,16 36,17 16,20 15,21 1,22 3,24 11,25 6,28 3,29 5.7}
{0 CHEMBL509032,1 7.491,2 36.6,3 48.8,4 1.001,5 1.135,6 0.657,7 0.613,8 614.29,9 8.5,10 18,11 82,13 20,14 46,16 86,17 30,18 1,20 16,21 14,22 2,24 40,25 12,26 2,28 7,29 5.8}
{0 CHEMBL513909,1 6.776,2 36.4,3 50.6,4 0.998,5 1.14,6 0.631,7 0.594,8 521.74,9 9.1,10 12,11 77,13 14,14 42,16 81,17 28,20 12,21 16,22 2,24 39,25 10,28 7,29 5}
{0 CHEMBL514499,1 9.363,2 43.1,3 35.3,4 1.043,5 1.137,6 0.689,7 0.686,8 477.5,9 5.9,10 21,11 51,13 22,14 36,16 54,17 22,20 18,21 4,22 1,23 3,24 18,25 11,26 1,28 3,29 6.5}
{0 CHEMBL519697,1 7.42,2 42.9,3 44.6,4 1,5 1.126,6 0.671,7 0.639,8 415.54,9 8.9,10 16,11 56,13 19,14 34,16 59,17 24,19 1,20 15,21 8,22 2,24 25,25 7,28 5,29 5.7}
{0 CHEMBL521851,1 8.286,2 37.1,3 43.5,4 1.011,5 1.131,6 0.682,7 0.644,8 513.71,9 11.3,10 20,11 62,13 22,14 40,16 67,17 23,20 13,21 10,22 2,24 27,25 12,26 2,28 7,29 5}
{0 CHEMBL522892,1 7.85,2 42,3 42,4 1.01,5 1.137,6 0.67,7 0.649,8 392.48,9 12,10 16,11 50,13 18,14 33,16 54,17 21,20 16,21 5,22 2,23 1,24 21,25 8,28 6,29 5.35}
{0 CHEMBL525191,1 7.777,2 44.2,3 41.9,4 1.006,5 1.124,6 0.681,7 0.656,8 334.41,9 9.3,10 17,11 43,13 18,14 28,16 46,17 19,20 15,21 4,22 1,24 18,25 6,28 4,29 5}
{0 CHEMBL526133,1 8.48,2 50,3 35.3,4 1.008,5 1.114,6 0.721,7 0.703,8 288.33,9 11.8,10 16,11 34,13 19,14 25,16 37,17 17,20 17,22 3,24 12,25 5,28 4,29 5.7}
{0 CHEMBL535,1 7.117,2 39.3,3 48.2,4 1.003,5 1.138,6 0.643,7 0.611,8 398.53,9 7.1,10 11,11 56,13 14,14 31,16 58,17 22,20 14,21 8,22 3,23 1,24 27,25 7,28 4,29 5}
{0 CHEMBL539474,1 7.815,2 44.4,3 41.7,4 1.007,5 1.122,6 0.68,7 0.657,8 281.34,9 8.3,10 11,11 36,13 13,14 24,16 39,17 16,20 12,21 4,22 2,24 15,25 5,28 3,29 6}
{0 CHEMBL553,1 7.567,2 42.3,3 44.2,4 1.009,5 1.125,6 0.662,7 0.638,8 393.48,9 5.8,10 17,11 52,13 18,14 31,16 54,17 22,19 2,20 14,21 6,24 23,25 7,28 3,29 5.35}
{0 CHEMBL554,1 8.805,2 43.9,3 39.4,4 1.019,5 1.121,6 0.703,7 0.677,8 581.11,9 6.1,10 28,11 66,13 30,14 44,16 70,17 29,18 1,20 24,21 5,22 2,23 1,24 26,25 11,26 2,28 4,29 5.35}
{0 CHEMBL558752,1 9.782,2 45.3,3 30.2,4 1.058,5 1.161,6 0.683,7 0.705,8 518.46,9 11.3,10 27,11 53,13 27,14 41,16 57,17 24,20 21,21 3,23 6,24 16,25 13,28 6,29 5}
{0 CHEMBL560813,1 9.259,2 47.2,3 30.6,4 1.032,5 1.121,6 0.713,7 0.718,8 333.33,9 13.9,10 17,11 36,13 20,14 27,16 38,17 17,19 1,20 16,22 2,24 11,25 8,28 5,29 5.7}
{0 CHEMBL565612,1 7.973,2 45.5,3 40,4 1.006,5 1.122,6 0.692,7 0.669,8 438.53,9 10.9,10 21,11 55,13 24,14 38,16 60,17 25,20 20,21 5,22 3,24 22,25 8,28 6,29 6.1}
{0 CHEMBL572878,1 7.617,2 37.7,3 45.9,4 1.001,5 1.136,6 0.668,7 0.629,8 464.66,9 13.1,10 17,11 61,13 18,14 37,16 65,17 23,20 14,21 9,22 1,24 28,25 10,26 1,28 8,29 5.35}
{0 CHEMBL572881,1 7.324,2 43.1,3 45.1,4 0.996,5 1.126,6 0.673,7 0.638,8 373.5,9 9.8,10 18,11 51,13 19,14 31,16 54,17 22,20 17,21 5,22 1,24 23,25 6,28 5,29 5}
{0 CHEMBL573339,1 8.295,2 45.2,3 38.1,4 1.016,5 1.122,6 0.689,7 0.676,8 348.39,9 9.5,10 21,11 42,13 21,14 30,16 46,17 19,20 15,21 4,24 16,25 7,28 4,29 5}
{0 CHEMBL574738,1 7.789,2 38.2,3 44.1,4 1.02,5 1.152,6 0.642,7 0.626,8 529.63,9 10.3,10 18,11 68,13 19,14 41,16 71,17 26,20 17,21 9,22 1,23 3,24 30,25 12,28 7,29 5}
{0 CHEMBL576982,1 7.788,2 40.3,3 44.4,4 1.007,5 1.127,6 0.672,7 0.639,8 560.74,9 8.3,10 25,11 72,13 26,14 45,16 77,17 29,20 19,21 10,22 1,24 32,25 11,26 1,28 6,29 5}
{0 CHEMBL583144,1 13.557,2 50,3 20,4 1.051,5 1.092,6 0.868,7 0.833,8 271.13,9 10,10 10,11 20,13 12,14 18,16 22,17 10,18 2,20 10,22 2,24 4,25 6,26 3,28 2,29 5.9}
{0 CHEMBL592030,1 8.294,2 45.3,3 39.6,4 1,5 1.119,6 0.717,7 0.68,8 439.59,9 13.2,10 30,11 53,13 30,14 37,16 58,17 24,20 21,21 3,24 21,25 8,26 1,28 7,29 8.2}
{0 CHEMBL600852,1 7.647,2 43.1,3 43.1,4 1.006,5 1.125,6 0.673,7 0.647,8 443.55,9 8.6,10 18,11 58,13 21,14 36,16 61,17 25,20 21,21 4,22 3,24 25,25 8,28 5,29 5.523}
{0 CHEMBL601719,1 8.661,2 40.4,3 42.3,4 1.016,5 1.136,6 0.688,7 0.656,8 450.38,9 9.6,10 17,11 52,13 17,14 33,16 55,17 21,18 2,20 14,21 7,23 1,24 22,25 9,26 2,28 5,29 5}
{0 CHEMBL604087,1 7.426,2 43.3,3 45,4 1.004,5 1.122,6 0.666,7 0.637,8 445.56,9 5,10 18,11 60,13 20,14 36,16 63,17 26,20 20,21 6,22 2,24 27,25 7,28 3,29 5.252}
{0 CHEMBL607707,1 8.357,2 42.9,3 41.1,4 1.015,5 1.131,6 0.685,7 0.661,8 467.97,9 8.9,10 17,11 56,13 20,14 35,16 58,17 24,18 1,19 1,20 18,21 5,22 2,23 1,24 23,25 9,26 1,28 5,29 5}
{0 CHEMBL608154,1 8.947,2 46.3,3 36.6,4 1.017,5 1.118,6 0.716,7 0.695,8 366.83,9 9.8,10 21,11 41,13 22,14 29,16 44,17 19,18 1,20 17,21 2,22 1,24 15,25 7,26 1,28 4,29 5}
{0 CHEMBL7064,1 8.81,2 56,3 32,4 1.007,5 1.098,6 0.75,7 0.734,8 220.24,9 8,10 16,11 25,13 17,14 20,16 28,17 14,20 14,22 1,24 8,25 3,28 2,29 5.7}
{0 CHEMBL91829,1 7.438,2 44.4,3 44.4,4 1,5 1.121,6 0.675,7 0.644,8 468.6,9 6.3,10 20,11 63,13 23,14 40,16 68,17 28,20 20,21 8,22 3,24 28,25 7,28 4,29 5}
{0 CHEMBL939,1 8.126,2 40,3 43.6,4 1.017,5 1.136,6 0.665,7 0.641,8 446.95,9 7.3,10 17,11 55,13 17,14 34,16 58,17 22,18 1,20 14,21 8,23 1,24 24,25 9,26 1,28 4,29 5.35}
{0 CHEMBL941,1 7.26,2 42.6,3 45.6,4 0.995,5 1.128,6 0.671,7 0.635,8 493.67,9 10.3,10 24,11 68,13 25,14 41,16 72,17 29,20 22,21 7,22 1,24 31,25 8,28 7,29 5.35}
{0 CHEMBL95692,1 7.683,2 41.3,3 43.5,4 1.009,5 1.138,6 0.663,7 0.64,8 353.44,9 10.9,10 17,11 46,13 17,14 29,16 49,17 19,20 13,21 6,23 1,24 20,25 7,28 5,29 5.7}
