"molecule_id","FCFP4_1024b492","FCFP4_1024b623","FCFP4_1024b960","FCFP4_1024b714","FCFP4_1024b302","FCFP4_1024b497","FCFP4_1024b676","FCFP4_1024b32","FCFP4_1024b4","FCFP4_1024b170","FCFP4_1024b17","FCFP4_1024b859","FCFP4_1024b457","FCFP4_1024b869","FCFP4_1024b936","FCFP4_1024b554","FCFP4_1024b1","FCFP4_1024b10","FCFP4_1024b100","FCFP4_1024b1000","FCFP4_1024b1001","FCFP4_1024b1002","FCFP4_1024b1003","FCFP4_1024b1004","FCFP4_1024b1005","FCFP4_1024b1006","FCFP4_1024b1007","FCFP4_1024b1008","FCFP4_1024b1009","FCFP4_1024b101","FCFP4_1024b1010","FCFP4_1024b1011","FCFP4_1024b1012","FCFP4_1024b1013","FCFP4_1024b1014","FCFP4_1024b1015","FCFP4_1024b1016","FCFP4_1024b1017","FCFP4_1024b1018","FCFP4_1024b1019","FCFP4_1024b102","FCFP4_1024b1020","FCFP4_1024b1021","FCFP4_1024b1022","FCFP4_1024b1023","FCFP4_1024b1024","FCFP4_1024b103","FCFP4_1024b104","FCFP4_1024b105","FCFP4_1024b106","FCFP4_1024b107","pXC50"
{1 1,2 1,3 1,4 1,9 1,10 1,11 1,12 1,17 1,41 1,52 8.921}
{0 CHEMBL10219,1 1,2 1,3 1,4 1,9 1,12 1,17 1,49 1,52 7}
{0 CHEMBL103769,9 1,10 1,11 1,12 1,17 1,52 6.297}
{0 CHEMBL10437,1 1,2 1,4 1,9 1,12 1,17 1,52 6.699}
{0 CHEMBL10478,1 1,2 1,3 1,4 1,9 1,10 1,11 1,12 1,17 1,52 7}
{0 CHEMBL1082491,1 1,2 1,4 1,9 1,10 1,11 1,17 1,52 4.843}
{0 CHEMBL1082596,1 1,2 1,4 1,9 1,11 1,17 1,52 7.038}
{0 CHEMBL1083794,1 1,2 1,4 1,7 1,9 1,11 1,12 1,17 1,52 5.458}
{0 CHEMBL1083795,1 1,2 1,4 1,7 1,9 1,12 1,17 1,52 5.745}
{0 CHEMBL1084109,1 1,2 1,4 1,9 1,11 1,17 1,52 7.371}
{0 CHEMBL1085130,1 1,2 1,4 1,7 1,9 1,11 1,12 1,17 1,52 4.576}
{0 CHEMBL1085392,1 1,2 1,4 1,9 1,11 1,17 1,52 5.852}
{0 CHEMBL1085393,1 1,2 1,4 1,9 1,11 1,17 1,52 6.675}
{0 CHEMBL1085631,1 1,2 1,4 1,7 1,9 1,11 1,12 1,17 1,52 4.253}
{0 CHEMBL1085632,1 1,2 1,4 1,7 1,9 1,11 1,12 1,17 1,52 4.35}
{0 CHEMBL1085633,1 1,2 1,4 1,7 1,9 1,11 1,12 1,17 1,52 4.595}
{0 CHEMBL1085859,1 1,2 1,4 1,7 1,9 1,11 1,12 1,17 1,52 4.351}
{0 CHEMBL1086532,1 1,2 1,4 1,9 1,11 1,17 1,52 7.048}
{0 CHEMBL1086533,1 1,2 1,4 1,9 1,11 1,17 1,52 5.208}
{0 CHEMBL108656,1 1,2 1,3 1,4 1,7 1,8 1,9 1,12 1,17 1,52 4.377}
{0 CHEMBL1086996,1 1,2 1,4 1,9 1,12 1,17 1,18 1,52 5.699}
{0 CHEMBL1088892,1 1,2 1,4 1,6 1,9 1,12 1,17 1,52 4.078}
{0 CHEMBL1089185,1 1,2 1,3 1,4 1,6 1,7 1,8 1,9 1,12 1,17 1,52 6.252}
{0 CHEMBL1089194,1 1,2 1,4 1,6 1,9 1,12 1,17 1,52 4.367}
{0 CHEMBL1090539,1 1,2 1,4 1,6 1,9 1,12 1,17 1,52 5.377}
{0 CHEMBL1090540,1 1,2 1,3 1,4 1,6 1,7 1,8 1,9 1,12 1,17 1,52 7.721}
{0 CHEMBL1091214,1 1,2 1,3 1,4 1,6 1,7 1,8 1,9 1,12 1,17 1,52 8.658}
{0 CHEMBL110830,1 1,2 1,3 1,4 1,8 1,9 1,12 1,17 1,52 5.596}
{0 CHEMBL1200829,1 1,2 1,4 1,9 1,12 1,17 1,52 4.523}
{0 CHEMBL1299993,11 1,17 1,18 1,42 1,52 4.301}
{0 CHEMBL1300877,10 1,11 1,17 1,31 1,40 1,52 5}
{0 CHEMBL1301708,9 1,10 1,11 1,17 1,51 1,52 4.301}
{0 CHEMBL1301957,10 1,11 1,17 1,52 4.301}
{0 CHEMBL1302741,9 1,11 1,12 1,17 1,51 1,52 4.301}
{0 CHEMBL1306942,9 1,10 1,11 1,12 1,17 1,38 1,51 1,52 4.301}
{0 CHEMBL1309434,3 1,10 1,11 1,17 1,52 4.301}
{0 CHEMBL1313554,4 1,9 1,10 1,11 1,17 1,42 1,52 4.301}
{0 CHEMBL1330356,9 1,10 1,11 1,17 1,51 1,52 4.301}
{0 CHEMBL1330547,9 1,10 1,11 1,12 1,17 1,52 4.301}
{0 CHEMBL1331489,9 1,10 1,11 1,12 1,17 1,51 1,52 4.301}
{0 CHEMBL1332666,1 1,9 1,10 1,11 1,12 1,17 1,29 1,52 4.301}
{0 CHEMBL1335130,10 1,11 1,17 1,52 4.301}
{0 CHEMBL1335319,9 1,10 1,11 1,12 1,17 1,18 1,37 1,52 4.799}
{0 CHEMBL1336839,9 1,10 1,11 1,17 1,26 1,51 1,52 5}
{0 CHEMBL1338618,10 1,11 1,17 1,52 4.301}
{0 CHEMBL1343333,9 1,10 1,11 1,12 1,17 1,42 1,52 5}
{0 CHEMBL1344925,2 1,4 1,9 1,12 1,17 1,18 1,52 5}
{0 CHEMBL1346121,9 1,10 1,11 1,17 1,52 4.301}
{0 CHEMBL1348875,4 1,9 1,10 1,11 1,12 1,17 1,18 1,49 1,52 4.301}
{0 CHEMBL1349523,10 1,11 1,17 1,39 1,52 4.301}
{0 CHEMBL1351824,9 1,10 1,11 1,17 1,51 1,52 4.301}
{0 CHEMBL1351900,10 1,11 1,17 1,18 1,52 4.301}
{0 CHEMBL1352133,9 1,10 1,11 1,17 1,39 1,51 1,52 4.301}
{0 CHEMBL1352628,10 1,11 1,17 1,18 1,52 4.301}
{0 CHEMBL1352896,10 1,11 1,17 1,18 1,19 1,42 1,52 4.301}
{0 CHEMBL1361379,10 1,11 1,17 1,18 1,34 1,52 5.051}
{0 CHEMBL1369911,9 1,10 1,11 1,17 1,19 1,36 1,51 1,52 4.301}
{0 CHEMBL1371090,9 1,10 1,11 1,17 1,52 4.301}
{0 CHEMBL1373511,9 1,10 1,11 1,12 1,17 1,52 5}
{0 CHEMBL1374052,4 1,9 1,10 1,11 1,17 1,18 1,51 1,52 4.301}
{0 CHEMBL1374135,10 1,11 1,17 1,31 1,52 4.301}
{0 CHEMBL1374260,9 1,10 1,11 1,17 1,52 4.301}
{0 CHEMBL1378540,10 1,11 1,17 1,52 5}
{0 CHEMBL1379217,9 1,10 1,11 1,17 1,52 4.301}
{0 CHEMBL1379887,9 1,10 1,11 1,17 1,26 1,51 1,52 4.301}
{0 CHEMBL1380435,9 1,10 1,11 1,17 1,39 1,51 1,52 5}
{0 CHEMBL1386000,9 1,10 1,11 1,12 1,17 1,52 4.301}
{0 CHEMBL1386608,9 1,10 1,11 1,15 1,17 1,26 1,40 1,51 1,52 5}
{0 CHEMBL1390756,9 1,10 1,11 1,17 1,18 1,51 1,52 5}
{0 CHEMBL1391713,9 1,10 1,11 1,17 1,47 1,51 1,52 4.301}
{0 CHEMBL13922,1 1,2 1,3 1,4 1,8 1,9 1,12 1,17 1,52 4.893}
{0 CHEMBL1392854,10 1,11 1,17 1,40 1,52 4.301}
{0 CHEMBL1393188,10 1,11 1,17 1,52 5}
{0 CHEMBL1404557,10 1,11 1,17 1,52 4.301}
{0 CHEMBL1406920,9 1,10 1,11 1,17 1,18 1,34 1,51 1,52 5}
{0 CHEMBL1407707,10 1,11 1,17 1,18 1,52 5}
{0 CHEMBL1408185,1 1,9 1,10 1,11 1,12 1,17 1,51 1,52 4.301}
{0 CHEMBL1409146,9 1,10 1,11 1,17 1,18 1,34 1,51 1,52 4.301}
{0 CHEMBL1411680,9 1,10 1,11 1,17 1,18 1,51 1,52 5}
{0 CHEMBL1415853,9 1,10 1,11 1,12 1,17 1,52 4.301}
{0 CHEMBL1418196,10 1,11 1,17 1,40 1,52 4.301}
{0 CHEMBL1419727,10 1,11 1,17 1,35 1,52 4.301}
{0 CHEMBL1420689,3 1,9 1,10 1,11 1,17 1,24 1,51 1,52 4.301}
{0 CHEMBL1420972,10 1,11 1,17 1,52 4.301}
{0 CHEMBL1421242,10 1,11 1,12 1,17 1,33 1,52 5}
{0 CHEMBL1421687,9 1,10 1,11 1,12 1,17 1,39 1,51 1,52 4.301}
{0 CHEMBL1425108,1 1,9 1,10 1,11 1,17 1,18 1,52 5}
{0 CHEMBL1426282,10 1,11 1,17 1,52 4.301}
{0 CHEMBL1426950,9 1,10 1,11 1,17 1,51 1,52 5}
{0 CHEMBL1428466,3 1,9 1,10 1,11 1,17 1,19 1,36 1,51 1,52 4.301}
{0 CHEMBL1432209,10 1,11 1,12 1,17 1,52 4.301}
{0 CHEMBL1432773,9 1,10 1,11 1,12 1,17 1,27 1,51 1,52 5}
{0 CHEMBL1439424,10 1,11 1,17 1,52 4.301}
{0 CHEMBL1439592,9 1,10 1,11 1,17 1,52 4.301}
{0 CHEMBL1440080,4 1,9 1,10 1,11 1,17 1,18 1,42 1,52 4.301}
{0 CHEMBL1440473,10 1,11 1,17 1,18 1,41 1,52 5}
{0 CHEMBL1442864,8 1,9 1,10 1,11 1,12 1,17 1,40 1,51 1,52 4.301}
{0 CHEMBL1443489,10 1,11 1,17 1,18 1,22 1,39 1,52 4.301}
{0 CHEMBL1446498,10 1,11 1,17 1,30 1,52 4.301}
{0 CHEMBL1447026,9 1,10 1,11 1,17 1,51 1,52 5}
{0 CHEMBL1448445,9 1,10 1,11 1,17 1,51 1,52 4.301}
{0 CHEMBL1448857,1 1,9 1,10 1,11 1,17 1,22 1,51 1,52 4.301}
{0 CHEMBL1450580,10 1,11 1,17 1,40 1,52 4.301}
{0 CHEMBL1451433,9 1,10 1,11 1,17 1,51 1,52 4.301}
{0 CHEMBL1453739,9 1,10 1,11 1,12 1,14 1,15 1,17 1,52 5}
{0 CHEMBL1458895,10 1,11 1,17 1,18 1,52 4.301}
{0 CHEMBL1462767,10 1,11 1,12 1,17 1,18 1,28 1,33 1,34 1,52 4.301}
{0 CHEMBL1465732,9 1,10 1,11 1,15 1,17 1,52 4.301}
{0 CHEMBL1466443,9 1,10 1,11 1,17 1,37 1,42 1,51 1,52 4.301}
{0 CHEMBL1467168,9 1,10 1,11 1,12 1,17 1,18 1,37 1,52 4.301}
{0 CHEMBL1468521,6 1,10 1,11 1,17 1,52 4.301}
{0 CHEMBL1469699,9 1,11 1,17 1,41 1,51 1,52 4.301}
{0 CHEMBL1471674,9 1,10 1,11 1,17 1,39 1,42 1,52 5}
{0 CHEMBL1478742,9 1,10 1,11 1,15 1,17 1,42 1,52 4.301}
{0 CHEMBL1479059,9 1,11 1,17 1,52 4.301}
{0 CHEMBL1479531,9 1,10 1,11 1,12 1,17 1,49 1,52 4.301}
{0 CHEMBL1480314,9 1,10 1,11 1,17 1,40 1,52 5}
{0 CHEMBL1481154,1 1,4 1,9 1,10 1,11 1,17 1,52 4.301}
{0 CHEMBL1481691,10 1,11 1,17 1,39 1,40 1,52 4.301}
{0 CHEMBL1485758,4 1,9 1,10 1,11 1,17 1,21 1,51 1,52 4.301}
{0 CHEMBL1486231,9 1,10 1,11 1,17 1,18 1,51 1,52 4.301}
{0 CHEMBL1490870,9 1,10 1,11 1,12 1,17 1,18 1,39 1,52 4.301}
{0 CHEMBL1490957,9 1,10 1,11 1,17 1,51 1,52 4.301}
{0 CHEMBL1491369,10 1,11 1,17 1,39 1,52 4.301}
{0 CHEMBL1492130,10 1,11 1,17 1,38 1,52 4.301}
{0 CHEMBL1494236,10 1,11 1,17 1,52 4.301}
{0 CHEMBL1494440,9 1,10 1,11 1,17 1,51 1,52 4.301}
{0 CHEMBL1497841,1 1,9 1,10 1,11 1,17 1,18 1,52 5}
{0 CHEMBL1499531,1 1,9 1,10 1,11 1,12 1,17 1,18 1,51 1,52 4.301}
{0 CHEMBL1499821,10 1,11 1,17 1,52 4.301}
{0 CHEMBL1502259,10 1,11 1,17 1,52 5.577}
{0 CHEMBL1504507,10 1,11 1,17 1,18 1,33 1,52 4.301}
{0 CHEMBL1506178,9 1,12 1,17 1,18 1,52 4.301}
{0 CHEMBL1507344,10 1,11 1,17 1,18 1,52 4.301}
{0 CHEMBL1508882,10 1,11 1,17 1,18 1,22 1,52 4.301}
{0 CHEMBL1509002,1 1,4 1,9 1,10 1,11 1,17 1,51 1,52 4.301}
{0 CHEMBL1509312,9 1,10 1,11 1,12 1,17 1,23 1,51 1,52 4.301}
{0 CHEMBL1509861,10 1,11 1,17 1,52 4.301}
{0 CHEMBL1510703,10 1,11 1,17 1,18 1,41 1,52 4.301}
{0 CHEMBL1511039,9 1,10 1,11 1,17 1,18 1,34 1,51 1,52 5}
{0 CHEMBL1511422,9 1,10 1,11 1,12 1,17 1,52 4.301}
{0 CHEMBL1523371,2 1,8 1,9 1,10 1,11 1,17 1,51 1,52 5}
{0 CHEMBL1526003,10 1,11 1,17 1,18 1,52 4.301}
{0 CHEMBL1529773,9 1,10 1,11 1,12 1,17 1,49 1,52 4.301}
{0 CHEMBL1531919,9 1,10 1,11 1,17 1,42 1,52 5.604}
{0 CHEMBL1532602,9 1,10 1,11 1,17 1,44 1,52 4.301}
{0 CHEMBL1533643,10 1,11 1,17 1,40 1,52 4.301}
{0 CHEMBL153479,1 1,4 1,9 1,10 1,11 1,17 1,42 1,52 5.387}
{0 CHEMBL1538469,10 1,11 1,17 1,40 1,52 5}
{0 CHEMBL1541279,1 1,9 1,11 1,17 1,52 4.301}
{0 CHEMBL1541624,10 1,11 1,17 1,40 1,52 5}
{0 CHEMBL1544004,9 1,10 1,11 1,12 1,17 1,52 4.301}
{0 CHEMBL1545095,10 1,11 1,17 1,18 1,34 1,35 1,52 4.301}
{0 CHEMBL1545573,1 1,4 1,9 1,10 1,11 1,17 1,51 1,52 4.301}
{0 CHEMBL1546494,10 1,11 1,17 1,52 5}
{0 CHEMBL1548955,9 1,10 1,11 1,17 1,52 4.301}
{0 CHEMBL1549367,10 1,11 1,12 1,17 1,52 4.301}
{0 CHEMBL1549640,10 1,11 1,17 1,52 4.301}
{0 CHEMBL1556904,9 1,10 1,11 1,17 1,40 1,52 5}
{0 CHEMBL1557909,9 1,10 1,11 1,17 1,24 1,52 4.301}
{0 CHEMBL1558692,9 1,10 1,11 1,12 1,17 1,18 1,42 1,46 1,52 5.779}
{0 CHEMBL1561,1 1,2 1,4 1,9 1,12 1,14 1,17 1,18 1,52 4.076}
{0 CHEMBL1564654,1 1,9 1,10 1,11 1,17 1,52 4.301}
{0 CHEMBL1567855,9 1,10 1,11 1,17 1,51 1,52 4.301}
{0 CHEMBL1568508,9 1,10 1,11 1,17 1,51 1,52 5}
{0 CHEMBL1569832,9 1,10 1,11 1,12 1,17 1,18 1,52 4.301}
{0 CHEMBL1573359,10 1,11 1,17 1,40 1,52 4.301}
{0 CHEMBL1575039,2 1,4 1,9 1,10 1,11 1,12 1,17 1,18 1,23 1,52 4.301}
{0 CHEMBL157578,1 1,2 1,4 1,7 1,9 1,12 1,17 1,52 4.18}
{0 CHEMBL1576166,10 1,11 1,17 1,52 4.301}
{0 CHEMBL1576895,9 1,10 1,11 1,12 1,17 1,52 4.301}
{0 CHEMBL1581910,9 1,10 1,11 1,17 1,31 1,51 1,52 4.301}
{0 CHEMBL1583049,10 1,11 1,17 1,18 1,52 4.301}
{0 CHEMBL1584839,9 1,10 1,11 1,17 1,51 1,52 4.301}
{0 CHEMBL1585310,10 1,11 1,17 1,40 1,52 4.301}
{0 CHEMBL1595098,9 1,10 1,11 1,17 1,18 1,51 1,52 5}
{0 CHEMBL1595397,9 1,10 1,11 1,17 1,23 1,51 1,52 4.301}
{0 CHEMBL1596295,9 1,10 1,11 1,12 1,17 1,18 1,52 4.301}
{0 CHEMBL1597212,10 1,11 1,17 1,52 4.301}
{0 CHEMBL1597543,4 1,9 1,10 1,11 1,12 1,17 1,52 4.301}
{0 CHEMBL1598700,9 1,10 1,11 1,12 1,17 1,52 5}
{0 CHEMBL1598866,1 1,9 1,10 1,11 1,17 1,51 1,52 5}
{0 CHEMBL1598960,9 1,10 1,11 1,17 1,49 1,52 4.301}
{0 CHEMBL1600096,10 1,11 1,17 1,52 4.301}
{0 CHEMBL1601761,4 1,9 1,10 1,11 1,12 1,17 1,52 4.301}
{0 CHEMBL1606186,9 1,10 1,11 1,12 1,17 1,52 5}
{0 CHEMBL1608983,9 1,10 1,11 1,17 1,52 5}
{0 CHEMBL1610118,2 1,5 1,9 1,10 1,11 1,17 1,52 4.301}
{0 CHEMBL1651550,1 1,2 1,4 1,9 1,12 1,17 1,18 1,52 4.097}
{0 CHEMBL1651551,1 1,2 1,4 1,9 1,12 1,17 1,18 1,52 4.733}
{0 CHEMBL1651552,1 1,2 1,4 1,9 1,12 1,17 1,18 1,52 5.398}
{0 CHEMBL1651626,1 1,2 1,4 1,9 1,12 1,17 1,18 1,52 4.602}
{0 CHEMBL1651627,1 1,2 1,4 1,9 1,12 1,17 1,18 1,52 4.301}
{0 CHEMBL1651628,1 1,2 1,4 1,9 1,12 1,17 1,18 1,52 4.523}
{0 CHEMBL1651631,1 1,2 1,4 1,9 1,12 1,17 1,18 1,52 5.757}
{0 CHEMBL1651632,1 1,2 1,4 1,9 1,12 1,17 1,18 1,52 6.301}
{0 CHEMBL1651633,1 1,2 1,4 1,9 1,12 1,17 1,18 1,52 6.301}
{0 CHEMBL1651635,1 1,2 1,4 1,9 1,12 1,17 1,18 1,52 4}
{0 CHEMBL1651636,1 1,2 1,4 1,9 1,12 1,17 1,18 1,52 4.022}
{0 CHEMBL1651637,1 1,2 1,4 1,9 1,12 1,17 1,18 1,52 4.398}
{0 CHEMBL1651638,1 1,2 1,4 1,9 1,12 1,17 1,18 1,52 4.824}
{0 CHEMBL1651639,1 1,2 1,4 1,9 1,12 1,17 1,18 1,52 4.921}
{0 CHEMBL1682493,1 1,4 1,9 1,12 1,17 1,52 6.398}
{0 CHEMBL1682494,1 1,4 1,9 1,12 1,17 1,18 1,37 1,52 4}
{0 CHEMBL1682495,1 1,4 1,9 1,12 1,17 1,18 1,37 1,52 4.222}
{0 CHEMBL1766350,1 1,2 1,4 1,9 1,10 1,11 1,17 1,52 7.301}
{0 CHEMBL1766469,1 1,2 1,4 1,9 1,10 1,11 1,17 1,18 1,40 1,52 4.177}
{0 CHEMBL1766470,1 1,2 1,4 1,9 1,10 1,11 1,17 1,52 5.785}
{0 CHEMBL1766471,1 1,2 1,4 1,9 1,10 1,11 1,17 1,52 4.987}
{0 CHEMBL1766472,1 1,2 1,4 1,9 1,10 1,11 1,17 1,39 1,47 1,52 4.914}
{0 CHEMBL1766473,1 1,2 1,4 1,9 1,11 1,17 1,52 5.721}
{0 CHEMBL1766474,1 1,2 1,4 1,9 1,11 1,17 1,52 6.531}
{0 CHEMBL1766475,1 1,2 1,4 1,9 1,11 1,17 1,52 4.445}
{0 CHEMBL1766476,1 1,2 1,4 1,9 1,10 1,11 1,17 1,18 1,52 4.51}
{0 CHEMBL1766477,1 1,2 1,4 1,9 1,10 1,11 1,17 1,27 1,52 4.762}
{0 CHEMBL1766479,1 1,2 1,4 1,9 1,10 1,11 1,17 1,52 5}
{0 CHEMBL1766480,1 1,2 1,4 1,9 1,11 1,17 1,52 5.365}
{0 CHEMBL1766482,1 1,2 1,4 1,9 1,11 1,17 1,52 7.222}
{0 CHEMBL1766485,1 1,2 1,4 1,9 1,11 1,17 1,52 4.352}
{0 CHEMBL1766488,1 1,2 1,4 1,9 1,11 1,12 1,17 1,52 5.237}
{0 CHEMBL1766489,1 1,2 1,4 1,9 1,11 1,12 1,17 1,52 5.773}
{0 CHEMBL1818433,1 1,3 1,4 1,8 1,9 1,12 1,17 1,52 4.268}
{0 CHEMBL2012654,1 1,2 1,4 1,7 1,9 1,12 1,17 1,52 6.482}
{0 CHEMBL2012655,1 1,2 1,4 1,7 1,9 1,12 1,17 1,52 7.252}
{0 CHEMBL2012656,1 1,2 1,4 1,9 1,17 1,52 5.855}
{0 CHEMBL2012657,1 1,2 1,4 1,9 1,17 1,52 4.313}
{0 CHEMBL2012659,1 1,2 1,4 1,9 1,17 1,21 1,52 4.307}
{0 CHEMBL2029768,1 1,2 1,3 1,4 1,7 1,8 1,9 1,12 1,17 1,52 5.569}
{0 CHEMBL2029769,1 1,2 1,3 1,4 1,6 1,7 1,8 1,9 1,12 1,17 1,52 5.959}
{0 CHEMBL2029770,1 1,2 1,3 1,4 1,5 1,6 1,7 1,8 1,9 1,12 1,17 1,52 6.745}
{0 CHEMBL2029771,1 1,2 1,3 1,4 1,5 1,6 1,7 1,8 1,9 1,12 1,17 1,52 7.745}
{0 CHEMBL2029772,1 1,2 1,3 1,4 1,5 1,6 1,7 1,8 1,9 1,12 1,17 1,52 8.745}
{0 CHEMBL2029773,1 1,2 1,3 1,4 1,5 1,6 1,7 1,8 1,9 1,12 1,17 1,52 9.398}
{0 CHEMBL2029774,1 1,2 1,3 1,4 1,5 1,6 1,7 1,8 1,9 1,12 1,17 1,52 7.119}
{0 CHEMBL2029775,1 1,2 1,3 1,4 1,5 1,6 1,7 1,8 1,9 1,12 1,17 1,52 7.538}
{0 CHEMBL2029776,1 1,2 1,3 1,4 1,5 1,6 1,7 1,8 1,9 1,12 1,17 1,26 1,52 8.357}
{0 CHEMBL2029777,1 1,2 1,3 1,4 1,5 1,6 1,7 1,8 1,9 1,12 1,17 1,52 8.222}
{0 CHEMBL2029778,1 1,2 1,3 1,4 1,5 1,6 1,7 1,8 1,9 1,12 1,17 1,52 8.398}
{0 CHEMBL2029779,1 1,2 1,3 1,4 1,5 1,6 1,7 1,8 1,9 1,10 1,11 1,12 1,17 1,52 7.721}
{0 CHEMBL2029780,1 1,2 1,3 1,4 1,5 1,6 1,7 1,8 1,9 1,10 1,11 1,12 1,17 1,52 8.523}
{0 CHEMBL2029781,1 1,2 1,3 1,4 1,5 1,6 1,7 1,8 1,9 1,12 1,17 1,49 1,52 6.699}
{0 CHEMBL2029782,1 1,2 1,3 1,4 1,5 1,6 1,7 1,8 1,9 1,10 1,11 1,12 1,17 1,51 1,52 7.921}
{0 CHEMBL2029783,1 1,2 1,3 1,4 1,5 1,6 1,7 1,8 1,9 1,10 1,11 1,12 1,17 1,52 7.523}
{0 CHEMBL2029784,1 1,2 1,3 1,4 1,5 1,6 1,7 1,8 1,9 1,12 1,17 1,39 1,52 6.602}
{0 CHEMBL2029785,1 1,2 1,3 1,4 1,5 1,6 1,7 1,8 1,9 1,12 1,17 1,39 1,52 6.347}
{0 CHEMBL206468,1 1,3 1,4 1,8 1,9 1,12 1,17 1,52 7.222}
{0 CHEMBL2105671,1 1,3 1,4 1,8 1,9 1,12 1,17 1,52 7.523}
{0 CHEMBL2163840,1 1,2 1,4 1,7 1,9 1,12 1,17 1,52 5.565}
{0 CHEMBL2163841,1 1,2 1,4 1,7 1,9 1,12 1,17 1,52 4.604}
{0 CHEMBL2164031,1 1,4 1,9 1,12 1,17 1,52 4.943}
{0 CHEMBL2164227,1 1,2 1,4 1,7 1,9 1,12 1,17 1,52 7.495}
{0 CHEMBL2164228,1 1,2 1,4 1,7 1,9 1,12 1,17 1,52 5.579}
{0 CHEMBL2164229,1 1,2 1,4 1,7 1,9 1,12 1,17 1,52 6.553}
{0 CHEMBL2164230,1 1,2 1,4 1,7 1,9 1,12 1,17 1,52 7.499}
{0 CHEMBL2164231,1 1,2 1,4 1,7 1,9 1,12 1,17 1,52 8.367}
{0 CHEMBL2164232,1 1,2 1,4 1,9 1,17 1,52 6.886}
{0 CHEMBL2164233,1 1,2 1,4 1,9 1,17 1,18 1,44 1,52 6.181}
{0 CHEMBL219190,1 1,4 1,9 1,12 1,17 1,18 1,42 1,49 1,52 4.959}
{0 CHEMBL235197,9 1,10 1,11 1,12 1,13 1,14 1,15 1,17 1,51 1,52 5.11}
{0 CHEMBL235415,1 1,4 1,9 1,10 1,11 1,12 1,13 1,14 1,15 1,17 1,51 1,52 4.684}
{0 CHEMBL235416,1 1,9 1,10 1,11 1,12 1,14 1,15 1,16 1,17 1,51 1,52 5.215}
{0 CHEMBL235635,1 1,4 1,9 1,10 1,11 1,12 1,13 1,14 1,15 1,17 1,51 1,52 5.167}
{0 CHEMBL235636,1 1,9 1,10 1,11 1,12 1,13 1,14 1,15 1,16 1,17 1,51 1,52 4.916}
{0 CHEMBL235843,1 1,9 1,10 1,11 1,12 1,13 1,14 1,15 1,16 1,17 1,51 1,52 4.507}
{0 CHEMBL235844,1 1,9 1,10 1,11 1,12 1,14 1,15 1,16 1,17 1,36 1,51 1,52 4.726}
{0 CHEMBL235845,1 1,9 1,10 1,11 1,12 1,13 1,14 1,15 1,16 1,17 1,24 1,51 1,52 5.111}
{0 CHEMBL236065,1 1,9 1,10 1,11 1,12 1,13 1,14 1,15 1,16 1,17 1,51 1,52 5.366}
{0 CHEMBL236273,1 1,9 1,10 1,11 1,12 1,13 1,14 1,15 1,16 1,17 1,51 1,52 4.998}
{0 CHEMBL236274,1 1,9 1,10 1,11 1,12 1,13 1,14 1,15 1,16 1,17 1,51 1,52 4.538}
{0 CHEMBL236275,1 1,9 1,10 1,11 1,12 1,13 1,14 1,15 1,16 1,17 1,51 1,52 5.198}
{0 CHEMBL236276,1 1,9 1,10 1,11 1,12 1,13 1,14 1,15 1,16 1,17 1,51 1,52 5.967}
{0 CHEMBL236482,1 1,9 1,10 1,11 1,12 1,13 1,14 1,15 1,16 1,17 1,51 1,52 5.084}
{0 CHEMBL236483,1 1,9 1,10 1,11 1,12 1,13 1,14 1,15 1,16 1,17 1,51 1,52 5.699}
{0 CHEMBL236484,1 1,9 1,10 1,11 1,12 1,13 1,14 1,15 1,16 1,17 1,51 1,52 4.664}
{0 CHEMBL236925,1 1,9 1,10 1,11 1,12 1,13 1,14 1,15 1,16 1,17 1,51 1,52 6.481}
{0 CHEMBL236926,1 1,9 1,10 1,11 1,12 1,13 1,14 1,15 1,16 1,17 1,51 1,52 4.503}
{0 CHEMBL237130,1 1,9 1,10 1,11 1,12 1,13 1,14 1,15 1,16 1,17 1,51 1,52 5.476}
{0 CHEMBL237131,1 1,9 1,10 1,11 1,12 1,13 1,14 1,15 1,16 1,17 1,51 1,52 5.815}
{0 CHEMBL237132,1 1,9 1,10 1,11 1,12 1,13 1,14 1,15 1,16 1,17 1,51 1,52 5.577}
{0 CHEMBL237348,1 1,9 1,10 1,11 1,12 1,13 1,14 1,15 1,16 1,17 1,51 1,52 5.654}
{0 CHEMBL237350,1 1,9 1,10 1,11 1,12 1,13 1,14 1,15 1,16 1,17 1,51 1,52 6.137}
{0 CHEMBL237560,1 1,9 1,10 1,11 1,12 1,13 1,14 1,15 1,16 1,17 1,51 1,52 6.018}
{0 CHEMBL237561,1 1,9 1,10 1,11 1,12 1,13 1,14 1,15 1,16 1,17 1,51 1,52 5.463}
{0 CHEMBL237562,1 1,9 1,10 1,11 1,12 1,13 1,14 1,15 1,16 1,17 1,51 1,52 4.783}
{0 CHEMBL237779,1 1,9 1,10 1,11 1,12 1,13 1,14 1,15 1,16 1,17 1,51 1,52 5.983}
{0 CHEMBL258515,9 1,10 1,11 1,17 1,41 1,51 1,52 5.975}
{0 CHEMBL259330,9 1,10 1,11 1,17 1,51 1,52 5.611}
{0 CHEMBL259717,1 1,9 1,10 1,11 1,12 1,13 1,14 1,15 1,16 1,17 1,51 1,52 4.321}
{0 CHEMBL259848,9 1,10 1,11 1,17 1,51 1,52 4.148}
{0 CHEMBL259853,9 1,10 1,11 1,17 1,51 1,52 7.227}
{0 CHEMBL259854,9 1,10 1,11 1,17 1,51 1,52 6.876}
{0 CHEMBL260290,9 1,10 1,11 1,17 1,51 1,52 6.54}
{0 CHEMBL260291,9 1,10 1,11 1,17 1,51 1,52 6.828}
{0 CHEMBL260582,9 1,10 1,11 1,17 1,51 1,52 6.883}
{0 CHEMBL261397,1 1,2 1,4 1,9 1,17 1,21 1,52 4.777}
{0 CHEMBL262347,9 1,10 1,11 1,17 1,51 1,52 5.302}
{0 CHEMBL264146,9 1,10 1,11 1,17 1,51 1,52 4.873}
{0 CHEMBL264147,9 1,10 1,11 1,17 1,51 1,52 5.889}
{0 CHEMBL264148,9 1,10 1,11 1,17 1,51 1,52 4.547}
{0 CHEMBL274669,1 1,2 1,3 1,4 1,9 1,10 1,11 1,12 1,17 1,49 1,52 6.824}
{0 CHEMBL27760,1 1,2 1,3 1,4 1,9 1,10 1,11 1,12 1,17 1,49 1,52 8.678}
{0 CHEMBL27943,1 1,9 1,10 1,11 1,12 1,17 1,29 1,52 6.301}
{0 CHEMBL280973,1 1,2 1,3 1,4 1,9 1,10 1,11 1,12 1,17 1,52 8.62}
{0 CHEMBL307429,1 1,2 1,3 1,4 1,7 1,8 1,9 1,12 1,17 1,52 4.328}
{0 CHEMBL345129,1 1,3 1,4 1,8 1,9 1,12 1,17 1,52 6.959}
{0 CHEMBL347184,1 1,2 1,4 1,7 1,9 1,12 1,17 1,52 5.678}
{0 CHEMBL356023,1 1,4 1,9 1,17 1,18 1,42 1,52 4.097}
{0 CHEMBL358442,1 1,2 1,3 1,4 1,8 1,9 1,12 1,17 1,52 5.056}
{0 CHEMBL375376,1 1,4 1,9 1,12 1,17 1,18 1,42 1,49 1,52 4.027}
{0 CHEMBL392038,1 1,9 1,10 1,11 1,12 1,13 1,14 1,15 1,16 1,17 1,51 1,52 5.405}
{0 CHEMBL392251,1 1,9 1,10 1,11 1,12 1,13 1,14 1,15 1,16 1,17 1,51 1,52 5.175}
{0 CHEMBL394426,1 1,9 1,10 1,11 1,12 1,13 1,14 1,15 1,16 1,17 1,51 1,52 5.622}
{0 CHEMBL394672,1 1,9 1,10 1,11 1,12 1,13 1,14 1,15 1,16 1,17 1,51 1,52 5.31}
{0 CHEMBL396565,1 1,9 1,10 1,11 1,12 1,13 1,14 1,15 1,16 1,17 1,51 1,52 5.056}
{0 CHEMBL402477,9 1,10 1,11 1,12 1,17 1,51 1,52 4.609}
{0 CHEMBL403714,9 1,10 1,11 1,17 1,51 1,52 7.523}
{0 CHEMBL405616,9 1,10 1,11 1,17 1,51 1,52 4.658}
{0 CHEMBL406121,9 1,10 1,11 1,17 1,51 1,52 7.142}
{0 CHEMBL406704,9 1,10 1,11 1,17 1,26 1,51 1,52 6.747}
{0 CHEMBL406884,1 1,9 1,10 1,11 1,12 1,13 1,14 1,15 1,16 1,17 1,51 1,52 4.333}
{0 CHEMBL407734,9 1,10 1,11 1,17 1,52 4.301}
{0 CHEMBL407994,1 1,2 1,3 1,4 1,9 1,10 1,11 1,12 1,17 1,52 6.26}
{0 CHEMBL408500,1 1,2 1,4 1,9 1,12 1,17 1,18 1,52 6.523}
{0 CHEMBL413645,1 1,4 1,9 1,12 1,17 1,18 1,42 1,49 1,52 4.745}
{0 CHEMBL421040,1 1,2 1,4 1,9 1,17 1,18 1,44 1,52 5.824}
{0 CHEMBL427852,1 1,9 1,10 1,11 1,12 1,13 1,14 1,15 1,16 1,17 1,51 1,52 6.432}
{0 CHEMBL428551,1 1,9 1,10 1,11 1,12 1,13 1,14 1,15 1,16 1,17 1,51 1,52 5.636}
{0 CHEMBL429079,1 1,9 1,10 1,11 1,12 1,13 1,14 1,15 1,16 1,17 1,51 1,52 6.383}
{0 CHEMBL441134,1 1,9 1,10 1,11 1,12 1,13 1,14 1,15 1,16 1,17 1,51 1,52 6.114}
{0 CHEMBL449940,1 1,2 1,4 1,9 1,17 1,52 4.337}
{0 CHEMBL501385,1 1,3 1,4 1,8 1,9 1,12 1,17 1,52 5.053}
{0 CHEMBL526330,1 1,2 1,4 1,6 1,9 1,17 1,52 6}
{0 CHEMBL574645,1 1,2 1,4 1,9 1,12 1,17 1,18 1,52 6.699}
{0 CHEMBL588026,10 1,11 1,17 1,32 1,52 5}
{0 CHEMBL589341,1 1,2 1,4 1,9 1,10 1,11 1,12 1,17 1,18 1,49 1,52 5.783}
{0 CHEMBL590070,1 1,2 1,4 1,9 1,10 1,11 1,12 1,17 1,18 1,52 6.456}
{0 CHEMBL597035,9 1,10 1,11 1,17 1,52 4.301}
{0 CHEMBL607299,10 1,11 1,17 1,50 1,52 4.301}
{0 CHEMBL62552,1 1,2 1,4 1,9 1,10 1,11 1,12 1,17 1,23 1,40 1,42 1,51 1,52 5.602}
{0 CHEMBL86772,1 1,2 1,4 1,9 1,10 1,11 1,12 1,17 1,51 1,52 5.311}
{0 CHEMBL86865,1 1,2 1,4 1,9 1,10 1,11 1,17 1,21 1,51 1,52 5.43}
{0 CHEMBL87120,1 1,2 1,4 1,9 1,17 1,52 4.505}
{0 CHEMBL88413,1 1,2 1,4 1,9 1,12 1,17 1,52 4.533}
{0 CHEMBL9745,1 1,2 1,4 1,9 1,12 1,17 1,52 7.6}
