{
  "data_set_description": {
    "collection_date": "November 2013",
    "creator": "Dr Jeremy Besnard, Dr Ivan Olier, Dr Noureddin Sadawi, Dr Larisa Soldatova, Dr Crina Grosan, Prof Ross King, Dr Richard Bickerton, Prof Andrew Hopkins and Dr Willem van Hoorn",
    "default_target_attribute": "pXC50",
    "description": "This dataset contains QSAR data (from ChEMBL version 17) showing activity values (unit is pseudo-pCI50) of several compounds on drug target ChEMBL_ID: CHEMBL3777 (TID: 12956), and it has 33 rows and 1252 features (not including molecule IDs and class feature: molecule_id and pXC50). The features represent Molecular Descriptors which were generated from SMILES strings. Missing value imputation was applied to this dataset (By choosing the Median).",
    "description_version": "1",
    "file_id": "3636987",
    "format": "ARFF",
    "id": "38332",
    "licence": "Public",
    "md5_checksum": "4430495eac7f56f8544ea0a770db90ea",
    "minio_url": "https://data.openml.org/datasets/0003/38332/dataset_38332.pq",
    "name": "QSAR-DATASET-FOR-DRUG-TARGET-CHEMBL3777",
    "original_data_url": "https://www.ebi.ac.uk/chembl/target/inspect/CHEMBL3777",
    "parquet_url": "https://data.openml.org/datasets/0003/38332/dataset_38332.pq",
    "processing_date": "2018-10-04 05:51:34",
    "row_id_attribute": "molecule_id",
    "status": "deactivated",
    "tag": [
      "MetaQSAR",
      "study_13"
    ],
    "upload_date": "2016-07-16T03:48:15",
    "url": "https://api.openml.org/data/v1/download/3636987/QSAR-DATASET-FOR-DRUG-TARGET-CHEMBL3777.arff",
    "version": "11",
    "visibility": "public"
  }
}