{
  "data_set_description": {
    "collection_date": "November 2013",
    "creator": "Dr Jeremy Besnard, Dr Ivan Olier, Dr Noureddin Sadawi, Dr Larisa Soldatova, Dr Crina Grosan, Prof Ross King, Dr Richard Bickerton, Prof Andrew Hopkins and Dr Willem van Hoorn",
    "default_target_attribute": "pXC50",
    "description": "This dataset contains QSAR data (from ChEMBL version 17) showing activity values (unit is pseudo-pCI50) of several compounds on drug target ChEMBL_ID: CHEMBL5008 (TID: 101260), and it has 20 rows and 1089 features (not including molecule IDs and class feature: molecule_id and pXC50). The features represent Molecular Descriptors which were generated from SMILES strings. Missing value imputation was applied to this dataset (By choosing the Median).",
    "description_version": "1",
    "file_id": "3636986",
    "format": "ARFF",
    "id": "38331",
    "licence": "Public",
    "md5_checksum": "3593bf43389caabd0b959616de4c31a9",
    "minio_url": "https://data.openml.org/datasets/0003/38331/dataset_38331.pq",
    "name": "QSAR-DATASET-FOR-DRUG-TARGET-CHEMBL5008",
    "original_data_url": "https://www.ebi.ac.uk/chembl/target/inspect/CHEMBL5008",
    "parquet_url": "https://data.openml.org/datasets/0003/38331/dataset_38331.pq",
    "processing_date": "2018-10-04 05:51:34",
    "row_id_attribute": "molecule_id",
    "status": "deactivated",
    "tag": [
      "MetaQSAR",
      "study_13"
    ],
    "upload_date": "2016-07-16T03:48:04",
    "url": "https://api.openml.org/data/v1/download/3636986/QSAR-DATASET-FOR-DRUG-TARGET-CHEMBL5008.arff",
    "version": "12",
    "visibility": "public"
  }
}