{
  "data_set_description": {
    "collection_date": "November 2013",
    "creator": "Dr Jeremy Besnard, Dr Ivan Olier, Dr Noureddin Sadawi, Dr Larisa Soldatova, Dr Crina Grosan, Prof Ross King, Dr Richard Bickerton, Prof Andrew Hopkins and Dr Willem van Hoorn",
    "default_target_attribute": "pXC50",
    "description": "This dataset contains QSAR data (from ChEMBL version 17) showing activity values (unit is pseudo-pCI50) of several compounds on drug target ChEMBL_ID: CHEMBL323 (TID: 12688), and it has 213 rows and 1244 features (not including molecule IDs and class feature: molecule_id and pXC50). The features represent Molecular Descriptors which were generated from SMILES strings. Missing value imputation was applied to this dataset (By choosing the Median).",
    "description_version": "1",
    "file_id": "3636731",
    "format": "ARFF",
    "id": "38318",
    "licence": "Public",
    "md5_checksum": "72f0df5c44005fa2bc4ee6bde28736d2",
    "minio_url": "https://data.openml.org/datasets/0003/38318/dataset_38318.pq",
    "name": "QSAR-DATASET-FOR-DRUG-TARGET-CHEMBL323",
    "original_data_url": "https://www.ebi.ac.uk/chembl/target/inspect/CHEMBL323",
    "parquet_url": "https://data.openml.org/datasets/0003/38318/dataset_38318.pq",
    "processing_date": "2018-10-04 05:52:23",
    "row_id_attribute": "molecule_id",
    "status": "deactivated",
    "tag": [
      "MetaQSAR",
      "study_13"
    ],
    "upload_date": "2016-07-16T03:45:25",
    "url": "https://api.openml.org/data/v1/download/3636731/QSAR-DATASET-FOR-DRUG-TARGET-CHEMBL323.arff",
    "version": "12",
    "visibility": "public"
  }
}