{
  "data_set_description": {
    "collection_date": "November 2013",
    "creator": "Dr Jeremy Besnard, Dr Ivan Olier, Dr Noureddin Sadawi, Dr Larisa Soldatova, Dr Crina Grosan, Prof Ross King, Dr Richard Bickerton, Prof Andrew Hopkins and Dr Willem van Hoorn",
    "default_target_attribute": "pXC50",
    "description": "This dataset contains QSAR data (from ChEMBL version 17) showing activity values (unit is pseudo-pCI50) of several compounds on drug target ChEMBL_ID: CHEMBL3332 (TID: 17024), and it has 373 rows and 43 features (not including molecule IDs and class feature: molecule_id and pXC50). The features represent Basic Molecular Descriptors which were generated from SMILES strings.  Missing value imputation was applied to this dataset (By choosing the Median).",
    "description_version": "1",
    "file_id": "3636334",
    "format": "ARFF",
    "id": "38313",
    "licence": "Public",
    "md5_checksum": "57448230697ca6033f8067b9ff583b6e",
    "minio_url": "https://data.openml.org/datasets/0003/38313/dataset_38313.pq",
    "name": "QSAR-DATASET-FOR-DRUG-TARGET-CHEMBL3332",
    "original_data_url": "https://www.ebi.ac.uk/chembl/target/inspect/CHEMBL3332",
    "parquet_url": "https://data.openml.org/datasets/0003/38313/dataset_38313.pq",
    "processing_date": "2018-10-04 06:00:58",
    "row_id_attribute": "molecule_id",
    "status": "deactivated",
    "tag": [
      "MetaQSAR",
      "study_13"
    ],
    "upload_date": "2016-07-16T03:43:59",
    "url": "https://api.openml.org/data/v1/download/3636334/QSAR-DATASET-FOR-DRUG-TARGET-CHEMBL3332.arff",
    "version": "12",
    "visibility": "public"
  }
}