"molecule_id","AMW","C.","pXC50"
{1 9.289,2 48,3 5.167}
{0 CHEMBL184510,1 9.539,2 47.1,3 6}
{0 CHEMBL186054,1 8.295,2 42.9,3 5.824}
{0 CHEMBL186101,1 7.91,2 45,3 5.745}
{0 CHEMBL187081,1 8.378,2 44.7,3 5.886}
{0 CHEMBL188665,1 10.562,2 45.9,3 6}
{0 CHEMBL189343,1 9.584,2 48.9,3 5.553}
{0 CHEMBL258081,1 9.051,2 46.9,3 5.495}
{0 CHEMBL263448,1 9.201,2 48.9,3 5.678}
{0 CHEMBL359554,1 8.481,2 47.1,3 5.538}
{0 CHEMBL360206,1 9.424,2 43.9,3 5.921}
{0 CHEMBL360408,1 8.283,2 50,3 5.796}
{0 CHEMBL361697,1 10.506,2 47.1,3 6}
{0 CHEMBL361894,1 8.659,2 45,3 6.097}
{0 CHEMBL364197,1 8.818,2 48.9,3 5.469}
{0 CHEMBL434158,1 8.053,2 48.9,3 5.444}
{0 CHEMBL439850,1 9.1,2 50,3 5.377}
