"molecule_id","FCFP4_1024b319","FCFP4_1024b57","FCFP4_1024b33","FCFP4_1024b649","FCFP4_1024b152","FCFP4_1024b298","FCFP4_1024b354","FCFP4_1024b142","FCFP4_1024b513","FCFP4_1024b294","FCFP4_1024b731","FCFP4_1024b612","FCFP4_1024b524","FCFP4_1024b585","FCFP4_1024b409","FCFP4_1024b17","FCFP4_1024b792","FCFP4_1024b911","FCFP4_1024b50","FCFP4_1024b359","FCFP4_1024b162","FCFP4_1024b87","FCFP4_1024b594","FCFP4_1024b853","FCFP4_1024b816","FCFP4_1024b453","FCFP4_1024b106","FCFP4_1024b499","FCFP4_1024b672","FCFP4_1024b281","FCFP4_1024b985","FCFP4_1024b536","FCFP4_1024b170","FCFP4_1024b689","FCFP4_1024b580","FCFP4_1024b312","FCFP4_1024b145","FCFP4_1024b860","FCFP4_1024b641","FCFP4_1024b327","FCFP4_1024b861","FCFP4_1024b509","FCFP4_1024b10","FCFP4_1024b135","FCFP4_1024b676","FCFP4_1024b476","FCFP4_1024b507","FCFP4_1024b817","FCFP4_1024b1","FCFP4_1024b100","FCFP4_1024b1000","FCFP4_1024b1001","FCFP4_1024b1002","FCFP4_1024b1003","FCFP4_1024b1004","FCFP4_1024b1005","FCFP4_1024b1006","FCFP4_1024b1007","FCFP4_1024b1008","FCFP4_1024b1009","FCFP4_1024b101","FCFP4_1024b1010","FCFP4_1024b1011","FCFP4_1024b1012","FCFP4_1024b1013","FCFP4_1024b1014","FCFP4_1024b1015","FCFP4_1024b1016","FCFP4_1024b1017","FCFP4_1024b1018","FCFP4_1024b1019","FCFP4_1024b102","FCFP4_1024b1020","FCFP4_1024b1021","FCFP4_1024b1022","FCFP4_1024b1023","FCFP4_1024b1024","FCFP4_1024b103","FCFP4_1024b104","FCFP4_1024b105","FCFP4_1024b107","FCFP4_1024b108","FCFP4_1024b109","FCFP4_1024b11","FCFP4_1024b110","FCFP4_1024b111","FCFP4_1024b112","FCFP4_1024b113","FCFP4_1024b114","FCFP4_1024b115","FCFP4_1024b116","FCFP4_1024b117","FCFP4_1024b118","FCFP4_1024b119","FCFP4_1024b12","FCFP4_1024b120","FCFP4_1024b121","FCFP4_1024b122","FCFP4_1024b123","FCFP4_1024b124","FCFP4_1024b125","FCFP4_1024b126","FCFP4_1024b127","FCFP4_1024b128","FCFP4_1024b129","FCFP4_1024b13","FCFP4_1024b130","FCFP4_1024b131","FCFP4_1024b132","FCFP4_1024b133","FCFP4_1024b134","FCFP4_1024b136","FCFP4_1024b137","FCFP4_1024b138","FCFP4_1024b139","FCFP4_1024b14","FCFP4_1024b140","FCFP4_1024b141","FCFP4_1024b143","FCFP4_1024b144","FCFP4_1024b146","FCFP4_1024b147","FCFP4_1024b148","FCFP4_1024b149","FCFP4_1024b15","FCFP4_1024b150","FCFP4_1024b151","FCFP4_1024b153","FCFP4_1024b154","FCFP4_1024b155","FCFP4_1024b156","FCFP4_1024b157","FCFP4_1024b158","FCFP4_1024b159","FCFP4_1024b16","FCFP4_1024b160","FCFP4_1024b161","FCFP4_1024b163","FCFP4_1024b164","FCFP4_1024b165","FCFP4_1024b166","FCFP4_1024b167","FCFP4_1024b168","FCFP4_1024b169","FCFP4_1024b171","FCFP4_1024b172","FCFP4_1024b173","FCFP4_1024b174","FCFP4_1024b175","FCFP4_1024b176","FCFP4_1024b177","FCFP4_1024b178","FCFP4_1024b179","FCFP4_1024b18","FCFP4_1024b180","FCFP4_1024b181","FCFP4_1024b182","FCFP4_1024b183","FCFP4_1024b184","FCFP4_1024b185","FCFP4_1024b186","FCFP4_1024b187","FCFP4_1024b188","FCFP4_1024b189","FCFP4_1024b19","FCFP4_1024b190","FCFP4_1024b191","FCFP4_1024b192","FCFP4_1024b193","FCFP4_1024b194","FCFP4_1024b195","FCFP4_1024b196","FCFP4_1024b197","FCFP4_1024b198","FCFP4_1024b199","FCFP4_1024b2","FCFP4_1024b20","FCFP4_1024b200","FCFP4_1024b201","FCFP4_1024b202","FCFP4_1024b203","FCFP4_1024b204","FCFP4_1024b205","FCFP4_1024b206","FCFP4_1024b207","FCFP4_1024b208","FCFP4_1024b209","FCFP4_1024b21","FCFP4_1024b210","FCFP4_1024b211","FCFP4_1024b212","FCFP4_1024b213","FCFP4_1024b214","FCFP4_1024b215","FCFP4_1024b216","FCFP4_1024b217","FCFP4_1024b218","FCFP4_1024b219","FCFP4_1024b22","FCFP4_1024b220","FCFP4_1024b221","FCFP4_1024b222","FCFP4_1024b223","FCFP4_1024b224","FCFP4_1024b225","pXC50"
{1 1,2 1,3 1,4 1,5 1,16 1,30 1,33 1,49 1,81 1,115 1,152 1,176 1,206 5.174}
{0 CHEMBL106088,1 1,2 1,3 1,6 1,9 1,11 1,15 1,16 1,20 1,22 1,23 1,33 1,35 1,37 1,39 1,41 1,49 1,58 1,73 1,152 1,154 1,176 1,206 5.319}
{0 CHEMBL10656,16 1,33 1,49 1,197 1,206 6.921}
{0 CHEMBL10668,3 1,16 1,33 1,49 1,197 1,202 1,206 6.367}
{0 CHEMBL10704,3 1,16 1,33 1,49 1,197 1,206 7.481}
{0 CHEMBL10705,16 1,33 1,49 1,176 1,189 1,197 1,206 6.523}
{0 CHEMBL10710,16 1,33 1,49 1,111 1,152 1,197 1,206 7.699}
{0 CHEMBL10736,3 1,16 1,33 1,49 1,197 1,206 7.921}
{0 CHEMBL10861,5 1,16 1,33 1,49 1,176 1,197 1,206 4.947}
{0 CHEMBL109207,1 1,2 1,3 1,6 1,9 1,11 1,15 1,16 1,25 1,33 1,40 1,46 1,49 1,58 1,154 1,206 5.339}
{0 CHEMBL11068,16 1,33 1,49 1,197 1,206 5.959}
{0 CHEMBL110799,6 1,9 1,15 1,16 1,22 1,33 1,37 1,48 1,152 1,154 1,176 1,181 1,206 5}
{0 CHEMBL11118,16 1,33 1,49 1,197 1,206 6.932}
{0 CHEMBL11172,16 1,33 1,49 1,154 1,197 1,206 6.009}
{0 CHEMBL112014,1 1,2 1,3 1,6 1,9 1,15 1,16 1,22 1,33 1,37 1,40 1,58 1,154 1,181 1,206 4.114}
{0 CHEMBL112193,1 1,2 1,3 1,6 1,9 1,11 1,15 1,16 1,25 1,33 1,40 1,46 1,49 1,58 1,154 1,206 5.83}
{0 CHEMBL112386,1 1,2 1,3 1,6 1,9 1,15 1,16 1,33 1,40 1,46 1,58 1,154 1,206 5.155}
{0 CHEMBL112431,1 1,2 1,3 1,6 1,9 1,15 1,16 1,33 1,40 1,46 1,58 1,154 1,206 5}
{0 CHEMBL11295,15 1,16 1,33 1,43 1,49 1,129 1,197 1,206 6.015}
{0 CHEMBL113107,1 1,2 1,3 1,6 1,16 1,18 1,22 1,33 1,40 1,58 1,154 1,161 1,206 5}
{0 CHEMBL113270,1 1,2 1,3 1,6 1,9 1,11 1,15 1,16 1,25 1,33 1,40 1,46 1,49 1,58 1,154 1,206 5.407}
{0 CHEMBL113588,6 1,9 1,15 1,16 1,22 1,33 1,37 1,48 1,152 1,154 1,176 1,181 1,206 5}
{0 CHEMBL113992,1 1,2 1,3 1,4 1,16 1,33 1,49 1,52 1,57 1,58 1,115 1,152 1,154 1,176 1,206 4}
{0 CHEMBL114139,1 1,2 1,3 1,4 1,5 1,16 1,30 1,33 1,41 1,49 1,81 1,115 1,116 1,140 1,152 1,176 1,206 5.652}
{0 CHEMBL114361,1 1,2 1,3 1,4 1,5 1,16 1,30 1,33 1,49 1,81 1,115 1,116 1,140 1,152 1,176 1,206 5.879}
{0 CHEMBL114498,1 1,2 1,3 1,4 1,6 1,16 1,18 1,22 1,33 1,58 1,115 1,154 1,161 1,206 5}
{0 CHEMBL114513,1 1,2 1,3 1,4 1,5 1,16 1,30 1,33 1,49 1,81 1,115 1,140 1,152 1,176 1,206 4}
{0 CHEMBL114610,1 1,2 1,3 1,4 1,7 1,14 1,16 1,27 1,33 1,58 1,113 1,154 1,162 1,206 7.886}
{0 CHEMBL115023,1 1,2 1,3 1,4 1,5 1,16 1,30 1,33 1,49 1,80 1,81 1,115 1,116 1,152 1,176 1,206 5.597}
{0 CHEMBL115024,1 1,2 1,3 1,4 1,5 1,16 1,30 1,33 1,49 1,81 1,115 1,116 1,152 1,176 1,206 5.429}
{0 CHEMBL115245,1 1,2 1,3 1,4 1,5 1,16 1,30 1,33 1,49 1,80 1,81 1,82 1,115 1,116 1,152 1,176 1,206 4.907}
{0 CHEMBL116156,1 1,2 1,3 1,4 1,5 1,16 1,22 1,30 1,33 1,49 1,81 1,115 1,116 1,152 1,176 1,206 5.735}
{0 CHEMBL116357,5 1,16 1,26 1,30 1,33 1,49 1,81 1,116 1,140 1,152 1,176 1,206 4.544}
{0 CHEMBL116384,1 1,2 1,3 1,4 1,5 1,16 1,30 1,33 1,49 1,81 1,115 1,140 1,152 1,176 1,206 4}
{0 CHEMBL116732,1 1,2 1,3 1,4 1,5 1,16 1,30 1,33 1,49 1,81 1,115 1,140 1,152 1,176 1,206 4}
{0 CHEMBL116733,1 1,2 1,3 1,4 1,7 1,14 1,16 1,26 1,27 1,33 1,58 1,73 1,113 1,154 1,169 1,206 6.678}
{0 CHEMBL116814,1 1,2 1,3 1,4 1,7 1,14 1,16 1,27 1,33 1,58 1,113 1,152 1,154 1,176 1,206 6.066}
{0 CHEMBL116915,1 1,2 1,3 1,4 1,16 1,33 1,49 1,52 1,57 1,58 1,115 1,152 1,154 1,176 1,206 4.025}
{0 CHEMBL116921,1 1,2 1,3 1,4 1,5 1,16 1,30 1,33 1,49 1,81 1,115 1,140 1,152 1,176 1,186 1,206 4}
{0 CHEMBL117627,1 1,2 1,3 1,4 1,5 1,12 1,14 1,16 1,17 1,26 1,27 1,30 1,33 1,39 1,49 1,73 1,81 1,82 1,96 1,169 1,175 1,176 1,177 1,206 8.9}
{0 CHEMBL117691,1 1,2 1,3 1,4 1,5 1,12 1,14 1,16 1,17 1,26 1,27 1,30 1,33 1,39 1,49 1,81 1,82 1,96 1,175 1,176 1,177 1,206 8.8}
{0 CHEMBL11803,1 1,2 1,3 1,4 1,7 1,16 1,31 1,33 1,43 1,49 1,115 1,176 1,203 1,206 6}
{0 CHEMBL121771,16 1,33 1,43 1,49 1,115 1,152 1,154 1,176 1,198 1,206 5.854}
{0 CHEMBL121886,1 1,2 1,3 1,16 1,33 1,43 1,49 1,58 1,73 1,115 1,154 1,198 1,206 4}
{0 CHEMBL121887,16 1,33 1,43 1,48 1,49 1,73 1,115 1,154 1,198 1,206 4}
{0 CHEMBL122054,16 1,33 1,43 1,49 1,107 1,152 1,154 1,176 1,177 1,198 1,206 6.032}
{0 CHEMBL122082,16 1,33 1,43 1,49 1,115 1,152 1,154 1,176 1,198 1,206 5.301}
{0 CHEMBL122228,16 1,33 1,43 1,49 1,135 1,154 1,157 1,198 1,206 5}
{0 CHEMBL122313,16 1,33 1,43 1,49 1,152 1,154 1,176 1,177 1,198 1,206 6.032}
{0 CHEMBL122811,16 1,33 1,43 1,48 1,49 1,154 1,157 1,198 1,206 4}
{0 CHEMBL122997,16 1,33 1,48 1,49 1,81 1,154 1,206 5.886}
{0 CHEMBL123087,16 1,33 1,43 1,48 1,49 1,154 1,157 1,198 1,206 4}
{0 CHEMBL123196,16 1,33 1,152 1,154 1,176 1,206 6.161}
{0 CHEMBL123228,16 1,33 1,43 1,48 1,49 1,115 1,154 1,198 1,206 4}
{0 CHEMBL123259,16 1,33 1,43 1,49 1,115 1,152 1,154 1,176 1,198 1,206 4.699}
{0 CHEMBL123323,16 1,33 1,43 1,49 1,115 1,152 1,154 1,176 1,198 1,206 5}
{0 CHEMBL123766,1 1,2 1,3 1,16 1,33 1,49 1,58 1,78 1,154 1,198 1,206 6}
{0 CHEMBL123885,16 1,33 1,49 1,154 1,206 5.229}
{0 CHEMBL124104,3 1,6 1,14 1,16 1,24 1,25 1,33 1,49 1,81 1,152 1,154 1,176 1,206 6.208}
{0 CHEMBL124607,16 1,33 1,43 1,49 1,73 1,115 1,152 1,154 1,176 1,198 1,206 4}
{0 CHEMBL125054,16 1,33 1,43 1,49 1,113 1,154 1,157 1,198 1,206 5.854}
{0 CHEMBL125159,1 1,2 1,3 1,16 1,33 1,43 1,49 1,58 1,154 1,157 1,198 1,206 5.398}
{0 CHEMBL125484,1 1,2 1,3 1,16 1,33 1,43 1,49 1,58 1,115 1,154 1,198 1,206 5}
{0 CHEMBL125536,1 1,2 1,3 1,16 1,33 1,43 1,49 1,58 1,154 1,177 1,198 1,206 5}
{0 CHEMBL126006,1 1,2 1,3 1,16 1,33 1,43 1,49 1,58 1,115 1,154 1,198 1,206 6.208}
{0 CHEMBL128824,1 1,2 1,3 1,6 1,9 1,11 1,15 1,16 1,20 1,22 1,23 1,33 1,35 1,40 1,41 1,48 1,49 1,115 1,145 1,152 1,154 1,176 1,206 5.319}
{0 CHEMBL131012,1 1,2 1,3 1,6 1,9 1,11 1,15 1,16 1,20 1,22 1,23 1,33 1,35 1,36 1,37 1,41 1,49 1,58 1,152 1,154 1,176 1,206 4.721}
{0 CHEMBL131258,1 1,2 1,3 1,6 1,16 1,30 1,33 1,35 1,41 1,49 1,81 1,121 1,142 1,152 1,154 1,176 1,206 4.975}
{0 CHEMBL131309,1 1,2 1,3 1,6 1,16 1,30 1,33 1,40 1,49 1,81 1,121 1,154 1,176 1,187 1,206 6.796}
{0 CHEMBL131567,32 1,49 1,176 1,206 5.886}
{0 CHEMBL131614,1 1,2 1,3 1,6 1,16 1,30 1,33 1,49 1,81 1,121 1,154 1,176 1,206 5.086}
{0 CHEMBL131766,1 1,2 1,3 1,6 1,16 1,30 1,33 1,49 1,81 1,96 1,110 1,121 1,154 1,176 1,206 5.081}
{0 CHEMBL132501,1 1,2 1,3 1,4 1,12 1,16 1,33 1,39 1,49 1,52 1,96 1,115 1,175 1,176 1,177 1,206 6.959}
{0 CHEMBL13260,16 1,33 1,36 1,96 1,110 1,152 1,154 1,176 1,206 4.432}
{0 CHEMBL13378,6 1,15 1,16 1,49 1,154 1,176 1,206 4}
{0 CHEMBL134913,1 1,2 1,3 1,4 1,7 1,16 1,33 1,49 1,58 1,95 1,154 1,198 1,206 6.62}
{0 CHEMBL135030,1 1,2 1,3 1,4 1,7 1,16 1,33 1,49 1,58 1,95 1,154 1,198 1,206 6.215}
{0 CHEMBL136089,1 1,2 1,3 1,16 1,33 1,40 1,58 1,154 1,206 5.616}
{0 CHEMBL136091,1 1,2 1,3 1,4 1,16 1,33 1,58 1,101 1,152 1,154 1,176 1,206 6.292}
{0 CHEMBL136162,1 1,2 1,3 1,16 1,33 1,40 1,58 1,101 1,152 1,154 1,176 1,206 6.509}
{0 CHEMBL136299,1 1,2 1,3 1,16 1,33 1,40 1,58 1,154 1,206 6.444}
{0 CHEMBL136314,16 1,33 1,48 1,101 1,152 1,154 1,176 1,206 4.762}
{0 CHEMBL136315,1 1,2 1,3 1,16 1,33 1,40 1,58 1,145 1,154 1,206 5.257}
{0 CHEMBL136351,1 1,2 1,3 1,16 1,33 1,49 1,95 1,101 1,152 1,154 1,176 1,206 7.432}
{0 CHEMBL136377,1 1,2 1,3 1,4 1,16 1,33 1,48 1,58 1,115 1,154 1,206 5.625}
{0 CHEMBL136407,1 1,2 1,3 1,7 1,16 1,33 1,49 1,56 1,73 1,95 1,154 1,206 4.523}
{0 CHEMBL136414,1 1,2 1,3 1,16 1,33 1,40 1,58 1,101 1,152 1,154 1,176 1,206 8.125}
{0 CHEMBL136439,1 1,2 1,3 1,16 1,33 1,40 1,58 1,73 1,154 1,206 7.301}
{0 CHEMBL136501,1 1,2 1,3 1,4 1,5 1,16 1,30 1,33 1,49 1,58 1,81 1,115 1,154 1,170 1,176 1,206 6.666}
{0 CHEMBL136537,1 1,2 1,3 1,16 1,33 1,40 1,58 1,145 1,154 1,206 5.747}
{0 CHEMBL136539,1 1,2 1,3 1,5 1,16 1,18 1,30 1,33 1,40 1,49 1,81 1,107 1,114 1,164 1,176 1,206 7.377}
{0 CHEMBL136555,1 1,2 1,3 1,16 1,33 1,58 1,101 1,152 1,154 1,176 1,206 7.377}
{0 CHEMBL136638,1 1,2 1,3 1,7 1,16 1,33 1,49 1,56 1,95 1,154 1,206 5.991}
{0 CHEMBL136692,1 1,2 1,3 1,16 1,33 1,40 1,58 1,154 1,206 5.317}
{0 CHEMBL136763,1 1,2 1,3 1,5 1,7 1,16 1,30 1,33 1,39 1,49 1,81 1,95 1,107 1,114 1,164 1,176 1,206 5}
{0 CHEMBL136773,1 1,2 1,3 1,4 1,7 1,16 1,33 1,49 1,58 1,95 1,154 1,198 1,206 5.47}
{0 CHEMBL136774,1 1,2 1,3 1,16 1,33 1,49 1,58 1,95 1,154 1,206 5.597}
{0 CHEMBL136791,1 1,2 1,3 1,4 1,14 1,16 1,33 1,49 1,58 1,79 1,115 1,154 1,176 1,206 7.616}
{0 CHEMBL136833,1 1,2 1,3 1,16 1,33 1,40 1,58 1,101 1,152 1,154 1,176 1,206 7.699}
{0 CHEMBL136859,3 1,16 1,33 1,49 1,71 1,95 1,154 1,198 1,206 6.347}
{0 CHEMBL136860,1 1,2 1,3 1,7 1,16 1,33 1,49 1,56 1,95 1,101 1,114 1,152 1,154 1,176 1,206 4.523}
{0 CHEMBL137509,3 1,5 1,7 1,16 1,26 1,30 1,33 1,49 1,73 1,81 1,113 1,154 1,176 1,206 6.556}
{0 CHEMBL137772,1 1,2 1,3 1,16 1,33 1,40 1,58 1,73 1,154 1,206 7.229}
{0 CHEMBL138159,1 1,2 1,3 1,4 1,5 1,7 1,16 1,26 1,30 1,33 1,49 1,58 1,73 1,81 1,113 1,115 1,154 1,176 1,206 7.377}
{0 CHEMBL138208,1 1,2 1,3 1,4 1,5 1,7 1,16 1,26 1,30 1,33 1,49 1,58 1,73 1,81 1,113 1,115 1,154 1,176 1,206 7.86}
{0 CHEMBL138491,7 1,16 1,33 1,43 1,73 1,113 1,154 1,176 1,206 6}
{0 CHEMBL138831,1 1,2 1,3 1,16 1,33 1,48 1,101 1,115 1,152 1,154 1,176 1,206 5.879}
{0 CHEMBL138936,1 1,2 1,3 1,16 1,33 1,40 1,58 1,101 1,152 1,154 1,176 1,206 7.398}
{0 CHEMBL138941,1 1,2 1,3 1,5 1,16 1,30 1,33 1,40 1,49 1,81 1,107 1,114 1,164 1,176 1,206 5.921}
{0 CHEMBL138945,1 1,2 1,3 1,16 1,33 1,40 1,58 1,101 1,152 1,154 1,176 1,206 7.721}
{0 CHEMBL139009,1 1,2 1,3 1,4 1,7 1,16 1,33 1,49 1,58 1,73 1,113 1,115 1,154 1,176 1,206 7.322}
{0 CHEMBL139060,1 1,2 1,3 1,5 1,16 1,30 1,33 1,40 1,49 1,73 1,81 1,107 1,114 1,164 1,176 1,206 6.357}
{0 CHEMBL139067,1 1,2 1,3 1,16 1,33 1,49 1,58 1,95 1,154 1,206 6.585}
{0 CHEMBL139314,1 1,2 1,3 1,4 1,5 1,14 1,16 1,30 1,33 1,39 1,49 1,81 1,107 1,114 1,164 1,176 1,206 5}
{0 CHEMBL139694,1 1,2 1,3 1,16 1,33 1,40 1,58 1,154 1,206 6.678}
{0 CHEMBL139695,1 1,2 1,3 1,16 1,33 1,40 1,49 1,58 1,95 1,154 1,198 1,206 6.721}
{0 CHEMBL139982,1 1,2 1,3 1,4 1,5 1,7 1,16 1,18 1,26 1,30 1,33 1,49 1,58 1,73 1,81 1,113 1,115 1,154 1,176 1,206 8.149}
{0 CHEMBL140131,1 1,2 1,3 1,16 1,33 1,49 1,95 1,145 1,154 1,206 6.721}
{0 CHEMBL140296,1 1,2 1,3 1,7 1,16 1,33 1,49 1,56 1,95 1,154 1,206 6.284}
{0 CHEMBL141284,1 1,2 1,3 1,4 1,12 1,14 1,16 1,27 1,33 1,39 1,49 1,52 1,96 1,175 1,176 1,177 1,206 6.569}
{0 CHEMBL141754,1 1,2 1,3 1,4 1,12 1,16 1,33 1,39 1,49 1,81 1,96 1,115 1,147 1,175 1,176 1,177 1,206 5.523}
{0 CHEMBL142577,16 1,33 1,43 1,49 1,136 1,154 1,206 6.235}
{0 CHEMBL143325,1 1,2 1,3 1,4 1,12 1,14 1,16 1,27 1,33 1,39 1,49 1,81 1,96 1,147 1,175 1,176 1,177 1,192 1,206 4.77}
{0 CHEMBL143519,5 1,16 1,30 1,33 1,49 1,81 1,176 1,178 1,206 6.328}
{0 CHEMBL143897,1 1,2 1,3 1,4 1,5 1,12 1,14 1,16 1,27 1,30 1,33 1,39 1,49 1,81 1,96 1,147 1,175 1,176 1,177 1,192 1,206 6.77}
{0 CHEMBL144064,1 1,2 1,3 1,4 1,7 1,16 1,33 1,49 1,58 1,113 1,154 1,176 1,198 1,206 7.398}
{0 CHEMBL144365,5 1,16 1,19 1,28 1,33 1,49 1,152 1,154 1,176 1,198 1,206 7.398}
{0 CHEMBL144640,1 1,2 1,3 1,4 1,7 1,16 1,33 1,49 1,58 1,154 1,176 1,198 1,206 7.222}
{0 CHEMBL144724,16 1,33 1,49 1,67 1,104 1,152 1,154 1,176 1,198 1,206 6.699}
{0 CHEMBL145606,1 1,2 1,3 1,4 1,5 1,7 1,16 1,19 1,28 1,33 1,49 1,58 1,104 1,154 1,176 1,198 1,206 7.523}
{0 CHEMBL146119,16 1,26 1,33 1,49 1,81 1,104 1,152 1,154 1,176 1,198 1,206 7.523}
{0 CHEMBL146827,1 1,2 1,3 1,4 1,5 1,7 1,16 1,19 1,28 1,33 1,49 1,58 1,115 1,154 1,176 1,198 1,206 7.398}
{0 CHEMBL146836,16 1,26 1,33 1,49 1,81 1,152 1,154 1,176 1,198 1,206 6.046}
{0 CHEMBL147146,16 1,33 1,49 1,152 1,154 1,176 1,198 1,206 6.824}
{0 CHEMBL147593,1 1,2 1,3 1,4 1,7 1,16 1,33 1,49 1,58 1,71 1,95 1,154 1,176 1,198 1,206 5}
{0 CHEMBL147708,1 1,2 1,3 1,4 1,5 1,7 1,16 1,33 1,49 1,58 1,154 1,176 1,197 1,198 1,206 7.301}
{0 CHEMBL147717,16 1,33 1,49 1,152 1,154 1,176 1,198 1,206 6.201}
{0 CHEMBL147729,1 1,2 1,3 1,4 1,5 1,7 1,16 1,33 1,49 1,58 1,154 1,176 1,186 1,198 1,206 5.398}
{0 CHEMBL147855,1 1,2 1,3 1,4 1,5 1,7 1,16 1,19 1,28 1,33 1,49 1,58 1,152 1,154 1,176 1,198 1,206 7.398}
{0 CHEMBL147894,1 1,2 1,3 1,4 1,5 1,7 1,16 1,19 1,28 1,33 1,49 1,58 1,154 1,176 1,198 1,206 8}
{0 CHEMBL147895,1 1,2 1,3 1,4 1,5 1,7 1,16 1,19 1,28 1,33 1,49 1,58 1,154 1,176 1,198 1,206 8}
{0 CHEMBL147952,1 1,2 1,3 1,4 1,5 1,7 1,16 1,33 1,49 1,58 1,145 1,154 1,176 1,198 1,206 7.398}
{0 CHEMBL148174,16 1,33 1,49 1,152 1,154 1,176 1,198 1,206 7.398}
{0 CHEMBL148200,1 1,2 1,3 1,4 1,7 1,16 1,33 1,49 1,58 1,154 1,176 1,180 1,198 1,206 5.824}
{0 CHEMBL148220,1 1,2 1,3 1,4 1,5 1,7 1,16 1,19 1,28 1,33 1,49 1,58 1,130 1,154 1,176 1,198 1,206 5.409}
{0 CHEMBL148223,1 1,2 1,3 1,4 1,5 1,7 1,16 1,19 1,28 1,33 1,49 1,58 1,104 1,154 1,176 1,198 1,206 7.301}
{0 CHEMBL149492,1 1,2 1,3 1,4 1,5 1,7 1,16 1,33 1,49 1,58 1,80 1,154 1,176 1,198 1,206 6.066}
{0 CHEMBL159896,1 1,2 1,3 1,4 1,5 1,7 1,12 1,16 1,21 1,26 1,30 1,33 1,39 1,49 1,81 1,96 1,162 1,175 1,176 1,177 1,204 1,206 8.119}
{0 CHEMBL159899,1 1,2 1,3 1,16 1,33 1,43 1,49 1,58 1,136 1,154 1,176 1,177 1,206 6.076}
{0 CHEMBL159906,1 1,2 1,3 1,4 1,16 1,33 1,49 1,58 1,81 1,82 1,115 1,154 1,170 1,206 4}
{0 CHEMBL161406,1 1,2 1,3 1,4 1,5 1,7 1,12 1,16 1,18 1,21 1,26 1,30 1,31 1,33 1,39 1,49 1,81 1,96 1,162 1,175 1,176 1,177 1,204 1,206 7.481}
{0 CHEMBL162177,5 1,49 1,176 1,186 1,206 4}
{0 CHEMBL162442,32 1,49 1,176 1,206 4.824}
{0 CHEMBL162693,1 1,2 1,3 1,4 1,5 1,7 1,12 1,16 1,21 1,26 1,30 1,33 1,39 1,49 1,81 1,96 1,162 1,175 1,176 1,177 1,204 1,206 7.745}
{0 CHEMBL162708,1 1,2 1,3 1,5 1,16 1,18 1,29 1,30 1,33 1,40 1,49 1,81 1,114 1,176 1,202 1,206 4}
{0 CHEMBL163646,1 1,2 1,3 1,4 1,5 1,14 1,16 1,31 1,33 1,49 1,58 1,115 1,154 1,176 1,206 5.509}
{0 CHEMBL163647,1 1,2 1,3 1,4 1,14 1,16 1,33 1,49 1,58 1,104 1,115 1,154 1,176 1,206 4}
{0 CHEMBL164085,1 1,2 1,3 1,4 1,5 1,16 1,30 1,33 1,43 1,49 1,58 1,81 1,115 1,154 1,155 1,157 1,170 1,176 1,186 1,206 4.602}
{0 CHEMBL164184,1 1,2 1,3 1,4 1,14 1,15 1,16 1,25 1,31 1,33 1,43 1,49 1,58 1,115 1,154 1,176 1,206 5.921}
{0 CHEMBL164295,1 1,2 1,3 1,4 1,5 1,16 1,30 1,33 1,49 1,58 1,81 1,115 1,154 1,170 1,176 1,206 4.833}
{0 CHEMBL164342,1 1,2 1,3 1,4 1,6 1,11 1,16 1,33 1,49 1,58 1,115 1,154 1,177 1,206 5.456}
{0 CHEMBL164669,1 1,2 1,3 1,5 1,16 1,18 1,29 1,30 1,33 1,40 1,49 1,72 1,81 1,114 1,176 1,206 4.018}
{0 CHEMBL164785,32 1,49 1,176 1,206 4}
{0 CHEMBL164831,1 1,2 1,3 1,4 1,5 1,16 1,21 1,30 1,33 1,49 1,58 1,81 1,115 1,154 1,170 1,176 1,206 5.959}
{0 CHEMBL164930,1 1,2 1,3 1,4 1,15 1,16 1,33 1,43 1,49 1,58 1,115 1,129 1,154 1,177 1,206 6.125}
{0 CHEMBL165149,1 1,2 1,3 1,4 1,14 1,15 1,16 1,25 1,31 1,33 1,43 1,49 1,58 1,115 1,154 1,176 1,206 5.328}
{0 CHEMBL165187,1 1,2 1,3 1,4 1,16 1,33 1,49 1,58 1,115 1,154 1,177 1,206 4}
{0 CHEMBL165324,6 1,9 1,15 1,16 1,22 1,33 1,37 1,48 1,154 1,181 1,206 4}
{0 CHEMBL165360,1 1,2 1,3 1,4 1,16 1,33 1,49 1,58 1,81 1,115 1,154 1,170 1,206 5.699}
{0 CHEMBL165371,1 1,2 1,3 1,4 1,14 1,16 1,31 1,33 1,49 1,58 1,115 1,154 1,176 1,206 7.62}
{0 CHEMBL165378,1 1,2 1,3 1,4 1,14 1,16 1,31 1,33 1,49 1,58 1,115 1,154 1,176 1,206 5.553}
{0 CHEMBL165383,1 1,2 1,3 1,4 1,16 1,33 1,58 1,73 1,115 1,154 1,176 1,206 6.377}
{0 CHEMBL165449,1 1,2 1,3 1,4 1,5 1,16 1,33 1,49 1,58 1,115 1,137 1,154 1,176 1,177 1,206 6.721}
{0 CHEMBL165463,5 1,16 1,26 1,30 1,33 1,49 1,81 1,82 1,96 1,175 1,176 1,177 1,206 5.94}
{0 CHEMBL165845,1 1,2 1,3 1,4 1,14 1,16 1,31 1,33 1,49 1,58 1,115 1,154 1,176 1,206 4.936}
{0 CHEMBL165945,32 1,49 1,176 1,206 4.066}
{0 CHEMBL166034,1 1,2 1,3 1,4 1,16 1,33 1,49 1,52 1,57 1,58 1,115 1,152 1,154 1,176 1,177 1,206 5.959}
{0 CHEMBL166246,1 1,2 1,3 1,4 1,5 1,16 1,30 1,33 1,49 1,58 1,81 1,115 1,154 1,170 1,175 1,176 1,206 6.237}
{0 CHEMBL166326,1 1,2 1,3 1,4 1,16 1,33 1,49 1,58 1,85 1,115 1,154 1,176 1,206 4}
{0 CHEMBL166426,1 1,2 1,3 1,4 1,14 1,16 1,27 1,33 1,49 1,58 1,154 1,176 1,206 5.152}
{0 CHEMBL166454,1 1,2 1,3 1,5 1,16 1,26 1,30 1,33 1,49 1,65 1,81 1,82 1,96 1,97 1,175 1,176 1,177 1,206 7.95}
{0 CHEMBL166552,1 1,2 1,3 1,4 1,5 1,12 1,14 1,16 1,17 1,26 1,27 1,30 1,33 1,39 1,49 1,81 1,82 1,96 1,153 1,175 1,176 1,177 1,206 8.4}
{0 CHEMBL166894,5 1,16 1,26 1,30 1,33 1,49 1,81 1,82 1,96 1,158 1,175 1,176 1,177 1,206 4.2}
{0 CHEMBL166968,5 1,16 1,26 1,30 1,33 1,49 1,81 1,82 1,96 1,145 1,147 1,159 1,175 1,176 1,177 1,206 5.32}
{0 CHEMBL167078,5 1,16 1,26 1,30 1,33 1,48 1,49 1,81 1,82 1,96 1,175 1,176 1,177 1,206 6.4}
{0 CHEMBL167201,1 1,2 1,3 1,4 1,16 1,33 1,43 1,49 1,58 1,81 1,115 1,154 1,155 1,157 1,170 1,206 5.495}
{0 CHEMBL167227,1 1,2 1,3 1,5 1,16 1,26 1,30 1,33 1,37 1,49 1,65 1,81 1,82 1,96 1,175 1,176 1,177 1,206 7.37}
{0 CHEMBL167543,1 1,2 1,3 1,5 1,16 1,26 1,30 1,33 1,37 1,49 1,65 1,81 1,82 1,96 1,175 1,176 1,177 1,206 7.24}
{0 CHEMBL167720,5 1,16 1,26 1,30 1,33 1,42 1,49 1,81 1,82 1,96 1,175 1,176 1,177 1,206 4}
{0 CHEMBL167764,1 1,2 1,3 1,4 1,16 1,33 1,49 1,58 1,115 1,154 1,176 1,177 1,206 6.77}
{0 CHEMBL168042,1 1,2 1,3 1,4 1,16 1,33 1,43 1,49 1,58 1,81 1,115 1,154 1,155 1,157 1,163 1,170 1,206 5.377}
{0 CHEMBL168379,5 1,16 1,26 1,30 1,33 1,49 1,81 1,82 1,154 1,176 1,206 4}
{0 CHEMBL168394,1 1,2 1,3 1,4 1,5 1,12 1,14 1,16 1,17 1,26 1,27 1,30 1,33 1,39 1,49 1,81 1,82 1,96 1,162 1,175 1,176 1,177 1,206 8.7}
{0 CHEMBL168465,1 1,2 1,3 1,4 1,5 1,12 1,14 1,16 1,17 1,26 1,27 1,30 1,33 1,39 1,49 1,81 1,82 1,96 1,115 1,175 1,176 1,177 1,206 8.2}
{0 CHEMBL168470,1 1,2 1,3 1,4 1,5 1,12 1,14 1,16 1,17 1,26 1,27 1,30 1,33 1,39 1,49 1,81 1,82 1,96 1,104 1,175 1,176 1,177 1,206 8.1}
{0 CHEMBL168503,1 1,2 1,3 1,4 1,5 1,12 1,14 1,16 1,17 1,26 1,27 1,30 1,33 1,39 1,49 1,81 1,82 1,96 1,104 1,175 1,176 1,177 1,206 7.7}
{0 CHEMBL168603,3 1,5 1,16 1,26 1,30 1,33 1,42 1,49 1,81 1,82 1,96 1,175 1,176 1,177 1,206 4}
{0 CHEMBL168694,5 1,16 1,26 1,30 1,33 1,49 1,81 1,82 1,84 1,96 1,99 1,175 1,176 1,177 1,206 5.21}
{0 CHEMBL168754,1 1,2 1,3 1,4 1,5 1,12 1,14 1,16 1,17 1,26 1,27 1,30 1,33 1,39 1,49 1,73 1,81 1,82 1,96 1,160 1,175 1,176 1,177 1,206 8.5}
{0 CHEMBL168828,1 1,2 1,3 1,4 1,5 1,12 1,14 1,16 1,21 1,26 1,27 1,30 1,33 1,39 1,49 1,81 1,96 1,175 1,176 1,177 1,206 7.6}
{0 CHEMBL168873,16 1,33 1,48 1,49 1,73 1,154 1,176 1,206 4.83}
{0 CHEMBL168881,5 1,16 1,26 1,30 1,33 1,49 1,81 1,82 1,96 1,99 1,175 1,176 1,177 1,206 6.11}
{0 CHEMBL168914,5 1,16 1,26 1,30 1,31 1,33 1,49 1,81 1,82 1,96 1,159 1,175 1,176 1,177 1,206 5.17}
{0 CHEMBL168924,1 1,2 1,3 1,4 1,12 1,14 1,16 1,27 1,33 1,39 1,49 1,96 1,175 1,176 1,177 1,206 5.7}
{0 CHEMBL168926,5 1,16 1,26 1,30 1,33 1,49 1,81 1,82 1,96 1,99 1,175 1,176 1,177 1,206 6.7}
{0 CHEMBL169013,1 1,2 1,3 1,4 1,5 1,12 1,14 1,16 1,17 1,26 1,27 1,30 1,33 1,39 1,49 1,81 1,82 1,96 1,152 1,175 1,176 1,177 1,206 8}
{0 CHEMBL169059,5 1,16 1,26 1,30 1,33 1,49 1,81 1,82 1,96 1,175 1,176 1,177 1,206 5.24}
{0 CHEMBL169227,1 1,2 1,3 1,4 1,5 1,12 1,14 1,16 1,17 1,26 1,27 1,30 1,33 1,39 1,49 1,81 1,82 1,96 1,115 1,123 1,152 1,175 1,176 1,177 1,206 7.5}
{0 CHEMBL169368,1 1,2 1,3 1,4 1,12 1,14 1,16 1,17 1,27 1,33 1,39 1,49 1,82 1,96 1,153 1,175 1,176 1,177 1,206 7.7}
{0 CHEMBL169566,1 1,2 1,3 1,4 1,5 1,12 1,14 1,16 1,17 1,26 1,27 1,30 1,33 1,39 1,49 1,73 1,81 1,82 1,96 1,169 1,175 1,176 1,177 1,206 8.3}
{0 CHEMBL169776,1 1,2 1,3 1,4 1,12 1,14 1,16 1,27 1,33 1,39 1,49 1,96 1,175 1,176 1,177 1,206 7.4}
{0 CHEMBL169890,1 1,2 1,3 1,4 1,5 1,12 1,14 1,16 1,17 1,26 1,27 1,30 1,33 1,39 1,49 1,81 1,82 1,95 1,96 1,175 1,176 1,177 1,206 6.8}
{0 CHEMBL170329,1 1,2 1,3 1,4 1,5 1,14 1,16 1,26 1,30 1,33 1,49 1,81 1,82 1,96 1,115 1,164 1,175 1,176 1,177 1,206 4}
{0 CHEMBL2111932,1 1,2 1,3 1,16 1,101 1,145 1,152 1,154 1,176 1,206 6.553}
{0 CHEMBL2115077,1 1,2 1,3 1,4 1,5 1,14 1,16 1,33 1,49 1,81 1,176 1,197 1,200 1,206 5.155}
{0 CHEMBL2115081,1 1,2 1,3 1,4 1,5 1,14 1,16 1,33 1,49 1,81 1,176 1,197 1,200 1,206 5.979}
{0 CHEMBL2115479,1 1,2 1,3 1,4 1,5 1,14 1,16 1,33 1,49 1,81 1,176 1,197 1,200 1,206 4}
{0 CHEMBL2115541,13 1,32 1,45 1,49 1,98 1,176 1,198 1,206 4}
{0 CHEMBL2115569,13 1,32 1,45 1,49 1,98 1,176 1,198 1,206 4.319}
{0 CHEMBL2145458,5 1,49 1,176 1,186 1,206 4.301}
{0 CHEMBL21641,1 1,2 1,3 1,4 1,16 1,33 1,48 1,58 1,115 1,154 1,206 5.664}
{0 CHEMBL222519,16 1,33 1,49 1,152 1,154 1,176 1,206 4}
{0 CHEMBL22720,16 1,33 1,49 1,154 1,206 5.481}
{0 CHEMBL22895,1 1,2 1,3 1,4 1,14 1,16 1,27 1,33 1,49 1,58 1,154 1,176 1,206 7.675}
{0 CHEMBL23044,16 1,33 1,48 1,152 1,154 1,176 1,206 5.62}
{0 CHEMBL23754,12 1,16 1,33 1,39 1,49 1,96 1,99 1,175 1,176 1,177 1,206 5.281}
{0 CHEMBL25599,16 1,33 1,48 1,49 1,110 1,154 1,176 1,206 4}
{0 CHEMBL25922,15 1,16 1,33 1,47 1,49 1,102 1,128 1,152 1,154 1,176 1,206 6.432}
{0 CHEMBL262206,1 1,2 1,3 1,4 1,5 1,7 1,8 1,10 1,13 1,16 1,18 1,21 1,26 1,29 1,30 1,33 1,34 1,49 1,81 1,114 1,176 1,206 7.767}
{0 CHEMBL262537,1 1,2 1,3 1,4 1,5 1,12 1,14 1,16 1,17 1,26 1,27 1,30 1,31 1,33 1,39 1,49 1,81 1,82 1,96 1,115 1,175 1,176 1,177 1,206 8.3}
{0 CHEMBL26699,15 1,16 1,33 1,47 1,138 1,152 1,154 1,176 1,184 1,206 5.097}
{0 CHEMBL266998,1 1,2 1,3 1,6 1,16 1,22 1,33 1,40 1,49 1,58 1,142 1,147 1,154 1,161 1,176 1,206 5.886}
{0 CHEMBL267006,1 1,2 1,3 1,6 1,16 1,22 1,33 1,35 1,41 1,49 1,58 1,142 1,147 1,154 1,161 1,176 1,198 1,201 1,206 4.244}
{0 CHEMBL267256,6 1,16 1,22 1,33 1,48 1,49 1,147 1,154 1,161 1,176 1,206 5.851}
{0 CHEMBL267259,1 1,2 1,3 1,4 1,6 1,16 1,22 1,33 1,35 1,41 1,49 1,58 1,115 1,142 1,147 1,154 1,161 1,176 1,206 4.577}
{0 CHEMBL267276,1 1,2 1,3 1,6 1,9 1,11 1,15 1,16 1,20 1,22 1,23 1,33 1,36 1,37 1,49 1,58 1,152 1,154 1,176 1,206 4.475}
{0 CHEMBL267504,1 1,2 1,3 1,7 1,16 1,33 1,40 1,49 1,54 1,81 1,152 1,176 1,206 5.398}
{0 CHEMBL267929,6 1,16 1,22 1,33 1,35 1,41 1,48 1,49 1,142 1,147 1,154 1,161 1,176 1,206 4.478}
{0 CHEMBL269213,16 1,33 1,49 1,127 1,197 1,206 7.921}
{0 CHEMBL273722,16 1,33 1,49 1,176 1,197 1,206 4.491}
{0 CHEMBL273886,16 1,33 1,49 1,197 1,206 7.398}
{0 CHEMBL274407,16 1,33 1,49 1,145 1,147 1,176 1,189 1,197 1,206 5}
{0 CHEMBL274588,1 1,2 1,3 1,6 1,9 1,11 1,15 1,16 1,20 1,22 1,23 1,33 1,37 1,40 1,49 1,58 1,152 1,154 1,176 1,206 6.523}
{0 CHEMBL275040,45 1,49 1,74 1,176 1,193 1,206 4}
{0 CHEMBL275106,1 1,2 1,3 1,4 1,16 1,33 1,49 1,54 1,81 1,101 1,115 1,176 1,206 6.62}
{0 CHEMBL275346,16 1,33 1,49 1,176 1,197 1,206 5.125}
{0 CHEMBL275528,16 1,33 1,43 1,49 1,154 1,206 7.233}
{0 CHEMBL27648,1 1,3 1,15 1,16 1,33 1,39 1,47 1,48 1,154 1,206 5.21}
{0 CHEMBL276624,1 1,2 1,3 1,6 1,16 1,22 1,33 1,49 1,58 1,147 1,152 1,154 1,161 1,176 1,206 5.959}
{0 CHEMBL276863,16 1,33 1,49 1,180 1,197 1,206 7.155}
{0 CHEMBL276907,3 1,5 1,14 1,16 1,26 1,30 1,33 1,49 1,81 1,154 1,176 1,206 6.37}
{0 CHEMBL279998,49 1,98 1,176 1,179 1,206 4.026}
{0 CHEMBL280853,1 1,2 1,3 1,4 1,7 1,16 1,33 1,49 1,53 1,58 1,73 1,113 1,115 1,154 1,206 8.638}
{0 CHEMBL282003,1 1,2 1,3 1,4 1,14 1,16 1,33 1,56 1,58 1,154 1,206 6.345}
{0 CHEMBL282672,16 1,33 1,48 1,154 1,206 4.783}
{0 CHEMBL283819,32 1,49 1,176 1,206 5.728}
{0 CHEMBL284012,1 1,2 1,3 1,4 1,7 1,16 1,33 1,49 1,115 1,120 1,176 1,206 4.092}
{0 CHEMBL284028,1 1,2 1,3 1,16 1,33 1,40 1,58 1,154 1,206 6.678}
{0 CHEMBL284237,16 1,33 1,49 1,197 1,206 8.072}
{0 CHEMBL285123,49 1,176 1,206 6.174}
{0 CHEMBL285519,1 1,2 1,3 1,4 1,5 1,7 1,10 1,16 1,18 1,29 1,30 1,33 1,47 1,49 1,81 1,114 1,176 1,206 6.346}
{0 CHEMBL286024,49 1,114 1,176 1,179 1,206 5.167}
{0 CHEMBL286752,15 1,16 1,33 1,47 1,149 1,152 1,154 1,176 1,206 6.367}
{0 CHEMBL287327,1 1,2 1,3 1,4 1,14 1,16 1,26 1,33 1,49 1,81 1,176 1,197 1,200 1,206 8.166}
{0 CHEMBL288384,1 1,2 1,3 1,16 1,33 1,49 1,58 1,154 1,206 6.108}
{0 CHEMBL288478,1 1,2 1,3 1,4 1,5 1,7 1,8 1,10 1,13 1,16 1,18 1,29 1,30 1,33 1,34 1,49 1,81 1,114 1,176 1,206 7.377}
{0 CHEMBL288839,16 1,33 1,43 1,49 1,101 1,113 1,114 1,152 1,154 1,176 1,206 7.137}
{0 CHEMBL288855,1 1,2 1,3 1,4 1,16 1,33 1,40 1,58 1,73 1,154 1,176 1,206 8.155}
{0 CHEMBL289151,1 1,2 1,3 1,4 1,5 1,7 1,8 1,10 1,13 1,16 1,18 1,29 1,30 1,33 1,44 1,49 1,81 1,114 1,176 1,206 8.854}
{0 CHEMBL289307,1 1,2 1,3 1,4 1,5 1,7 1,8 1,10 1,13 1,16 1,18 1,29 1,30 1,33 1,34 1,49 1,81 1,114 1,176 1,206 7.417}
{0 CHEMBL289607,1 1,2 1,3 1,4 1,5 1,7 1,8 1,10 1,13 1,16 1,18 1,21 1,26 1,29 1,30 1,33 1,34 1,49 1,81 1,114 1,176 1,206 8.18}
{0 CHEMBL289779,1 1,2 1,3 1,16 1,145 1,154 1,206 5.478}
{0 CHEMBL289832,1 1,2 1,3 1,16 1,33 1,40 1,58 1,101 1,152 1,154 1,176 1,206 8.229}
{0 CHEMBL290291,1 1,2 1,3 1,4 1,5 1,7 1,8 1,10 1,13 1,16 1,18 1,29 1,30 1,33 1,44 1,49 1,81 1,114 1,176 1,206 8.076}
{0 CHEMBL290555,1 1,2 1,3 1,4 1,5 1,7 1,8 1,10 1,13 1,16 1,18 1,29 1,30 1,33 1,34 1,49 1,81 1,114 1,176 1,206 8.004}
{0 CHEMBL290649,1 1,2 1,3 1,4 1,5 1,7 1,8 1,10 1,13 1,16 1,18 1,21 1,26 1,29 1,30 1,33 1,44 1,49 1,81 1,114 1,176 1,206 8.509}
{0 CHEMBL290738,1 1,2 1,3 1,4 1,5 1,7 1,8 1,10 1,13 1,16 1,18 1,21 1,26 1,29 1,30 1,33 1,34 1,49 1,81 1,114 1,176 1,206 8.585}
{0 CHEMBL290747,16 1,33 1,43 1,49 1,101 1,113 1,152 1,154 1,176 1,206 5.553}
{0 CHEMBL290963,1 1,2 1,3 1,4 1,5 1,7 1,8 1,10 1,13 1,16 1,18 1,21 1,26 1,29 1,30 1,33 1,44 1,49 1,81 1,114 1,176 1,206 8.523}
{0 CHEMBL291148,1 1,2 1,3 1,16 1,33 1,49 1,58 1,101 1,114 1,152 1,154 1,176 1,206 7.022}
{0 CHEMBL291149,1 1,2 1,3 1,16 1,33 1,49 1,101 1,152 1,154 1,176 1,206 7.086}
{0 CHEMBL291161,1 1,2 1,3 1,4 1,14 1,16 1,27 1,33 1,58 1,152 1,154 1,176 1,206 6.387}
{0 CHEMBL291169,1 1,2 1,3 1,4 1,16 1,33 1,40 1,73 1,145 1,154 1,176 1,206 6.041}
{0 CHEMBL291170,1 1,2 1,3 1,4 1,16 1,73 1,145 1,154 1,176 1,206 5.481}
{0 CHEMBL291278,49 1,82 1,176 1,206 4.638}
{0 CHEMBL291877,1 1,2 1,3 1,4 1,5 1,14 1,16 1,19 1,28 1,33 1,49 1,81 1,115 1,176 1,197 1,200 1,206 7.284}
{0 CHEMBL291897,1 1,2 1,3 1,4 1,5 1,14 1,16 1,19 1,28 1,33 1,49 1,81 1,176 1,197 1,200 1,206 7.377}
{0 CHEMBL292151,1 1,2 1,3 1,4 1,5 1,14 1,16 1,33 1,49 1,81 1,176 1,197 1,200 1,206 7.215}
{0 CHEMBL292569,1 1,2 1,3 1,4 1,14 1,16 1,33 1,49 1,81 1,176 1,197 1,200 1,206 5.081}
{0 CHEMBL293021,1 1,2 1,3 1,4 1,5 1,14 1,16 1,19 1,28 1,33 1,49 1,81 1,104 1,176 1,197 1,200 1,206 7.409}
{0 CHEMBL293206,16 1,33 1,43 1,49 1,152 1,154 1,157 1,176 1,198 1,206 6.432}
{0 CHEMBL293238,1 1,2 1,3 1,4 1,5 1,14 1,16 1,33 1,49 1,81 1,126 1,154 1,176 1,197 1,200 1,206 6.77}
{0 CHEMBL293314,1 1,2 1,3 1,4 1,5 1,14 1,16 1,33 1,49 1,81 1,176 1,197 1,200 1,206 7.602}
{0 CHEMBL293813,1 1,2 1,3 1,4 1,14 1,16 1,26 1,33 1,49 1,81 1,176 1,197 1,200 1,206 8.137}
{0 CHEMBL294043,1 1,2 1,3 1,4 1,14 1,16 1,33 1,49 1,81 1,176 1,187 1,197 1,200 1,206 7.523}
{0 CHEMBL294300,1 1,2 1,3 1,4 1,14 1,16 1,33 1,49 1,81 1,176 1,197 1,200 1,206 4.851}
{0 CHEMBL294384,1 1,2 1,3 1,4 1,5 1,14 1,16 1,19 1,28 1,33 1,49 1,81 1,176 1,197 1,200 1,206 8}
{0 CHEMBL294561,1 1,2 1,3 1,4 1,14 1,16 1,26 1,33 1,49 1,81 1,176 1,197 1,200 1,206 7.046}
{0 CHEMBL294796,1 1,2 1,3 1,4 1,16 1,33 1,49 1,58 1,115 1,154 1,157 1,176 1,206 5}
{0 CHEMBL295154,1 1,2 1,3 1,4 1,16 1,33 1,58 1,73 1,115 1,154 1,176 1,206 7.276}
{0 CHEMBL295427,16 1,33 1,49 1,67 1,104 1,154 1,176 1,206 4.276}
{0 CHEMBL295647,1 1,2 1,3 1,4 1,5 1,16 1,33 1,49 1,81 1,115 1,176 1,206 4}
{0 CHEMBL295995,1 1,2 1,3 1,16 1,33 1,49 1,58 1,73 1,154 1,206 6.824}
{0 CHEMBL296068,16 1,33 1,49 1,71 1,154 1,198 1,206 5.678}
{0 CHEMBL296521,16 1,33 1,49 1,101 1,114 1,152 1,154 1,176 1,206 5.509}
{0 CHEMBL297569,49 1,152 1,176 1,206 4.936}
{0 CHEMBL297881,1 1,2 1,3 1,16 1,33 1,49 1,58 1,101 1,114 1,152 1,154 1,176 1,206 8.328}
{0 CHEMBL298284,16 1,33 1,49 1,101 1,152 1,154 1,176 1,206 5.032}
{0 CHEMBL29830,32 1,49 1,114 1,176 1,206 4.108}
{0 CHEMBL298435,1 1,2 1,3 1,4 1,16 1,33 1,49 1,81 1,115 1,176 1,206 4}
{0 CHEMBL299155,16 1,33 1,48 1,49 1,73 1,154 1,176 1,206 4.396}
{0 CHEMBL299678,1 1,2 1,3 1,4 1,5 1,14 1,16 1,19 1,28 1,33 1,49 1,81 1,176 1,197 1,200 1,206 7.907}
{0 CHEMBL300118,1 1,2 1,3 1,4 1,5 1,14 1,16 1,19 1,26 1,28 1,33 1,49 1,73 1,81 1,169 1,176 1,197 1,200 1,206 7.745}
{0 CHEMBL300386,1 1,2 1,3 1,4 1,5 1,14 1,16 1,19 1,28 1,33 1,49 1,81 1,162 1,176 1,197 1,200 1,206 7.523}
{0 CHEMBL300558,1 1,2 1,3 1,4 1,14 1,16 1,33 1,49 1,81 1,176 1,197 1,200 1,206 7}
{0 CHEMBL300768,1 1,2 1,3 1,4 1,5 1,14 1,16 1,33 1,49 1,80 1,81 1,176 1,197 1,200 1,206 6.432}
{0 CHEMBL300949,1 1,2 1,3 1,4 1,12 1,14 1,16 1,27 1,31 1,33 1,39 1,49 1,96 1,137 1,175 1,176 1,177 1,206 7}
{0 CHEMBL301556,1 1,2 1,3 1,4 1,12 1,14 1,16 1,27 1,33 1,39 1,49 1,96 1,175 1,176 1,177 1,206 6.009}
{0 CHEMBL301634,1 1,2 1,3 1,4 1,14 1,16 1,33 1,49 1,81 1,91 1,147 1,176 1,206 7.569}
{0 CHEMBL302167,1 1,2 1,3 1,4 1,14 1,16 1,33 1,49 1,81 1,91 1,176 1,197 1,200 1,206 4.971}
{0 CHEMBL302427,1 1,2 1,3 1,4 1,14 1,16 1,33 1,49 1,70 1,81 1,91 1,176 1,206 7.337}
{0 CHEMBL302681,1 1,2 1,3 1,4 1,5 1,14 1,16 1,19 1,33 1,49 1,81 1,113 1,154 1,176 1,197 1,200 1,206 7.495}
{0 CHEMBL303080,1 1,2 1,3 1,4 1,12 1,14 1,16 1,27 1,33 1,39 1,49 1,96 1,175 1,176 1,177 1,206 6.469}
{0 CHEMBL303783,1 1,2 1,3 1,4 1,14 1,16 1,33 1,47 1,49 1,81 1,176 1,197 1,200 1,206 4.943}
{0 CHEMBL305187,16 1,33 1,43 1,44 1,49 1,162 1,177 1,197 1,206 7.137}
{0 CHEMBL305816,1 1,2 1,3 1,4 1,6 1,16 1,33 1,48 1,115 1,154 1,206 6.79}
{0 CHEMBL306471,6 1,16 1,30 1,33 1,48 1,49 1,154 1,158 1,206 5.695}
{0 CHEMBL307267,1 1,2 1,3 1,4 1,14 1,16 1,33 1,49 1,81 1,169 1,176 1,206 6.699}
{0 CHEMBL307688,1 1,2 1,3 1,4 1,6 1,16 1,33 1,58 1,115 1,154 1,206 7.796}
{0 CHEMBL30853,32 1,49 1,114 1,176 1,206 4.108}
{0 CHEMBL309206,1 1,2 1,3 1,4 1,6 1,9 1,11 1,15 1,16 1,20 1,22 1,23 1,33 1,37 1,48 1,49 1,58 1,115 1,152 1,154 1,206 5.125}
{0 CHEMBL309441,1 1,2 1,3 1,4 1,6 1,9 1,11 1,15 1,16 1,20 1,22 1,23 1,33 1,37 1,48 1,49 1,58 1,115 1,124 1,152 1,154 1,176 1,206 5.959}
{0 CHEMBL309548,1 1,2 1,3 1,4 1,6 1,9 1,11 1,14 1,15 1,16 1,20 1,22 1,23 1,33 1,35 1,41 1,49 1,56 1,58 1,152 1,154 1,176 1,206 5.319}
{0 CHEMBL309961,6 1,16 1,33 1,48 1,49 1,104 1,154 1,176 1,206 7.06}
{0 CHEMBL310014,1 1,2 1,3 1,6 1,9 1,11 1,15 1,16 1,20 1,22 1,23 1,33 1,37 1,49 1,58 1,152 1,154 1,176 1,206 5.658}
{0 CHEMBL310286,1 1,2 1,3 1,6 1,16 1,33 1,49 1,81 1,154 1,169 1,176 1,206 4}
{0 CHEMBL310352,6 1,9 1,11 1,15 1,16 1,20 1,22 1,23 1,33 1,37 1,48 1,49 1,152 1,154 1,176 1,206 5.635}
{0 CHEMBL310435,49 1,176 1,206 4.625}
{0 CHEMBL31049,1 1,2 1,3 1,4 1,7 1,16 1,33 1,49 1,53 1,58 1,73 1,104 1,113 1,115 1,154 1,176 1,206 8.347}
{0 CHEMBL310544,6 1,9 1,11 1,15 1,16 1,20 1,22 1,23 1,26 1,33 1,35 1,37 1,41 1,48 1,49 1,73 1,152 1,154 1,169 1,176 1,206 4}
{0 CHEMBL311085,5 1,47 1,49 1,85 1,108 1,154 1,176 1,206 5.495}
{0 CHEMBL311110,1 1,49 1,176 1,206 5.102}
{0 CHEMBL311221,1 1,2 1,3 1,4 1,6 1,9 1,11 1,14 1,15 1,16 1,20 1,22 1,23 1,33 1,49 1,56 1,58 1,152 1,154 1,176 1,206 5.87}
{0 CHEMBL311831,1 1,2 1,3 1,16 1,33 1,39 1,49 1,73 1,81 1,169 1,176 1,206 4.975}
{0 CHEMBL311860,6 1,9 1,11 1,15 1,16 1,20 1,22 1,23 1,33 1,37 1,48 1,49 1,152 1,154 1,176 1,206 4.05}
{0 CHEMBL31250,49 1,176 1,179 1,206 4.081}
{0 CHEMBL313269,1 1,2 1,3 1,4 1,6 1,9 1,11 1,15 1,16 1,20 1,22 1,23 1,33 1,37 1,48 1,49 1,58 1,115 1,134 1,152 1,154 1,175 1,176 1,206 5.056}
{0 CHEMBL31344,1 1,2 1,3 1,4 1,12 1,14 1,16 1,27 1,33 1,39 1,49 1,96 1,175 1,176 1,177 1,206 6.854}
{0 CHEMBL313611,1 1,2 1,3 1,4 1,14 1,16 1,31 1,33 1,43 1,49 1,58 1,115 1,154 1,155 1,157 1,176 1,206 4.959}
{0 CHEMBL313638,3 1,6 1,9 1,11 1,15 1,16 1,20 1,22 1,23 1,32 1,33 1,35 1,37 1,41 1,49 1,73 1,95 1,152 1,154 1,176 1,206 5.26}
{0 CHEMBL315203,6 1,16 1,33 1,49 1,154 1,176 1,206 4}
{0 CHEMBL315484,1 1,2 1,3 1,4 1,6 1,11 1,13 1,16 1,33 1,49 1,72 1,115 1,154 1,176 1,206 4.051}
{0 CHEMBL316319,1 1,2 1,3 1,15 1,16 1,47 1,145 1,154 1,206 6.96}
{0 CHEMBL31661,1 1,2 1,3 1,4 1,5 1,16 1,30 1,33 1,49 1,81 1,115 1,176 1,206 6.77}
{0 CHEMBL31718,1 1,2 1,3 1,4 1,7 1,16 1,33 1,49 1,53 1,58 1,61 1,73 1,113 1,115 1,154 1,176 1,206 8.658}
{0 CHEMBL31741,1 1,2 1,3 1,4 1,5 1,16 1,30 1,33 1,49 1,81 1,115 1,176 1,206 7.854}
{0 CHEMBL317841,2 1,5 1,16 1,18 1,29 1,30 1,33 1,49 1,81 1,114 1,176 1,206 4.86}
{0 CHEMBL318226,5 1,16 1,18 1,29 1,30 1,33 1,49 1,81 1,114 1,176 1,181 1,206 5.277}
{0 CHEMBL32076,1 1,2 1,3 1,4 1,7 1,16 1,33 1,58 1,73 1,113 1,115 1,154 1,176 1,206 8.854}
{0 CHEMBL320952,1 1,2 1,3 1,6 1,9 1,11 1,15 1,16 1,20 1,22 1,23 1,33 1,36 1,37 1,49 1,58 1,96 1,110 1,152 1,154 1,176 1,206 4.475}
{0 CHEMBL321171,6 1,9 1,15 1,16 1,33 1,46 1,48 1,152 1,154 1,176 1,206 5.134}
{0 CHEMBL322354,1 1,2 1,3 1,6 1,9 1,11 1,15 1,16 1,33 1,40 1,46 1,49 1,58 1,154 1,206 5}
{0 CHEMBL32240,1 1,2 1,3 1,4 1,7 1,16 1,33 1,49 1,53 1,58 1,73 1,113 1,115 1,154 1,206 8.387}
{0 CHEMBL322734,1 1,2 1,3 1,6 1,9 1,15 1,16 1,33 1,40 1,46 1,58 1,113 1,154 1,206 5}
{0 CHEMBL322916,1 1,2 1,3 1,6 1,11 1,16 1,33 1,49 1,81 1,154 1,176 1,206 5.276}
{0 CHEMBL323414,1 1,2 1,3 1,4 1,6 1,9 1,14 1,15 1,16 1,33 1,46 1,56 1,58 1,154 1,206 5.545}
{0 CHEMBL323628,1 1,2 1,3 1,4 1,5 1,12 1,14 1,16 1,17 1,27 1,33 1,39 1,49 1,82 1,96 1,175 1,176 1,177 1,206 6.9}
{0 CHEMBL324519,7 1,16 1,33 1,48 1,73 1,113 1,154 1,206 5.242}
{0 CHEMBL324844,1 1,2 1,3 1,4 1,5 1,6 1,11 1,16 1,30 1,33 1,49 1,65 1,81 1,115 1,116 1,152 1,154 1,176 1,206 5.253}
{0 CHEMBL325124,1 1,2 1,3 1,9 1,15 1,16 1,33 1,40 1,58 1,110 1,154 1,206 5.561}
{0 CHEMBL325407,1 1,2 1,3 1,4 1,5 1,15 1,16 1,30 1,33 1,43 1,49 1,81 1,115 1,140 1,152 1,176 1,206 4.921}
{0 CHEMBL325557,1 1,2 1,3 1,6 1,9 1,11 1,15 1,16 1,33 1,40 1,46 1,49 1,58 1,95 1,118 1,154 1,206 5}
{0 CHEMBL325988,1 1,2 1,3 1,6 1,9 1,11 1,15 1,16 1,20 1,22 1,23 1,33 1,35 1,37 1,41 1,49 1,58 1,152 1,154 1,176 1,206 4.99}
{0 CHEMBL326607,1 1,2 1,3 1,4 1,5 1,16 1,21 1,30 1,33 1,49 1,81 1,115 1,140 1,152 1,176 1,206 4}
{0 CHEMBL326678,1 1,2 1,3 1,6 1,9 1,11 1,15 1,16 1,20 1,22 1,23 1,33 1,35 1,36 1,37 1,41 1,49 1,58 1,152 1,154 1,176 1,206 4.638}
{0 CHEMBL327178,1 1,3 1,15 1,16 1,33 1,47 1,49 1,95 1,154 1,206 6.37}
{0 CHEMBL327224,5 1,16 1,33 1,49 1,176 1,206 4.804}
{0 CHEMBL327343,1 1,2 1,3 1,16 1,33 1,48 1,58 1,154 1,206 6.95}
{0 CHEMBL327344,1 1,2 1,3 1,16 1,48 1,49 1,124 1,154 1,206 5.52}
{0 CHEMBL327361,3 1,6 1,9 1,11 1,15 1,16 1,20 1,22 1,23 1,33 1,35 1,37 1,41 1,49 1,95 1,152 1,154 1,176 1,206 4.208}
{0 CHEMBL327764,3 1,6 1,9 1,11 1,15 1,16 1,20 1,22 1,23 1,33 1,35 1,36 1,37 1,41 1,49 1,95 1,152 1,154 1,176 1,206 4.125}
{0 CHEMBL327936,3 1,6 1,9 1,11 1,15 1,16 1,20 1,22 1,23 1,33 1,36 1,37 1,49 1,95 1,96 1,110 1,152 1,154 1,176 1,206 4.469}
{0 CHEMBL328272,3 1,6 1,9 1,11 1,15 1,16 1,20 1,22 1,23 1,33 1,36 1,37 1,49 1,95 1,152 1,154 1,176 1,206 5.081}
{0 CHEMBL328353,3 1,6 1,9 1,11 1,15 1,16 1,20 1,22 1,23 1,33 1,35 1,37 1,41 1,49 1,52 1,95 1,99 1,152 1,154 1,176 1,206 4.963}
{0 CHEMBL328357,1 1,2 1,3 1,16 1,48 1,49 1,124 1,154 1,206 5.5}
{0 CHEMBL328571,1 1,2 1,3 1,16 1,33 1,48 1,58 1,154 1,206 6.95}
{0 CHEMBL328935,6 1,9 1,11 1,15 1,16 1,20 1,22 1,23 1,33 1,36 1,37 1,49 1,152 1,154 1,176 1,206 4.187}
{0 CHEMBL329176,1 1,2 1,3 1,15 1,16 1,47 1,49 1,124 1,143 1,154 1,206 6.55}
{0 CHEMBL329680,1 1,2 1,3 1,15 1,16 1,47 1,49 1,124 1,154 1,206 5.8}
{0 CHEMBL330190,1 1,2 1,3 1,16 1,49 1,124 1,154 1,206 6.43}
{0 CHEMBL330349,6 1,9 1,11 1,15 1,16 1,20 1,22 1,23 1,33 1,35 1,37 1,41 1,49 1,73 1,152 1,154 1,176 1,206 5.432}
{0 CHEMBL330790,16 1,33 1,41 1,48 1,49 1,118 1,154 1,176 1,198 1,202 1,206 4.301}
{0 CHEMBL330795,16 1,20 1,33 1,43 1,49 1,73 1,85 1,110 1,135 1,157 1,175 1,176 1,177 1,206 4}
{0 CHEMBL331547,16 1,33 1,43 1,49 1,115 1,152 1,154 1,176 1,198 1,206 6.066}
{0 CHEMBL331725,16 1,32 1,33 1,43 1,49 1,73 1,154 1,157 1,198 1,206 4}
{0 CHEMBL331789,1 1,2 1,3 1,16 1,33 1,43 1,49 1,58 1,115 1,154 1,198 1,206 5}
{0 CHEMBL332496,1 1,2 1,3 1,4 1,5 1,16 1,30 1,33 1,49 1,81 1,115 1,140 1,152 1,176 1,206 4}
{0 CHEMBL332585,1 1,2 1,3 1,16 1,43 1,49 1,101 1,152 1,154 1,157 1,176 1,198 1,206 5}
{0 CHEMBL333042,1 1,2 1,3 1,16 1,33 1,58 1,154 1,206 6}
{0 CHEMBL333463,16 1,33 1,43 1,49 1,152 1,154 1,157 1,176 1,198 1,206 5.31}
{0 CHEMBL334667,1 1,2 1,3 1,6 1,16 1,30 1,33 1,35 1,41 1,49 1,81 1,121 1,142 1,154 1,176 1,206 4.244}
{0 CHEMBL335231,32 1,49 1,107 1,176 1,206 4.734}
{0 CHEMBL335431,1 1,2 1,3 1,4 1,16 1,33 1,58 1,73 1,115 1,154 1,206 5.174}
{0 CHEMBL335571,1 1,2 1,3 1,16 1,33 1,48 1,101 1,115 1,152 1,154 1,176 1,206 6.31}
{0 CHEMBL336017,1 1,2 1,3 1,4 1,14 1,16 1,33 1,56 1,58 1,154 1,206 6.051}
{0 CHEMBL336811,1 1,2 1,3 1,16 1,33 1,40 1,58 1,145 1,154 1,206 7.022}
{0 CHEMBL337030,13 1,32 1,45 1,49 1,98 1,176 1,206 4.721}
{0 CHEMBL337346,1 1,2 1,3 1,4 1,7 1,16 1,26 1,33 1,49 1,58 1,73 1,81 1,113 1,115 1,154 1,176 1,206 7.62}
{0 CHEMBL337570,1 1,2 1,3 1,16 1,33 1,49 1,95 1,101 1,152 1,154 1,176 1,206 7.569}
{0 CHEMBL337851,1 1,2 1,3 1,4 1,7 1,16 1,18 1,26 1,33 1,49 1,58 1,73 1,81 1,113 1,115 1,154 1,176 1,206 7.572}
{0 CHEMBL338173,5 1,16 1,30 1,33 1,43 1,49 1,81 1,154 1,157 1,176 1,198 1,206 4}
{0 CHEMBL341167,1 1,2 1,3 1,16 1,33 1,49 1,95 1,152 1,154 1,176 1,206 6.658}
{0 CHEMBL341209,1 1,2 1,3 1,6 1,9 1,11 1,15 1,16 1,20 1,22 1,23 1,33 1,36 1,37 1,49 1,58 1,152 1,154 1,176 1,206 4.553}
{0 CHEMBL341228,1 1,2 1,3 1,16 1,33 1,43 1,49 1,58 1,154 1,157 1,198 1,206 5.367}
{0 CHEMBL341587,1 1,2 1,3 1,5 1,7 1,16 1,30 1,33 1,39 1,49 1,81 1,95 1,107 1,114 1,164 1,176 1,206 5.796}
{0 CHEMBL341807,1 1,2 1,3 1,16 1,101 1,145 1,152 1,154 1,176 1,206 5.883}
{0 CHEMBL341813,1 1,2 1,3 1,4 1,12 1,14 1,16 1,27 1,33 1,39 1,49 1,52 1,96 1,175 1,176 1,177 1,206 6.398}
{0 CHEMBL342650,3 1,16 1,33 1,49 1,95 1,101 1,152 1,154 1,176 1,206 6.481}
{0 CHEMBL342804,16 1,18 1,26 1,33 1,49 1,81 1,104 1,152 1,154 1,176 1,198 1,206 7.523}
{0 CHEMBL342820,1 1,2 1,3 1,5 1,16 1,30 1,33 1,40 1,49 1,81 1,107 1,114 1,164 1,176 1,206 5.796}
{0 CHEMBL342851,1 1,2 1,3 1,16 1,33 1,49 1,58 1,95 1,154 1,206 6.585}
{0 CHEMBL342928,1 1,2 1,3 1,16 1,33 1,40 1,58 1,101 1,152 1,154 1,176 1,206 8.114}
{0 CHEMBL343429,16 1,33 1,43 1,49 1,154 1,206 6.191}
{0 CHEMBL343863,1 1,2 1,3 1,4 1,7 1,16 1,33 1,49 1,58 1,113 1,154 1,176 1,198 1,206 8}
{0 CHEMBL343893,1 1,2 1,3 1,4 1,5 1,7 1,16 1,19 1,28 1,33 1,49 1,58 1,115 1,154 1,176 1,198 1,206 4.699}
{0 CHEMBL344041,1 1,2 1,3 1,4 1,5 1,14 1,16 1,30 1,33 1,39 1,49 1,81 1,107 1,114 1,164 1,176 1,206 5}
{0 CHEMBL344145,7 1,16 1,33 1,49 1,73 1,113 1,154 1,176 1,206 7.192}
{0 CHEMBL344497,16 1,26 1,32 1,33 1,49 1,73 1,152 1,154 1,176 1,198 1,206 6.77}
{0 CHEMBL344653,1 1,2 1,3 1,5 1,16 1,30 1,33 1,40 1,49 1,58 1,81 1,154 1,176 1,206 6.62}
{0 CHEMBL345032,1 1,2 1,3 1,16 1,33 1,40 1,58 1,101 1,152 1,154 1,176 1,206 7}
{0 CHEMBL347761,16 1,33 1,43 1,49 1,154 1,206 6.148}
{0 CHEMBL348165,1 1,2 1,3 1,4 1,5 1,7 1,12 1,16 1,21 1,26 1,30 1,33 1,39 1,49 1,71 1,81 1,96 1,162 1,175 1,176 1,177 1,204 1,206 7.538}
{0 CHEMBL349038,1 1,2 1,3 1,4 1,16 1,33 1,49 1,58 1,62 1,115 1,154 1,176 1,206 5.886}
{0 CHEMBL349136,1 1,2 1,3 1,4 1,5 1,7 1,12 1,16 1,21 1,26 1,30 1,33 1,39 1,49 1,71 1,81 1,96 1,162 1,175 1,176 1,177 1,204 1,206 7.959}
{0 CHEMBL349413,1 1,2 1,3 1,5 1,16 1,18 1,29 1,30 1,33 1,40 1,49 1,81 1,114 1,176 1,206 4.77}
{0 CHEMBL349719,1 1,2 1,3 1,4 1,16 1,33 1,49 1,58 1,115 1,154 1,176 1,177 1,206 6.796}
{0 CHEMBL350158,32 1,45 1,49 1,98 1,176 1,206 4}
{0 CHEMBL350204,1 1,2 1,3 1,4 1,14 1,16 1,31 1,33 1,49 1,58 1,115 1,154 1,176 1,206 6.959}
{0 CHEMBL350411,1 1,2 1,3 1,4 1,5 1,16 1,28 1,30 1,33 1,49 1,58 1,81 1,115 1,154 1,170 1,176 1,206 4}
{0 CHEMBL350522,32 1,49 1,152 1,176 1,206 4}
{0 CHEMBL350810,32 1,36 1,49 1,176 1,206 4}
{0 CHEMBL350974,1 1,2 1,3 1,4 1,5 1,7 1,12 1,16 1,21 1,26 1,30 1,33 1,39 1,49 1,71 1,81 1,96 1,162 1,175 1,176 1,177 1,204 1,206 8.824}
{0 CHEMBL351085,32 1,45 1,49 1,98 1,176 1,206 4}
{0 CHEMBL351097,1 1,2 1,3 1,4 1,5 1,7 1,12 1,16 1,21 1,26 1,30 1,33 1,39 1,49 1,81 1,96 1,162 1,175 1,176 1,177 1,204 1,206 7.721}
{0 CHEMBL351441,1 1,2 1,3 1,4 1,14 1,16 1,31 1,33 1,49 1,58 1,115 1,154 1,168 1,176 1,206 4.943}
{0 CHEMBL351884,1 1,2 1,3 1,4 1,16 1,24 1,25 1,33 1,42 1,49 1,58 1,81 1,115 1,154 1,170 1,176 1,206 6.569}
{0 CHEMBL352310,1 1,2 1,3 1,4 1,5 1,12 1,14 1,16 1,17 1,26 1,27 1,30 1,33 1,39 1,49 1,81 1,82 1,96 1,152 1,175 1,176 1,177 1,206 7}
{0 CHEMBL352332,1 1,2 1,3 1,4 1,16 1,33 1,49 1,58 1,115 1,140 1,152 1,154 1,176 1,177 1,206 6.301}
{0 CHEMBL352435,1 1,2 1,3 1,4 1,5 1,12 1,14 1,16 1,17 1,26 1,27 1,30 1,33 1,39 1,49 1,81 1,82 1,96 1,123 1,152 1,175 1,176 1,177 1,206 7.6}
{0 CHEMBL352828,1 1,2 1,3 1,4 1,12 1,14 1,16 1,17 1,24 1,25 1,26 1,27 1,33 1,39 1,49 1,81 1,82 1,96 1,127 1,175 1,176 1,177 1,206 6.1}
{0 CHEMBL352889,1 1,2 1,3 1,4 1,5 1,16 1,30 1,33 1,49 1,58 1,81 1,114 1,115 1,152 1,154 1,170 1,176 1,206 5.569}
{0 CHEMBL353261,6 1,16 1,33 1,49 1,154 1,176 1,206 4}
{0 CHEMBL353272,1 1,2 1,3 1,4 1,5 1,12 1,14 1,16 1,17 1,22 1,26 1,27 1,30 1,33 1,39 1,49 1,72 1,81 1,82 1,96 1,175 1,176 1,177 1,206 7}
{0 CHEMBL353443,1 1,2 1,3 1,5 1,16 1,26 1,30 1,33 1,45 1,49 1,65 1,81 1,82 1,96 1,175 1,176 1,177 1,206 4}
{0 CHEMBL353569,32 1,45 1,49 1,176 1,206 4}
{0 CHEMBL353570,1 1,2 1,3 1,4 1,14 1,16 1,31 1,33 1,49 1,58 1,71 1,115 1,152 1,154 1,176 1,206 5.495}
{0 CHEMBL353956,5 1,16 1,26 1,30 1,33 1,42 1,49 1,81 1,82 1,96 1,111 1,175 1,176 1,177 1,206 4}
{0 CHEMBL353957,3 1,5 1,16 1,26 1,30 1,33 1,49 1,81 1,82 1,96 1,158 1,175 1,176 1,177 1,206 4}
{0 CHEMBL353977,1 1,2 1,3 1,4 1,5 1,12 1,14 1,16 1,17 1,26 1,27 1,30 1,33 1,39 1,49 1,62 1,81 1,82 1,96 1,175 1,176 1,177 1,206 7.2}
{0 CHEMBL354057,1 1,2 1,3 1,5 1,16 1,26 1,30 1,33 1,49 1,65 1,81 1,82 1,96 1,97 1,175 1,176 1,177 1,206 7.45}
{0 CHEMBL354375,1 1,2 1,3 1,4 1,5 1,12 1,14 1,16 1,17 1,26 1,27 1,30 1,33 1,39 1,49 1,81 1,82 1,96 1,115 1,152 1,175 1,176 1,177 1,206 6.9}
{0 CHEMBL354484,1 1,2 1,3 1,4 1,5 1,12 1,14 1,16 1,17 1,26 1,27 1,30 1,33 1,39 1,49 1,81 1,82 1,96 1,175 1,176 1,177 1,206 7.3}
{0 CHEMBL354721,5 1,16 1,26 1,30 1,33 1,49 1,81 1,82 1,96 1,175 1,176 1,177 1,206 6.08}
{0 CHEMBL354793,1 1,2 1,3 1,4 1,5 1,12 1,14 1,16 1,17 1,22 1,26 1,27 1,30 1,33 1,39 1,49 1,81 1,82 1,96 1,175 1,176 1,177 1,206 7.9}
{0 CHEMBL354887,5 1,16 1,26 1,30 1,33 1,49 1,81 1,82 1,96 1,158 1,168 1,175 1,176 1,177 1,206 4}
{0 CHEMBL354980,1 1,2 1,3 1,4 1,5 1,12 1,14 1,16 1,17 1,26 1,27 1,30 1,31 1,33 1,39 1,49 1,81 1,82 1,96 1,152 1,175 1,176 1,177 1,206 8.3}
{0 CHEMBL355109,1 1,2 1,3 1,4 1,5 1,12 1,14 1,16 1,17 1,26 1,27 1,30 1,33 1,39 1,49 1,81 1,82 1,96 1,162 1,175 1,176 1,177 1,206 8.4}
{0 CHEMBL355226,1 1,2 1,3 1,5 1,16 1,26 1,30 1,33 1,49 1,65 1,81 1,82 1,96 1,175 1,176 1,177 1,206 5.48}
{0 CHEMBL355264,1 1,2 1,3 1,5 1,16 1,26 1,30 1,33 1,37 1,49 1,65 1,81 1,82 1,96 1,175 1,176 1,177 1,206 6.5}
{0 CHEMBL355298,1 1,2 1,3 1,4 1,5 1,12 1,14 1,16 1,17 1,26 1,27 1,30 1,33 1,39 1,49 1,81 1,82 1,96 1,175 1,176 1,177 1,206 6.7}
{0 CHEMBL356281,1 1,2 1,3 1,4 1,5 1,7 1,16 1,19 1,28 1,33 1,49 1,58 1,154 1,176 1,198 1,206 8}
{0 CHEMBL356740,1 1,2 1,3 1,4 1,5 1,7 1,16 1,19 1,28 1,33 1,49 1,58 1,152 1,154 1,176 1,198 1,206 5.921}
{0 CHEMBL356855,16 1,33 1,43 1,49 1,136 1,154 1,206 4.538}
{0 CHEMBL357190,1 1,2 1,3 1,4 1,5 1,7 1,16 1,19 1,28 1,33 1,49 1,58 1,115 1,154 1,176 1,198 1,206 8.155}
{0 CHEMBL357294,1 1,2 1,3 1,4 1,12 1,14 1,16 1,27 1,33 1,39 1,49 1,52 1,96 1,175 1,176 1,177 1,181 1,206 5.022}
{0 CHEMBL357447,1 1,2 1,3 1,4 1,5 1,7 1,16 1,19 1,28 1,33 1,49 1,58 1,152 1,154 1,176 1,198 1,206 7.699}
{0 CHEMBL357910,1 1,2 1,3 1,4 1,7 1,16 1,33 1,49 1,58 1,145 1,147 1,154 1,176 1,198 1,206 6.959}
{0 CHEMBL357916,1 1,2 1,3 1,4 1,5 1,7 1,16 1,33 1,49 1,58 1,154 1,176 1,198 1,206 8}
{0 CHEMBL358362,1 1,2 1,3 1,4 1,7 1,16 1,33 1,49 1,58 1,113 1,124 1,154 1,176 1,198 1,206 7.699}
{0 CHEMBL358455,16 1,33 1,43 1,49 1,136 1,154 1,206 5.085}
{0 CHEMBL37098,1 1,2 1,3 1,4 1,5 1,7 1,10 1,16 1,18 1,21 1,26 1,29 1,30 1,33 1,47 1,49 1,67 1,81 1,114 1,176 1,206 6.119}
{0 CHEMBL37409,1 1,2 1,3 1,4 1,5 1,7 1,8 1,10 1,13 1,16 1,18 1,29 1,30 1,33 1,44 1,49 1,81 1,114 1,176 1,206 7.529}
{0 CHEMBL38994,1 1,2 1,3 1,4 1,5 1,7 1,8 1,10 1,13 1,16 1,18 1,29 1,30 1,33 1,34 1,49 1,81 1,114 1,176 1,206 8.292}
{0 CHEMBL39408,1 1,2 1,3 1,4 1,5 1,7 1,8 1,10 1,13 1,16 1,18 1,29 1,30 1,33 1,34 1,49 1,81 1,114 1,176 1,206 7.332}
{0 CHEMBL39627,1 1,2 1,3 1,4 1,5 1,7 1,8 1,10 1,13 1,16 1,18 1,21 1,26 1,29 1,30 1,33 1,34 1,49 1,81 1,114 1,176 1,206 6.873}
{0 CHEMBL39773,1 1,2 1,3 1,4 1,5 1,7 1,8 1,10 1,13 1,16 1,18 1,29 1,30 1,33 1,34 1,49 1,81 1,114 1,176 1,206 8.004}
{0 CHEMBL39881,1 1,2 1,3 1,4 1,5 1,7 1,8 1,10 1,13 1,16 1,18 1,21 1,26 1,29 1,30 1,33 1,34 1,49 1,81 1,114 1,176 1,206 8.585}
{0 CHEMBL40072,1 1,2 1,3 1,4 1,5 1,7 1,8 1,10 1,13 1,16 1,18 1,21 1,26 1,29 1,30 1,33 1,44 1,49 1,81 1,114 1,176 1,206 8.42}
{0 CHEMBL40623,1 1,2 1,3 1,4 1,16 1,33 1,40 1,58 1,73 1,154 1,176 1,206 7.921}
{0 CHEMBL40649,1 1,2 1,3 1,16 1,33 1,49 1,58 1,101 1,104 1,152 1,154 1,176 1,206 5.721}
{0 CHEMBL40652,1 1,2 1,3 1,16 1,33 1,49 1,101 1,152 1,154 1,176 1,206 7.538}
{0 CHEMBL40708,1 1,2 1,3 1,4 1,16 1,33 1,40 1,48 1,73 1,115 1,154 1,176 1,206 6.77}
{0 CHEMBL40730,1 1,2 1,3 1,4 1,5 1,7 1,8 1,10 1,13 1,16 1,18 1,29 1,30 1,33 1,44 1,49 1,81 1,114 1,176 1,206 8.357}
{0 CHEMBL40745,1 1,2 1,3 1,16 1,33 1,45 1,49 1,58 1,101 1,114 1,152 1,154 1,176 1,206 6.886}
{0 CHEMBL41295,16 1,33 1,49 1,101 1,114 1,152 1,154 1,176 1,206 6.796}
{0 CHEMBL413125,1 1,2 1,3 1,4 1,7 1,16 1,33 1,49 1,58 1,154 1,176 1,198 1,206 8}
{0 CHEMBL413345,1 1,2 1,3 1,4 1,14 1,16 1,27 1,33 1,49 1,58 1,154 1,176 1,206 6.187}
{0 CHEMBL41340,16 1,33 1,49 1,71 1,152 1,154 1,176 1,190 1,206 6.041}
{0 CHEMBL41399,1 1,2 1,3 1,16 1,31 1,33 1,49 1,58 1,101 1,152 1,154 1,176 1,206 6.194}
{0 CHEMBL41460,16 1,33 1,49 1,101 1,114 1,152 1,154 1,176 1,206 7.538}
{0 CHEMBL415462,1 1,2 1,3 1,4 1,12 1,16 1,33 1,39 1,49 1,52 1,57 1,96 1,115 1,152 1,175 1,176 1,177 1,206 5.75}
{0 CHEMBL415733,5 1,16 1,19 1,28 1,33 1,49 1,71 1,154 1,176 1,198 1,206 5}
{0 CHEMBL415866,1 1,2 1,3 1,4 1,5 1,7 1,8 1,10 1,13 1,16 1,18 1,21 1,26 1,29 1,30 1,33 1,44 1,49 1,81 1,114 1,176 1,206 7.678}
{0 CHEMBL41691,1 1,2 1,3 1,16 1,33 1,49 1,101 1,152 1,154 1,176 1,206 7.347}
{0 CHEMBL416970,1 1,2 1,3 1,4 1,5 1,7 1,8 1,10 1,13 1,16 1,18 1,29 1,30 1,33 1,49 1,81 1,114 1,176 1,206 6.571}
{0 CHEMBL417219,1 1,2 1,3 1,4 1,14 1,16 1,33 1,49 1,81 1,113 1,154 1,176 1,197 1,200 1,206 6.824}
{0 CHEMBL417335,1 1,2 1,3 1,4 1,5 1,7 1,8 1,10 1,13 1,16 1,18 1,26 1,29 1,30 1,33 1,49 1,81 1,114 1,176 1,206 6.203}
{0 CHEMBL417514,1 1,2 1,3 1,4 1,5 1,7 1,8 1,10 1,13 1,16 1,18 1,29 1,30 1,33 1,44 1,49 1,81 1,114 1,176 1,206 8.481}
{0 CHEMBL418055,1 1,2 1,3 1,4 1,5 1,7 1,8 1,10 1,13 1,16 1,18 1,21 1,26 1,29 1,30 1,33 1,34 1,49 1,81 1,114 1,176 1,206 8.131}
{0 CHEMBL419045,1 1,2 1,3 1,4 1,5 1,12 1,14 1,16 1,17 1,26 1,27 1,30 1,33 1,39 1,49 1,81 1,82 1,96 1,175 1,176 1,177 1,206 8.5}
{0 CHEMBL419940,1 1,2 1,3 1,4 1,7 1,14 1,16 1,27 1,33 1,49 1,58 1,113 1,154 1,206 6.392}
{0 CHEMBL420392,1 1,2 1,3 1,6 1,9 1,11 1,15 1,16 1,20 1,22 1,23 1,33 1,35 1,37 1,40 1,41 1,49 1,58 1,152 1,154 1,176 1,206 5.824}
{0 CHEMBL42057,1 1,2 1,3 1,4 1,16 1,27 1,33 1,48 1,73 1,115 1,154 1,176 1,206 5.357}
{0 CHEMBL42071,4 1,16 1,33 1,48 1,73 1,154 1,176 1,206 5.854}
{0 CHEMBL421052,1 1,2 1,3 1,4 1,5 1,16 1,21 1,26 1,30 1,33 1,49 1,81 1,115 1,116 1,152 1,176 1,206 5.129}
{0 CHEMBL42146,4 1,16 1,33 1,49 1,71 1,73 1,154 1,176 1,190 1,206 7.432}
{0 CHEMBL42176,1 1,2 1,3 1,16 1,33 1,40 1,58 1,152 1,154 1,176 1,206 7.102}
{0 CHEMBL42248,1 1,2 1,3 1,16 1,33 1,49 1,58 1,101 1,104 1,152 1,154 1,176 1,206 7.194}
{0 CHEMBL422724,3 1,5 1,16 1,26 1,30 1,33 1,49 1,81 1,82 1,96 1,164 1,175 1,176 1,177 1,206 4}
{0 CHEMBL42307,1 1,2 1,3 1,16 1,31 1,33 1,49 1,58 1,101 1,152 1,154 1,176 1,206 5.398}
{0 CHEMBL423099,1 1,2 1,3 1,4 1,6 1,11 1,16 1,33 1,49 1,58 1,115 1,137 1,154 1,177 1,206 6.62}
{0 CHEMBL423211,3 1,16 1,26 1,33 1,49 1,81 1,152 1,154 1,176 1,198 1,206 6.456}
{0 CHEMBL42329,1 1,2 1,3 1,16 1,33 1,40 1,58 1,145 1,154 1,206 5.742}
{0 CHEMBL423646,1 1,2 1,3 1,4 1,16 1,33 1,58 1,115 1,154 1,206 4}
{0 CHEMBL42367,16 1,33 1,49 1,104 1,154 1,176 1,206 4.77}
{0 CHEMBL42380,1 1,2 1,3 1,4 1,16 1,33 1,49 1,81 1,115 1,176 1,206 4}
{0 CHEMBL424022,5 1,16 1,26 1,30 1,33 1,49 1,81 1,82 1,96 1,175 1,176 1,177 1,206 6.21}
{0 CHEMBL424118,1 1,2 1,3 1,4 1,7 1,16 1,33 1,49 1,58 1,142 1,154 1,176 1,198 1,206 7.523}
{0 CHEMBL42415,1 1,2 1,3 1,4 1,12 1,16 1,33 1,39 1,49 1,96 1,115 1,175 1,176 1,177 1,206 6.092}
{0 CHEMBL42416,1 1,2 1,3 1,4 1,16 1,33 1,35 1,49 1,81 1,115 1,176 1,197 1,206 4}
{0 CHEMBL424246,1 1,2 1,3 1,15 1,16 1,21 1,47 1,49 1,124 1,154 1,206 5.56}
{0 CHEMBL42426,1 1,2 1,3 1,16 1,33 1,49 1,58 1,101 1,114 1,152 1,154 1,176 1,206 8.06}
{0 CHEMBL42430,16 1,33 1,49 1,104 1,154 1,176 1,206 4.77}
{0 CHEMBL424429,16 1,33 1,43 1,49 1,90 1,136 1,154 1,206 5.532}
{0 CHEMBL424499,5 1,16 1,19 1,28 1,33 1,48 1,49 1,154 1,176 1,198 1,206 7.046}
{0 CHEMBL424610,16 1,33 1,43 1,49 1,154 1,206 6.495}
{0 CHEMBL42466,1 1,2 1,3 1,16 1,33 1,49 1,58 1,101 1,104 1,152 1,154 1,176 1,206 6.824}
{0 CHEMBL42482,1 1,2 1,3 1,16 1,33 1,49 1,58 1,154 1,206 5.854}
{0 CHEMBL42499,1 1,2 1,3 1,4 1,16 1,33 1,49 1,81 1,115 1,176 1,206 4}
{0 CHEMBL427734,1 1,2 1,3 1,6 1,16 1,30 1,33 1,49 1,81 1,154 1,176 1,206 5.081}
{0 CHEMBL42871,1 1,2 1,3 1,4 1,5 1,12 1,14 1,16 1,26 1,27 1,33 1,39 1,49 1,73 1,80 1,96 1,169 1,175 1,176 1,177 1,206 7.569}
{0 CHEMBL42915,1 1,2 1,3 1,4 1,14 1,16 1,27 1,33 1,58 1,73 1,154 1,176 1,206 7.481}
{0 CHEMBL43122,1 1,2 1,3 1,16 1,31 1,33 1,49 1,58 1,101 1,152 1,154 1,176 1,206 5.367}
{0 CHEMBL432224,16 1,33 1,43 1,49 1,73 1,115 1,152 1,154 1,176 1,198 1,206 5.886}
{0 CHEMBL432648,1 1,2 1,3 1,16 1,33 1,58 1,154 1,206 6.13}
{0 CHEMBL432748,1 1,2 1,3 1,16 1,33 1,49 1,81 1,152 1,169 1,176 1,206 5.959}
{0 CHEMBL432781,1 1,2 1,3 1,6 1,9 1,11 1,15 1,16 1,20 1,22 1,23 1,33 1,37 1,39 1,49 1,58 1,73 1,152 1,154 1,176 1,206 5.444}
{0 CHEMBL433058,1 1,2 1,3 1,4 1,14 1,16 1,33 1,49 1,81 1,176 1,197 1,200 1,206 6.658}
{0 CHEMBL43307,1 1,2 1,3 1,4 1,12 1,16 1,33 1,39 1,49 1,96 1,115 1,175 1,176 1,177 1,206 5.046}
{0 CHEMBL43318,1 1,2 1,3 1,4 1,16 1,33 1,48 1,73 1,115 1,154 1,176 1,206 5.469}
{0 CHEMBL433392,6 1,9 1,11 1,15 1,16 1,20 1,22 1,23 1,33 1,35 1,36 1,37 1,41 1,49 1,152 1,154 1,176 1,206 4.076}
{0 CHEMBL433711,16 1,32 1,33 1,49 1,176 1,186 1,206 4}
{0 CHEMBL43372,1 1,2 1,3 1,4 1,5 1,12 1,14 1,16 1,21 1,26 1,27 1,30 1,33 1,39 1,49 1,81 1,96 1,175 1,176 1,177 1,206 7.444}
{0 CHEMBL433725,1 1,2 1,3 1,4 1,5 1,12 1,14 1,16 1,17 1,26 1,27 1,30 1,31 1,33 1,39 1,49 1,81 1,82 1,96 1,175 1,176 1,177 1,206 8.3}
{0 CHEMBL433908,1 1,2 1,3 1,4 1,16 1,33 1,49 1,58 1,81 1,115 1,154 1,170 1,176 1,206 5.924}
{0 CHEMBL434644,1 1,2 1,3 1,4 1,7 1,16 1,33 1,49 1,58 1,154 1,176 1,198 1,206 7.699}
{0 CHEMBL435378,16 1,33 1,49 1,113 1,154 1,206 5.456}
{0 CHEMBL435473,1 1,2 1,3 1,4 1,12 1,14 1,16 1,17 1,27 1,33 1,39 1,47 1,49 1,82 1,93 1,96 1,175 1,176 1,177 1,206 6.3}
{0 CHEMBL436244,1 1,2 1,3 1,4 1,14 1,16 1,33 1,49 1,58 1,115 1,154 1,176 1,206 4}
{0 CHEMBL43846,1 1,2 1,3 1,16 1,33 1,40 1,58 1,145 1,154 1,206 7.305}
{0 CHEMBL43848,1 1,2 1,3 1,16 1,33 1,39 1,58 1,73 1,101 1,152 1,154 1,176 1,206 4.959}
{0 CHEMBL43869,16 1,33 1,154 1,206 4.796}
{0 CHEMBL43875,16 1,33 1,49 1,130 1,154 1,176 1,206 4}
{0 CHEMBL43910,16 1,33 1,154 1,206 4}
{0 CHEMBL43918,1 1,2 1,3 1,4 1,16 1,33 1,56 1,73 1,115 1,154 1,176 1,206 4}
{0 CHEMBL44018,1 1,2 1,3 1,16 1,31 1,33 1,49 1,58 1,101 1,152 1,154 1,176 1,206 5.444}
{0 CHEMBL442328,16 1,33 1,49 1,154 1,197 1,206 4.666}
{0 CHEMBL442545,16 1,33 1,49 1,154 1,206 4.824}
{0 CHEMBL44260,16 1,33 1,49 1,154 1,206 5.745}
{0 CHEMBL444979,6 1,16 1,49 1,154 1,176 1,197 1,206 4.201}
{0 CHEMBL445637,1 1,2 1,3 1,16 1,33 1,58 1,152 1,154 1,176 1,206 6.553}
{0 CHEMBL446749,6 1,16 1,49 1,154 1,176 1,197 1,206 4.469}
{0 CHEMBL44793,1 1,2 1,3 1,4 1,5 1,12 1,14 1,16 1,17 1,26 1,27 1,30 1,33 1,39 1,49 1,81 1,82 1,96 1,175 1,176 1,177 1,206 4}
{0 CHEMBL448888,1 1,2 1,3 1,7 1,16 1,18 1,24 1,25 1,26 1,31 1,33 1,38 1,40 1,42 1,49 1,81 1,115 1,150 1,176 1,206 4.921}
{0 CHEMBL450008,1 1,2 1,3 1,6 1,16 1,30 1,33 1,49 1,81 1,121 1,152 1,154 1,176 1,206 5.959}
{0 CHEMBL450968,6 1,16 1,49 1,154 1,176 1,197 1,206 4.444}
{0 CHEMBL451379,1 1,2 1,3 1,7 1,16 1,24 1,25 1,26 1,31 1,33 1,38 1,40 1,49 1,81 1,115 1,150 1,154 1,176 1,206 5.168}
{0 CHEMBL46910,1 1,2 1,3 1,4 1,16 1,19 1,33 1,49 1,81 1,115 1,152 1,162 1,176 1,206 4}
{0 CHEMBL482076,1 1,2 1,3 1,6 1,16 1,20 1,49 1,154 1,176 1,197 1,206 4.237}
{0 CHEMBL492261,1 1,2 1,3 1,7 1,16 1,24 1,25 1,26 1,31 1,33 1,38 1,40 1,42 1,43 1,49 1,81 1,115 1,176 1,206 6.281}
{0 CHEMBL492425,1 1,2 1,3 1,16 1,24 1,25 1,26 1,31 1,33 1,38 1,42 1,49 1,81 1,115 1,150 1,176 1,206 6.368}
{0 CHEMBL492426,1 1,2 1,3 1,7 1,16 1,24 1,25 1,26 1,31 1,33 1,38 1,40 1,42 1,43 1,49 1,81 1,115 1,176 1,206 6.762}
{0 CHEMBL492438,1 1,2 1,3 1,7 1,16 1,24 1,25 1,26 1,31 1,33 1,38 1,40 1,42 1,49 1,81 1,115 1,150 1,176 1,206 7.301}
{0 CHEMBL492441,1 1,2 1,3 1,4 1,7 1,16 1,24 1,25 1,26 1,31 1,33 1,38 1,42 1,49 1,81 1,115 1,150 1,176 1,206 6.069}
{0 CHEMBL492442,1 1,2 1,3 1,4 1,16 1,24 1,25 1,26 1,31 1,33 1,38 1,42 1,49 1,81 1,115 1,150 1,176 1,206 6.126}
{0 CHEMBL492620,1 1,2 1,3 1,7 1,16 1,24 1,25 1,26 1,31 1,33 1,38 1,40 1,42 1,43 1,49 1,81 1,115 1,176 1,206 7.018}
{0 CHEMBL492641,1 1,2 1,3 1,7 1,16 1,24 1,25 1,26 1,31 1,33 1,38 1,40 1,42 1,49 1,81 1,115 1,150 1,176 1,206 7.143}
{0 CHEMBL492644,16 1,24 1,25 1,26 1,31 1,33 1,38 1,42 1,49 1,81 1,150 1,176 1,206 5.699}
{0 CHEMBL492676,1 1,2 1,3 1,7 1,16 1,24 1,25 1,26 1,31 1,33 1,38 1,40 1,42 1,43 1,49 1,81 1,115 1,130 1,162 1,176 1,206 6.836}
{0 CHEMBL492846,1 1,2 1,3 1,4 1,16 1,24 1,25 1,26 1,31 1,33 1,38 1,42 1,49 1,81 1,115 1,150 1,176 1,206 6.996}
{0 CHEMBL492865,1 1,2 1,3 1,7 1,16 1,24 1,25 1,26 1,31 1,33 1,38 1,40 1,42 1,43 1,49 1,81 1,115 1,130 1,176 1,206 5.3}
{0 CHEMBL493044,1 1,2 1,3 1,7 1,16 1,24 1,25 1,26 1,31 1,33 1,38 1,40 1,42 1,43 1,49 1,81 1,115 1,157 1,176 1,206 6.597}
{0 CHEMBL493052,1 1,2 1,3 1,7 1,16 1,24 1,25 1,26 1,31 1,33 1,38 1,40 1,42 1,49 1,81 1,115 1,150 1,176 1,206 6.401}
{0 CHEMBL493053,1 1,2 1,3 1,7 1,16 1,24 1,25 1,26 1,31 1,33 1,38 1,40 1,42 1,49 1,81 1,115 1,150 1,176 1,206 7.167}
{0 CHEMBL493071,1 1,2 1,3 1,7 1,16 1,24 1,25 1,26 1,31 1,33 1,38 1,40 1,42 1,43 1,49 1,81 1,115 1,136 1,176 1,206 6.32}
{0 CHEMBL493078,1 1,2 1,3 1,7 1,16 1,24 1,25 1,26 1,31 1,33 1,38 1,40 1,42 1,43 1,49 1,81 1,115 1,136 1,176 1,206 7.292}
{0 CHEMBL493086,1 1,2 1,3 1,7 1,16 1,22 1,24 1,25 1,26 1,31 1,33 1,38 1,40 1,42 1,43 1,49 1,73 1,81 1,115 1,154 1,176 1,206 5.007}
{0 CHEMBL493087,1 1,2 1,3 1,7 1,16 1,24 1,25 1,26 1,31 1,33 1,38 1,40 1,42 1,43 1,49 1,81 1,115 1,176 1,206 6.752}
{0 CHEMBL493243,16 1,24 1,25 1,26 1,31 1,33 1,38 1,42 1,49 1,81 1,150 1,176 1,206 4}
{0 CHEMBL493252,1 1,2 1,3 1,5 1,7 1,16 1,26 1,30 1,31 1,33 1,38 1,40 1,49 1,81 1,115 1,150 1,176 1,206 4.975}
{0 CHEMBL493275,1 1,2 1,3 1,7 1,11 1,16 1,24 1,25 1,26 1,31 1,33 1,38 1,40 1,42 1,43 1,49 1,81 1,110 1,115 1,154 1,176 1,206 5.446}
{0 CHEMBL493442,16 1,24 1,25 1,26 1,31 1,33 1,38 1,42 1,49 1,81 1,130 1,150 1,176 1,206 6.022}
{0 CHEMBL493452,1 1,2 1,3 1,7 1,16 1,22 1,31 1,33 1,38 1,40 1,49 1,115 1,150 1,176 1,206 5.004}
{0 CHEMBL493453,1 1,2 1,3 1,7 1,16 1,31 1,33 1,38 1,40 1,49 1,115 1,150 1,152 1,176 1,206 5.028}
{0 CHEMBL493681,1 1,2 1,3 1,16 1,24 1,25 1,26 1,31 1,33 1,38 1,42 1,49 1,81 1,115 1,150 1,176 1,206 6.242}
{0 CHEMBL493712,1 1,2 1,3 1,7 1,16 1,24 1,25 1,26 1,31 1,33 1,38 1,40 1,42 1,43 1,49 1,81 1,115 1,162 1,176 1,206 6.623}
{0 CHEMBL493886,1 1,2 1,3 1,7 1,16 1,24 1,25 1,26 1,31 1,33 1,38 1,40 1,42 1,43 1,49 1,81 1,113 1,115 1,154 1,176 1,206 5.559}
{0 CHEMBL493887,1 1,2 1,3 1,7 1,16 1,24 1,25 1,26 1,31 1,33 1,38 1,40 1,42 1,43 1,49 1,81 1,115 1,154 1,176 1,206 6.556}
{0 CHEMBL493901,1 1,2 1,3 1,4 1,7 1,16 1,24 1,25 1,26 1,31 1,33 1,38 1,40 1,42 1,43 1,49 1,81 1,115 1,176 1,206 6.604}
{0 CHEMBL493902,1 1,2 1,3 1,4 1,7 1,16 1,24 1,25 1,26 1,31 1,33 1,38 1,40 1,42 1,43 1,49 1,81 1,115 1,176 1,206 6.561}
{0 CHEMBL493913,1 1,2 1,3 1,7 1,16 1,24 1,25 1,26 1,31 1,33 1,38 1,40 1,42 1,43 1,49 1,81 1,115 1,176 1,206 5.74}
{0 CHEMBL494061,16 1,24 1,25 1,26 1,31 1,33 1,38 1,42 1,49 1,71 1,81 1,150 1,176 1,206 6.684}
{0 CHEMBL494062,16 1,24 1,25 1,26 1,31 1,33 1,38 1,42 1,49 1,81 1,150 1,176 1,197 1,206 5.295}
{0 CHEMBL494063,1 1,2 1,3 1,5 1,7 1,16 1,26 1,30 1,31 1,33 1,38 1,40 1,49 1,81 1,115 1,150 1,176 1,206 4.893}
{0 CHEMBL494064,1 1,2 1,3 1,7 1,16 1,24 1,25 1,26 1,31 1,33 1,38 1,40 1,42 1,43 1,49 1,81 1,115 1,176 1,206 6.122}
{0 CHEMBL494065,1 1,2 1,3 1,7 1,16 1,24 1,25 1,26 1,31 1,33 1,38 1,40 1,42 1,49 1,81 1,115 1,150 1,176 1,206 6.726}
{0 CHEMBL494085,1 1,2 1,3 1,7 1,16 1,26 1,31 1,33 1,38 1,40 1,49 1,81 1,115 1,150 1,176 1,206 5.839}
{0 CHEMBL494105,1 1,2 1,3 1,7 1,16 1,24 1,25 1,26 1,31 1,33 1,38 1,40 1,42 1,43 1,49 1,73 1,81 1,115 1,176 1,206 6.432}
{0 CHEMBL494260,16 1,24 1,25 1,26 1,31 1,33 1,38 1,42 1,49 1,81 1,150 1,152 1,176 1,206 5.943}
{0 CHEMBL494273,1 1,2 1,3 1,4 1,7 1,16 1,24 1,25 1,26 1,31 1,33 1,38 1,42 1,49 1,81 1,115 1,150 1,176 1,206 6.202}
{0 CHEMBL494288,16 1,24 1,25 1,26 1,31 1,33 1,38 1,42 1,49 1,81 1,150 1,162 1,176 1,206 5.354}
{0 CHEMBL494289,16 1,24 1,25 1,26 1,31 1,33 1,38 1,42 1,49 1,81 1,130 1,150 1,162 1,176 1,206 4}
{0 CHEMBL494504,1 1,2 1,3 1,7 1,16 1,24 1,25 1,26 1,31 1,33 1,38 1,40 1,42 1,43 1,49 1,81 1,115 1,176 1,206 6.376}
{0 CHEMBL494689,1 1,2 1,3 1,7 1,16 1,24 1,25 1,26 1,31 1,33 1,38 1,40 1,42 1,49 1,81 1,115 1,150 1,176 1,206 6.276}
{0 CHEMBL494690,1 1,2 1,3 1,7 1,16 1,24 1,25 1,26 1,31 1,33 1,38 1,40 1,42 1,43 1,49 1,81 1,115 1,152 1,176 1,206 6.23}
{0 CHEMBL494707,1 1,2 1,3 1,7 1,16 1,24 1,25 1,26 1,31 1,33 1,38 1,40 1,42 1,43 1,49 1,81 1,115 1,154 1,176 1,206 6.181}
{0 CHEMBL494710,1 1,2 1,3 1,7 1,16 1,24 1,25 1,26 1,31 1,33 1,38 1,40 1,42 1,43 1,49 1,81 1,115 1,176 1,206 5.244}
{0 CHEMBL494711,1 1,2 1,3 1,7 1,16 1,24 1,25 1,26 1,31 1,33 1,38 1,40 1,42 1,43 1,49 1,81 1,115 1,176 1,206 5.267}
{0 CHEMBL494881,1 1,2 1,3 1,7 1,16 1,24 1,25 1,26 1,31 1,33 1,38 1,40 1,42 1,43 1,49 1,81 1,115 1,162 1,176 1,206 6.388}
{0 CHEMBL494894,1 1,2 1,3 1,7 1,16 1,24 1,25 1,26 1,31 1,33 1,38 1,40 1,42 1,43 1,49 1,81 1,115 1,176 1,206 6.301}
{0 CHEMBL494918,1 1,2 1,3 1,7 1,16 1,24 1,25 1,26 1,31 1,33 1,38 1,40 1,42 1,43 1,49 1,81 1,95 1,115 1,176 1,206 5.429}
{0 CHEMBL495114,1 1,2 1,3 1,7 1,16 1,24 1,25 1,26 1,31 1,33 1,38 1,40 1,42 1,43 1,49 1,81 1,115 1,136 1,176 1,206 7.097}
{0 CHEMBL495134,1 1,2 1,3 1,7 1,16 1,24 1,25 1,26 1,31 1,33 1,38 1,40 1,42 1,43 1,49 1,81 1,104 1,115 1,176 1,206 5.413}
{0 CHEMBL495283,1 1,2 1,3 1,7 1,16 1,24 1,25 1,26 1,31 1,33 1,38 1,40 1,49 1,81 1,115 1,150 1,176 1,206 6.231}
{0 CHEMBL495328,1 1,2 1,3 1,7 1,16 1,24 1,25 1,26 1,31 1,33 1,38 1,40 1,42 1,43 1,49 1,81 1,115 1,176 1,206 6.179}
{0 CHEMBL495334,1 1,2 1,3 1,7 1,16 1,24 1,25 1,26 1,31 1,33 1,38 1,40 1,42 1,43 1,49 1,81 1,104 1,115 1,176 1,206 5.554}
{0 CHEMBL495486,1 1,2 1,3 1,5 1,7 1,16 1,26 1,30 1,31 1,33 1,38 1,40 1,49 1,81 1,115 1,150 1,176 1,206 5.36}
{0 CHEMBL50267,1 1,2 1,3 1,4 1,14 1,16 1,27 1,33 1,49 1,58 1,154 1,176 1,206 6.481}
{0 CHEMBL504317,6 1,16 1,33 1,49 1,145 1,154 1,176 1,197 1,206 4.854}
{0 CHEMBL504772,6 1,16 1,33 1,49 1,145 1,154 1,176 1,197 1,206 4.268}
{0 CHEMBL506027,6 1,16 1,49 1,154 1,176 1,197 1,206 4.248}
{0 CHEMBL51773,14 1,16 1,33 1,48 1,49 1,104 1,154 1,176 1,206 4}
{0 CHEMBL521582,16 1,31 1,33 1,43 1,49 1,104 1,176 1,203 1,206 6}
{0 CHEMBL521808,1 1,2 1,3 1,7 1,16 1,24 1,25 1,26 1,31 1,33 1,38 1,40 1,42 1,43 1,49 1,81 1,115 1,176 1,206 5.893}
{0 CHEMBL522185,16 1,24 1,25 1,26 1,31 1,33 1,38 1,42 1,49 1,81 1,150 1,162 1,176 1,206 5.14}
{0 CHEMBL522320,1 1,2 1,3 1,7 1,16 1,24 1,25 1,26 1,31 1,33 1,38 1,40 1,42 1,43 1,49 1,81 1,115 1,176 1,206 6.914}
{0 CHEMBL522510,1 1,2 1,3 1,7 1,16 1,24 1,25 1,26 1,31 1,33 1,38 1,40 1,42 1,43 1,49 1,81 1,115 1,162 1,176 1,206 6.947}
{0 CHEMBL522516,1 1,2 1,3 1,7 1,16 1,24 1,25 1,26 1,31 1,33 1,38 1,40 1,42 1,43 1,49 1,81 1,115 1,176 1,206 5.455}
{0 CHEMBL522530,1 1,2 1,3 1,7 1,16 1,24 1,25 1,26 1,31 1,33 1,38 1,40 1,42 1,43 1,49 1,81 1,115 1,176 1,206 6.364}
{0 CHEMBL522541,1 1,2 1,3 1,7 1,16 1,24 1,25 1,26 1,31 1,33 1,38 1,40 1,42 1,43 1,49 1,81 1,104 1,115 1,176 1,180 1,206 4.924}
{0 CHEMBL522869,1 1,2 1,3 1,7 1,16 1,24 1,25 1,26 1,31 1,33 1,38 1,40 1,42 1,49 1,81 1,115 1,150 1,176 1,206 6.163}
{0 CHEMBL522886,1 1,2 1,3 1,7 1,16 1,24 1,25 1,26 1,31 1,33 1,38 1,40 1,49 1,81 1,115 1,150 1,176 1,206 5.215}
{0 CHEMBL523167,1 1,2 1,3 1,7 1,16 1,24 1,25 1,26 1,31 1,33 1,38 1,40 1,42 1,43 1,49 1,81 1,115 1,157 1,176 1,206 6.886}
{0 CHEMBL523195,1 1,2 1,3 1,7 1,16 1,24 1,25 1,26 1,31 1,33 1,38 1,40 1,42 1,43 1,49 1,81 1,115 1,176 1,206 6.551}
{0 CHEMBL523345,1 1,2 1,3 1,4 1,14 1,16 1,24 1,25 1,26 1,31 1,33 1,38 1,42 1,49 1,81 1,115 1,150 1,176 1,206 5.635}
{0 CHEMBL523502,1 1,2 1,3 1,7 1,16 1,24 1,25 1,26 1,31 1,33 1,38 1,39 1,40 1,42 1,49 1,81 1,115 1,150 1,176 1,206 6.37}
{0 CHEMBL523671,1 1,2 1,3 1,7 1,16 1,24 1,25 1,26 1,31 1,33 1,38 1,40 1,42 1,49 1,81 1,115 1,150 1,176 1,206 6.447}
{0 CHEMBL523843,1 1,2 1,3 1,7 1,16 1,24 1,25 1,26 1,31 1,33 1,38 1,40 1,42 1,43 1,49 1,81 1,115 1,136 1,176 1,206 7.42}
{0 CHEMBL524012,1 1,2 1,3 1,7 1,16 1,24 1,25 1,26 1,31 1,33 1,38 1,40 1,42 1,43 1,49 1,81 1,107 1,115 1,176 1,177 1,206 6.22}
{0 CHEMBL524038,1 1,2 1,3 1,7 1,16 1,24 1,25 1,26 1,31 1,33 1,38 1,40 1,42 1,43 1,49 1,81 1,115 1,176 1,206 6.197}
{0 CHEMBL538070,1 1,2 1,3 1,4 1,7 1,16 1,33 1,49 1,58 1,154 1,176 1,198 1,206 6.553}
{0 CHEMBL540332,1 1,2 1,3 1,4 1,7 1,16 1,33 1,49 1,58 1,113 1,154 1,176 1,198 1,206 6.959}
{0 CHEMBL541600,1 1,2 1,3 1,4 1,7 1,16 1,33 1,49 1,58 1,113 1,154 1,176 1,198 1,206 5.745}
{0 CHEMBL542047,16 1,31 1,33 1,43 1,49 1,104 1,176 1,203 1,206 5}
{0 CHEMBL543689,1 1,2 1,3 1,4 1,7 1,16 1,33 1,49 1,58 1,154 1,176 1,198 1,206 6.602}
{0 CHEMBL543708,16 1,33 1,43 1,49 1,115 1,152 1,154 1,176 1,206 6.481}
{0 CHEMBL545597,16 1,31 1,33 1,43 1,49 1,104 1,176 1,203 1,206 6}
{0 CHEMBL553334,1 1,2 1,3 1,16 1,33 1,49 1,58 1,104 1,154 1,176 1,206 6}
{0 CHEMBL553885,5 1,49 1,80 1,134 1,176 1,186 1,206 4.553}
{0 CHEMBL554023,16 1,33 1,43 1,49 1,68 1,115 1,152 1,154 1,176 1,206 5.42}
{0 CHEMBL554030,9 1,15 1,16 1,33 1,48 1,110 1,154 1,206 4}
{0 CHEMBL554647,16 1,33 1,41 1,43 1,49 1,115 1,117 1,152 1,154 1,176 1,206 6.229}
{0 CHEMBL556378,16 1,33 1,43 1,49 1,115 1,152 1,154 1,176 1,179 1,206 5.409}
{0 CHEMBL557092,5 1,49 1,80 1,134 1,152 1,176 1,186 1,206 4.187}
{0 CHEMBL575060,49 1,176 1,206 5.642}
{0 CHEMBL57899,5 1,16 1,19 1,28 1,33 1,49 1,71 1,81 1,94 1,176 1,197 1,200 1,206 7.174}
{0 CHEMBL57932,1 1,2 1,3 1,4 1,5 1,14 1,16 1,33 1,49 1,80 1,81 1,176 1,197 1,200 1,206 7.119}
{0 CHEMBL57937,1 1,2 1,3 1,4 1,5 1,14 1,16 1,33 1,49 1,80 1,81 1,176 1,197 1,200 1,206 6.77}
{0 CHEMBL58127,1 1,2 1,3 1,4 1,14 1,16 1,33 1,49 1,81 1,176 1,197 1,200 1,206 5.284}
{0 CHEMBL58285,1 1,2 1,3 1,4 1,14 1,16 1,33 1,49 1,81 1,91 1,176 1,206 5.721}
{0 CHEMBL58405,1 1,2 1,3 1,4 1,5 1,14 1,16 1,33 1,49 1,80 1,81 1,139 1,154 1,176 1,197 1,200 1,206 6.959}
{0 CHEMBL58663,1 1,2 1,3 1,4 1,14 1,16 1,22 1,33 1,49 1,81 1,91 1,160 1,176 1,206 8.222}
{0 CHEMBL58746,1 1,2 1,3 1,4 1,14 1,16 1,33 1,49 1,52 1,81 1,91 1,147 1,176 1,206 7.143}
{0 CHEMBL58784,1 1,2 1,3 1,4 1,5 1,14 1,16 1,19 1,28 1,33 1,49 1,81 1,154 1,176 1,197 1,200 1,206 7.523}
{0 CHEMBL58898,1 1,2 1,3 1,4 1,14 1,16 1,33 1,47 1,49 1,81 1,176 1,197 1,200 1,206 6.027}
{0 CHEMBL58966,1 1,2 1,3 1,4 1,14 1,16 1,33 1,49 1,81 1,154 1,176 1,197 1,200 1,206 6.201}
{0 CHEMBL59011,1 1,2 1,3 1,4 1,5 1,14 1,16 1,33 1,49 1,81 1,88 1,176 1,197 1,200 1,206 6.046}
{0 CHEMBL59305,1 1,2 1,3 1,4 1,14 1,16 1,26 1,33 1,49 1,81 1,91 1,138 1,147 1,176 1,206 6.292}
{0 CHEMBL60017,1 1,2 1,3 1,4 1,14 1,16 1,22 1,33 1,49 1,81 1,86 1,176 1,197 1,200 1,206 7.347}
{0 CHEMBL60091,1 1,2 1,3 1,4 1,14 1,16 1,24 1,26 1,33 1,43 1,49 1,81 1,91 1,107 1,176 1,206 6.237}
{0 CHEMBL60398,1 1,2 1,3 1,4 1,14 1,16 1,33 1,49 1,81 1,176 1,206 5.194}
{0 CHEMBL61125,1 1,2 1,3 1,4 1,14 1,16 1,26 1,33 1,49 1,81 1,176 1,197 1,200 1,206 7.959}
{0 CHEMBL61153,1 1,2 1,3 1,4 1,14 1,16 1,26 1,33 1,49 1,81 1,176 1,197 1,200 1,206 8.301}
{0 CHEMBL61313,1 1,2 1,3 1,4 1,14 1,16 1,26 1,33 1,49 1,81 1,176 1,197 1,200 1,206 7.745}
{0 CHEMBL61447,1 1,2 1,3 1,4 1,14 1,16 1,33 1,49 1,81 1,145 1,147 1,176 1,197 1,200 1,206 7.102}
{0 CHEMBL61550,1 1,2 1,3 1,4 1,14 1,16 1,27 1,33 1,49 1,58 1,154 1,157 1,176 1,206 4.538}
{0 CHEMBL61582,1 1,2 1,3 1,4 1,14 1,16 1,33 1,49 1,81 1,154 1,176 1,187 1,197 1,200 1,206 7.553}
{0 CHEMBL61658,1 1,2 1,3 1,4 1,5 1,14 1,16 1,19 1,28 1,33 1,49 1,81 1,176 1,197 1,200 1,206 7.469}
{0 CHEMBL61740,1 1,2 1,3 1,4 1,5 1,14 1,16 1,33 1,49 1,81 1,176 1,206 5.77}
{0 CHEMBL61795,1 1,2 1,3 1,4 1,5 1,14 1,16 1,26 1,30 1,33 1,49 1,81 1,176 1,197 1,200 1,206 6.377}
{0 CHEMBL61942,1 1,2 1,3 1,4 1,5 1,14 1,16 1,21 1,26 1,30 1,33 1,49 1,81 1,176 1,206 7.523}
{0 CHEMBL62092,1 1,2 1,3 1,4 1,14 1,16 1,33 1,49 1,81 1,176 1,197 1,200 1,206 7.721}
{0 CHEMBL62148,1 1,2 1,3 1,4 1,14 1,16 1,26 1,33 1,49 1,81 1,176 1,197 1,200 1,206 8.222}
{0 CHEMBL62250,1 1,2 1,3 1,4 1,14 1,16 1,33 1,49 1,81 1,176 1,197 1,200 1,206 4.947}
{0 CHEMBL63386,1 1,2 1,3 1,4 1,16 1,21 1,33 1,49 1,58 1,115 1,154 1,157 1,176 1,206 4.161}
{0 CHEMBL64010,16 1,33 1,49 1,113 1,154 1,176 1,206 7.244}
{0 CHEMBL64417,1 1,2 1,3 1,16 1,33 1,40 1,49 1,58 1,154 1,157 1,176 1,206 4.102}
{0 CHEMBL64772,5 1,16 1,18 1,30 1,33 1,49 1,81 1,96 1,107 1,110 1,114 1,152 1,154 1,164 1,176 1,206 5.377}
{0 CHEMBL64819,1 1,2 1,3 1,4 1,16 1,33 1,49 1,58 1,115 1,154 1,157 1,176 1,206 4.432}
{0 CHEMBL65327,7 1,16 1,33 1,49 1,73 1,113 1,154 1,176 1,206 7.699}
{0 CHEMBL65930,16 1,33 1,49 1,113 1,154 1,206 4}
{0 CHEMBL66693,49 1,176 1,206 4.041}
{0 CHEMBL70914,1 1,2 1,3 1,6 1,16 1,33 1,48 1,115 1,154 1,206 6.213}
{0 CHEMBL72275,45 1,49 1,98 1,176 1,206 4.764}
{0 CHEMBL72534,1 1,2 1,3 1,4 1,6 1,16 1,33 1,48 1,115 1,154 1,206 6.86}
{0 CHEMBL72802,1 1,2 1,3 1,4 1,6 1,16 1,33 1,49 1,58 1,104 1,115 1,154 1,176 1,206 8.481}
{0 CHEMBL74455,6 1,16 1,30 1,33 1,48 1,49 1,154 1,158 1,206 6.25}
{0 CHEMBL74624,16 1,33 1,47 1,48 1,49 1,154 1,176 1,206 7}
{0 CHEMBL74836,6 1,16 1,33 1,48 1,154 1,206 6.87}
{0 CHEMBL771,5 1,49 1,161 1,176 1,206 5.133}
{0 CHEMBL773,49 1,176 1,206 5.208}
{0 CHEMBL77362,1 1,2 1,3 1,4 1,14 1,16 1,22 1,33 1,49 1,81 1,176 1,206 4.638}
{0 CHEMBL77569,1 1,2 1,3 1,7 1,16 1,33 1,40 1,49 1,81 1,169 1,176 1,206 6.523}
{0 CHEMBL78784,5 1,28 1,47 1,49 1,108 1,176 1,206 6.64}
{0 CHEMBL79312,1 1,2 1,3 1,4 1,6 1,9 1,11 1,15 1,16 1,20 1,22 1,23 1,33 1,37 1,48 1,49 1,58 1,115 1,152 1,154 1,176 1,206 4.488}
{0 CHEMBL79505,1 1,2 1,3 1,4 1,6 1,9 1,11 1,15 1,16 1,20 1,22 1,23 1,33 1,37 1,48 1,49 1,58 1,115 1,152 1,154 1,176 1,206 5.959}
{0 CHEMBL79556,3 1,6 1,9 1,11 1,15 1,16 1,20 1,22 1,23 1,33 1,35 1,37 1,41 1,48 1,49 1,95 1,152 1,154 1,176 1,206 5.745}
{0 CHEMBL80594,1 1,2 1,3 1,4 1,16 1,33 1,49 1,81 1,115 1,169 1,176 1,206 6.62}
{0 CHEMBL81025,1 1,2 1,3 1,4 1,6 1,9 1,11 1,15 1,16 1,20 1,22 1,23 1,33 1,35 1,37 1,41 1,48 1,49 1,58 1,115 1,152 1,154 1,176 1,206 5.585}
{0 CHEMBL81367,1 1,2 1,3 1,4 1,6 1,9 1,11 1,15 1,16 1,20 1,22 1,23 1,33 1,37 1,48 1,49 1,58 1,79 1,81 1,115 1,152 1,154 1,176 1,177 1,206 5.292}
{0 CHEMBL81874,6 1,9 1,11 1,15 1,16 1,20 1,22 1,23 1,33 1,37 1,48 1,49 1,152 1,154 1,176 1,206 5.108}
{0 CHEMBL82050,1 1,2 1,3 1,4 1,6 1,9 1,11 1,15 1,16 1,20 1,22 1,23 1,33 1,37 1,48 1,49 1,58 1,115 1,152 1,154 1,176 1,206 5.432}
{0 CHEMBL82086,3 1,5 1,47 1,49 1,108 1,176 1,206 6.886}
{0 CHEMBL82295,1 1,2 1,3 1,4 1,6 1,9 1,11 1,15 1,16 1,20 1,22 1,23 1,33 1,37 1,48 1,49 1,58 1,115 1,152 1,154 1,176 1,206 5.143}
{0 CHEMBL82684,1 1,2 1,3 1,4 1,6 1,9 1,11 1,15 1,16 1,20 1,22 1,23 1,33 1,37 1,41 1,48 1,49 1,57 1,58 1,115 1,152 1,154 1,176 1,206 5.187}
{0 CHEMBL83322,1 1,2 1,3 1,4 1,6 1,9 1,11 1,15 1,16 1,20 1,22 1,23 1,33 1,37 1,49 1,58 1,101 1,152 1,154 1,176 1,206 4}
{0 CHEMBL83446,1 1,2 1,3 1,4 1,6 1,9 1,11 1,15 1,16 1,20 1,22 1,23 1,33 1,37 1,48 1,49 1,58 1,115 1,152 1,154 1,176 1,206 5.018}
{0 CHEMBL83551,1 1,2 1,3 1,4 1,6 1,9 1,11 1,15 1,16 1,20 1,22 1,23 1,33 1,37 1,48 1,49 1,58 1,115 1,152 1,154 1,176 1,206 5.538}
{0 CHEMBL83720,6 1,16 1,33 1,49 1,154 1,176 1,206 4}
{0 CHEMBL83855,1 1,2 1,3 1,4 1,6 1,9 1,11 1,15 1,16 1,20 1,22 1,23 1,33 1,35 1,37 1,41 1,48 1,49 1,58 1,115 1,152 1,154 1,176 1,206 4.055}
{0 CHEMBL83901,1 1,2 1,3 1,4 1,6 1,9 1,11 1,15 1,16 1,20 1,22 1,23 1,33 1,37 1,48 1,49 1,58 1,115 1,131 1,152 1,154 1,175 1,176 1,206 5.268}
{0 CHEMBL83902,1 1,2 1,3 1,4 1,6 1,9 1,11 1,15 1,16 1,20 1,22 1,23 1,33 1,37 1,48 1,49 1,58 1,60 1,115 1,152 1,154 1,175 1,176 1,206 4.558}
{0 CHEMBL83919,1 1,2 1,3 1,4 1,6 1,9 1,11 1,15 1,16 1,20 1,22 1,23 1,33 1,35 1,37 1,41 1,48 1,49 1,58 1,115 1,152 1,154 1,176 1,206 4.656}
{0 CHEMBL84094,1 1,2 1,3 1,4 1,6 1,9 1,11 1,15 1,16 1,20 1,22 1,23 1,33 1,37 1,43 1,48 1,49 1,58 1,115 1,152 1,154 1,206 5.013}
{0 CHEMBL84283,3 1,6 1,9 1,11 1,15 1,16 1,20 1,22 1,23 1,33 1,37 1,48 1,49 1,95 1,152 1,154 1,176 1,206 5.498}
{0 CHEMBL85567,1 1,2 1,3 1,4 1,5 1,7 1,8 1,10 1,13 1,16 1,18 1,21 1,26 1,29 1,30 1,31 1,33 1,34 1,49 1,81 1,114 1,176 1,206 9}
{0 CHEMBL86164,6 1,9 1,11 1,15 1,16 1,20 1,22 1,23 1,33 1,35 1,37 1,41 1,48 1,49 1,152 1,154 1,176 1,206 4.469}
{0 CHEMBL86824,16 1,33 1,43 1,49 1,68 1,108 1,154 1,175 1,205 1,206 4.638}
{0 CHEMBL8693,1 1,2 1,3 1,7 1,16 1,33 1,40 1,49 1,54 1,81 1,101 1,176 1,206 6.721}
{0 CHEMBL87065,5 1,16 1,31 1,33 1,49 1,176 1,206 5.523}
{0 CHEMBL8829,1 1,2 1,3 1,6 1,16 1,22 1,33 1,49 1,58 1,147 1,154 1,161 1,176 1,198 1,201 1,206 5.086}
{0 CHEMBL88333,5 1,16 1,33 1,49 1,176 1,206 6.155}
{0 CHEMBL89086,1 1,2 1,3 1,4 1,14 1,16 1,33 1,49 1,58 1,113 1,115 1,147 1,154 1,176 1,206 5.553}
{0 CHEMBL8910,6 1,16 1,26 1,30 1,33 1,49 1,81 1,121 1,154 1,176 1,206 5.851}
{0 CHEMBL89271,5 1,16 1,33 1,49 1,176 1,206 5.022}
{0 CHEMBL89477,16 1,33 1,43 1,49 1,108 1,154 1,175 1,206 4.509}
{0 CHEMBL8967,6 1,16 1,26 1,30 1,33 1,35 1,41 1,49 1,81 1,121 1,142 1,154 1,176 1,206 4.478}
{0 CHEMBL89739,5 1,16 1,33 1,49 1,176 1,206 4.342}
{0 CHEMBL8992,16 1,26 1,33 1,49 1,54 1,81 1,101 1,176 1,206 5.699}
{0 CHEMBL8995,1 1,2 1,3 1,4 1,6 1,16 1,30 1,33 1,49 1,81 1,115 1,121 1,154 1,176 1,206 6.319}
{0 CHEMBL89957,3 1,6 1,9 1,11 1,15 1,16 1,20 1,22 1,23 1,33 1,35 1,36 1,37 1,41 1,49 1,95 1,96 1,110 1,152 1,154 1,176 1,206 4.268}
{0 CHEMBL90242,3 1,6 1,9 1,11 1,15 1,16 1,20 1,22 1,23 1,33 1,36 1,37 1,49 1,95 1,152 1,154 1,176 1,206 5.444}
{0 CHEMBL90253,1 1,2 1,3 1,15 1,16 1,33 1,47 1,58 1,154 1,206 6.69}
{0 CHEMBL9037,1 1,2 1,3 1,4 1,16 1,33 1,49 1,54 1,81 1,115 1,152 1,176 1,206 4.975}
{0 CHEMBL9044,1 1,2 1,3 1,4 1,6 1,16 1,22 1,33 1,49 1,58 1,115 1,147 1,154 1,161 1,176 1,206 6.319}
{0 CHEMBL90484,5 1,6 1,9 1,11 1,15 1,16 1,20 1,22 1,23 1,30 1,33 1,37 1,49 1,81 1,123 1,152 1,154 1,176 1,206 4.201}
{0 CHEMBL90625,5 1,16 1,33 1,49 1,176 1,206 4.616}
{0 CHEMBL90705,3 1,6 1,9 1,11 1,15 1,16 1,20 1,22 1,23 1,33 1,37 1,49 1,95 1,152 1,154 1,176 1,206 5.357}
{0 CHEMBL90940,3 1,6 1,9 1,11 1,15 1,16 1,20 1,22 1,23 1,32 1,33 1,37 1,49 1,73 1,95 1,152 1,154 1,176 1,206 5.824}
{0 CHEMBL91115,3 1,6 1,9 1,11 1,15 1,16 1,20 1,22 1,23 1,33 1,36 1,37 1,49 1,95 1,152 1,154 1,176 1,198 1,201 1,206 5.585}
{0 CHEMBL9159,1 1,2 1,3 1,6 1,16 1,22 1,33 1,35 1,41 1,49 1,58 1,142 1,147 1,152 1,154 1,161 1,176 1,206 4.975}
{0 CHEMBL91677,3 1,6 1,9 1,11 1,15 1,16 1,20 1,22 1,23 1,33 1,36 1,37 1,49 1,62 1,95 1,152 1,154 1,176 1,206 4.456}
{0 CHEMBL91698,1 1,2 1,3 1,16 1,33 1,49 1,58 1,154 1,206 6.65}
{0 CHEMBL91742,5 1,16 1,26 1,30 1,33 1,49 1,81 1,176 1,178 1,206 6.082}
{0 CHEMBL91801,3 1,16 1,33 1,49 1,95 1,154 1,191 1,206 5.979}
{0 CHEMBL92005,6 1,9 1,11 1,15 1,16 1,20 1,22 1,23 1,33 1,37 1,49 1,73 1,152 1,154 1,176 1,206 5.569}
{0 CHEMBL92080,1 1,2 1,3 1,15 1,16 1,47 1,49 1,124 1,154 1,206 5.75}
{0 CHEMBL92084,1 1,2 1,3 1,15 1,16 1,47 1,49 1,124 1,154 1,206 5.54}
{0 CHEMBL92143,1 1,2 1,3 1,16 1,49 1,124 1,154 1,206 6.04}
{0 CHEMBL92194,1 1,2 1,3 1,16 1,49 1,95 1,121 1,154 1,172 1,206 5.43}
{0 CHEMBL92282,1 1,2 1,3 1,16 1,49 1,124 1,154 1,206 6.27}
{0 CHEMBL92433,5 1,6 1,9 1,11 1,15 1,16 1,20 1,22 1,23 1,30 1,33 1,35 1,37 1,41 1,49 1,81 1,123 1,152 1,154 1,176 1,206 4.071}
{0 CHEMBL92456,1 1,2 1,3 1,16 1,33 1,58 1,154 1,206 6.246}
{0 CHEMBL9253,1 1,2 1,3 1,4 1,6 1,16 1,30 1,33 1,35 1,41 1,49 1,81 1,115 1,121 1,142 1,154 1,176 1,206 4.577}
{0 CHEMBL92646,1 1,3 1,16 1,33 1,48 1,154 1,206 5.33}
{0 CHEMBL92674,1 1,2 1,3 1,15 1,16 1,47 1,49 1,95 1,154 1,172 1,206 5.8}
{0 CHEMBL9281,1 1,2 1,3 1,6 1,16 1,22 1,33 1,40 1,49 1,58 1,147 1,154 1,161 1,176 1,206 6.796}
{0 CHEMBL92845,1 1,2 1,3 1,15 1,16 1,33 1,47 1,49 1,58 1,154 1,206 6.33}
{0 CHEMBL93062,1 1,2 1,3 1,15 1,16 1,47 1,49 1,124 1,154 1,206 6.09}
{0 CHEMBL93076,3 1,6 1,9 1,11 1,15 1,16 1,20 1,22 1,23 1,33 1,35 1,36 1,37 1,41 1,49 1,95 1,152 1,154 1,176 1,198 1,201 1,206 4.149}
{0 CHEMBL93164,1 1,2 1,3 1,15 1,16 1,33 1,47 1,58 1,154 1,206 6.73}
{0 CHEMBL93165,1 1,2 1,3 1,15 1,16 1,47 1,49 1,124 1,143 1,154 1,206 6.72}
{0 CHEMBL93169,3 1,5 1,47 1,49 1,108 1,176 1,206 6.883}
{0 CHEMBL93473,1 1,2 1,3 1,15 1,16 1,33 1,47 1,58 1,154 1,206 5.72}
{0 CHEMBL93798,1 1,2 1,3 1,4 1,5 1,16 1,30 1,33 1,49 1,81 1,115 1,176 1,178 1,206 7.886}
{0 CHEMBL93837,3 1,15 1,16 1,33 1,47 1,49 1,95 1,154 1,206 6.3}
{0 CHEMBL94018,1 1,2 1,3 1,16 1,33 1,48 1,58 1,154 1,206 6.68}
{0 CHEMBL94925,1 1,2 1,3 1,16 1,33 1,49 1,58 1,154 1,206 6.34}
{0 CHEMBL96359,1 1,3 1,16 1,33 1,48 1,49 1,95 1,154 1,206 6.29}
{0 CHEMBL96426,1 1,2 1,3 1,5 1,16 1,18 1,29 1,30 1,33 1,40 1,49 1,81 1,114 1,176 1,206 6.959}
{0 CHEMBL96878,1 1,2 1,3 1,15 1,16 1,21 1,33 1,47 1,49 1,58 1,154 1,206 5.82}
{0 CHEMBL9790,15 1,43 1,49 1,64 1,152 1,176 1,194 1,199 1,206 5.102}
