"molecule_id","SpMin1_Bh.s.","nCrs","C.002","nCs","CATS2D_03_DA","C.042","CATS2D_07_DL","Eta_betaS_A","C.031","GATS1v","GATS2v","CATS2D_02_DA","NssCH2","SpMin2_Bh.s.","SpMin2_Bh.v.","SssCH2","nArNHR","C.025","MATS1i","Chi1_EA.dm.","nCsp3","Mv","Mp","GATS1i","N.070","CIC5","SIC5","SpMin7_Bh.s.","AMW","H.","N.071","GATS1m","nArNR2","SpMin2_Bh.p.","SpMin6_Bh.s.","P_VSA_e_3","ATS3i","GATS2m","nN","CATS2D_03_DD","Eig01_EA.ri.","SpDiam_EA.ri.","SpMax_EA.ri.","SsssCH","C.","CIC4","nImidazoles","SIC4","GATS2p","H.046","Eta_betaP_A","CATS2D_06_DL","ATSC3v","PCR","CATS2D_07_LL","SpMin1_Bh.m.","C.032","H.052","Eta_L_A","CATS2D_06_LL","Eta_FL_A","ATSC1m","Rperim","GATS1p","nCsp2","pXC50"
{1 1.154,8 0.63,10 0.805,11 0.931,12 1,14 1.117,15 2.009,18 3,19 -0.04,20 2.498,21 1,22 0.699,23 0.73,24 0.959,26 0.669,27 0.877,28 0.218,29 8.778,30 37.2,32 0.724,34 1.994,35 0.336,36 50.357,37 4.722,38 1.025,39 3,41 3.103,42 5.103,43 3.103,45 48.8,46 0.669,47 1,48 0.877,49 1.087,51 0.87,53 8.97,54 1.461,55 12,56 2.012,59 0.187,60 18,61 0.298,62 7.483,63 23,64 0.931,65 20,66 5.602}
{0 CHEMBL101253,1 1.278,3 1,4 1,5 1,7 2,8 0.63,10 0.771,11 0.954,12 1,13 1,14 1.07,15 1.974,16 0.72,17 1,18 3,19 0.037,20 28.435,21 1,22 0.702,23 0.736,24 1,26 0.45,27 0.915,28 0.218,29 8.671,30 37.5,32 0.571,34 1.966,35 0.218,36 68.122,37 4.697,38 0.711,39 4,41 3.096,42 5.096,43 3.096,45 50,46 0.5,48 0.906,49 0.975,51 0.9,52 1,53 8.915,54 1.535,55 11,56 2.119,59 0.185,60 13,61 0.307,62 5.871,63 22,64 0.8,65 19,66 5}
{0 CHEMBL103667,1 1.294,5 1,7 7,8 0.647,10 1.032,11 0.888,12 3,13 6,14 1.249,15 2.033,16 4.856,18 3,19 -0.126,20 47.755,21 11,22 0.614,23 0.652,24 1.355,26 0.922,27 0.853,28 0.72,29 6.944,30 48.7,32 0.848,34 2.032,35 0.825,36 57.585,37 5.428,38 0.877,39 5,41 3.316,42 5.316,43 3.316,45 40.8,46 0.948,48 0.848,49 0.93,50 12,51 0.59,52 6,53 20.619,54 1.479,55 11,56 2.137,59 0.241,60 11,61 0.241,62 17.099,63 27,64 1.168,65 20,66 5.701}
{0 CHEMBL105442,1 1.118,2 2,3 2,4 2,7 4,8 0.63,10 0.716,11 0.911,12 1,13 3,14 1.031,15 1.896,16 2.541,17 1,18 1,19 0.042,20 19.271,21 4,22 0.708,23 0.754,24 0.846,26 0.308,27 0.942,28 0.17,29 12.274,30 35.9,32 0.467,34 1.883,35 0.252,36 38.636,37 4.69,38 0.575,39 2,41 3.063,42 5.063,43 3.063,44 0.452,45 43.6,46 0.308,48 0.942,49 0.692,50 4,51 0.56,52 1,53 8.732,54 1.356,55 7,56 1.975,58 1,59 0.252,60 7,61 0.226,62 0.871,63 15,64 0.56,65 13,66 5}
{0 CHEMBL1082152,1 1.201,4 1,7 6,8 0.65,10 0.842,11 0.858,12 2,13 2,14 1.144,15 2.008,16 -0.254,17 1,18 3,19 -0.025,20 20.101,21 4,22 0.661,23 0.673,24 1.064,25 1,26 0.175,27 0.969,28 0.349,29 8.189,30 40,32 0.73,34 2.01,35 0.487,36 37.921,37 4.971,38 0.785,39 3,40 2,41 3.369,42 5.369,43 3.369,44 -0.926,45 44,46 0.215,48 0.962,49 0.9,51 0.633,52 7,53 11.711,54 1.439,55 5,56 2.037,59 0.213,60 6,61 0.266,62 8.719,63 20,64 0.939,65 18,66 5.174}
{0 CHEMBL1094135,1 1.303,2 2,3 2,4 2,5 2,8 0.683,10 0.892,11 0.766,12 3,13 2,14 1.063,15 1.972,16 1.431,17 1,18 2,19 -0.096,20 29.999,21 4,22 0.653,23 0.671,24 1.298,26 0.352,27 0.935,28 0.256,29 7.964,30 40.9,32 0.728,34 1.969,35 0.474,36 102.919,37 4.769,38 0.718,39 6,41 3.251,42 5.251,43 3.251,45 40.9,46 0.352,48 0.935,49 0.843,50 4,51 0.712,52 2,53 9.096,54 1.433,55 4,56 2.03,57 1,59 0.205,60 1,61 0.279,62 8.128,63 19,64 1.054,65 14,66 7.18}
{0 CHEMBL1094477,1 1.303,2 2,3 2,4 2,5 1,8 0.67,10 0.876,11 0.804,12 3,13 2,14 1.136,15 1.993,16 1.474,17 1,18 3,19 -0.046,20 27.144,21 4,22 0.651,23 0.676,24 1.238,26 0.361,27 0.934,28 0.254,29 7.777,30 41.9,32 0.75,34 1.981,35 0.474,36 102.919,37 4.775,38 0.679,39 6,41 3.251,42 5.251,43 3.251,45 41.9,46 0.361,48 0.934,49 0.886,50 7,51 0.72,52 2,53 9.631,54 1.431,55 7,56 2.048,57 1,59 0.209,60 2,61 0.273,62 8.183,63 19,64 0.989,65 14,66 6.618}
{0 CHEMBL1173655,1 1.214,2 2,3 1,4 2,5 1,7 3,8 0.676,10 0.954,11 0.834,12 2,13 4,14 1.154,15 1.951,16 2.506,17 1,18 1,19 -0.212,20 46.591,21 7,22 0.648,23 0.671,24 1.32,26 0.432,27 0.927,28 0.469,29 8.237,30 42.4,32 0.63,34 1.952,35 0.699,36 72.717,37 5.121,38 0.748,39 5,41 3.041,42 5.041,43 3.041,44 -0.113,45 40.7,46 0.432,48 0.927,49 0.861,51 0.603,53 13.267,54 1.446,55 3,56 2.063,59 0.221,60 7,61 0.261,62 10.471,63 21,64 1.102,65 17,66 5}
{0 CHEMBL119385,1 1.152,8 0.643,10 0.676,11 0.805,14 1.038,15 1.945,18 1,19 -0.001,20 21.577,22 0.784,23 0.798,24 0.806,26 0.216,27 0.958,28 0.105,29 11.791,30 24.3,32 0.518,34 1.944,35 0.16,36 36.45,37 4.592,38 0.658,39 3,41 3.195,42 5.195,43 3.195,45 51.4,46 0.216,48 0.958,49 0.829,51 0.714,53 5.947,54 1.445,55 2,56 1.985,59 0.203,60 8,61 0.277,62 0.365,63 22,64 0.692,65 19,66 5}
{0 CHEMBL1230020,1 1.273,3 1,4 1,7 2,8 0.639,10 0.838,11 0.906,12 3,13 2,14 1.104,15 1.969,16 0.076,18 3,19 -0.071,20 6.141,21 3,22 0.699,23 0.71,24 1.045,25 1,26 0.262,27 0.951,28 0.19,29 10.094,30 34.1,32 0.652,34 1.973,35 0.275,36 49.976,37 4.795,38 0.811,39 3,41 3.247,42 5.247,43 3.247,45 41.5,46 0.262,48 0.951,49 1.044,50 3,51 0.704,52 2,53 8.416,54 1.454,55 3,56 1.968,58 2,59 0.214,60 6,61 0.257,62 5.948,63 15,64 1.107,65 14,66 5}
{0 CHEMBL1236095,1 1.4,2 5,3 6,4 7,5 2,8 0.668,10 1.006,11 0.882,12 4,13 8,14 1.306,15 2.057,16 5.737,17 1,18 5,19 -0.125,20 60.85,21 14,22 0.63,23 0.65,24 1.202,26 0.816,27 0.874,28 0.763,29 7.691,30 44.3,32 0.727,34 2.05,35 0.825,36 109.167,37 5.594,38 0.703,39 8,41 3.258,42 5.258,43 3.258,44 -0.068,45 39.8,46 0.816,48 0.874,49 0.898,50 14,51 0.541,52 2,53 23.592,54 1.471,55 13,56 2.078,57 1,59 0.247,60 10,61 0.231,62 17.274,63 31,64 1.164,65 21,66 6.74}
{0 CHEMBL1236107,1 1.213,8 0.673,10 0.783,11 0.768,14 1.02,15 2.006,18 2,19 0.012,20 4.873,21 1,22 0.716,23 0.743,24 1.039,26 0.122,27 0.977,28 0.204,29 9.217,30 33.3,32 0.629,34 2.038,35 0.305,36 86.378,37 4.597,38 0.745,39 7,41 2.934,42 4.934,43 2.934,45 46.2,46 0.122,48 0.977,49 0.881,51 0.865,53 6.669,54 1.628,55 6,56 2.094,59 0.189,60 2,61 0.302,62 5.169,63 24,64 0.838,65 17,66 5}
{0 CHEMBL1240703,1 1.377,2 4,3 1,4 4,7 8,8 0.693,10 0.851,11 0.763,12 1,13 1,14 1.342,15 2.068,16 0.465,18 7,19 -0.131,20 42.947,21 9,22 0.669,23 0.692,24 1.228,26 0.382,27 0.938,28 0.735,29 7.928,30 40.5,32 0.703,34 2.068,35 0.827,36 24.933,37 5.503,38 0.763,39 4,41 3.613,42 5.613,43 3.613,44 -2.558,45 47.3,46 0.49,48 0.921,49 0.809,51 0.614,52 7,53 19.403,54 1.54,55 15,56 2.077,59 0.229,60 21,61 0.256,62 13.58,63 32,64 0.984,65 26,66 5}
{0 CHEMBL1241674,1 1.148,4 1,5 1,7 3,8 0.685,10 0.83,11 0.808,12 1,14 1.126,15 1.998,18 2,19 -0.032,20 8.663,21 3,22 0.653,23 0.674,24 1.225,26 0.5,27 0.905,28 0.15,29 7.907,30 41,32 0.768,34 2.01,35 0.246,36 101.693,37 4.699,38 0.646,39 6,41 3.22,42 5.22,43 3.22,44 0.147,45 41,46 0.5,48 0.905,49 0.946,51 0.739,52 5,53 7.973,54 1.54,55 2,56 2.002,58 6,59 0.207,60 3,61 0.273,62 7.475,63 18,64 0.935,65 13,66 6.201}
{0 CHEMBL124660,1 1.418,2 3,3 4,4 5,7 3,8 0.683,10 1.137,11 0.94,12 2,13 12,14 1.299,15 2.043,16 11.506,18 1,19 -0.347,20 55.107,21 16,22 0.596,23 0.633,24 1.654,26 0.943,27 0.852,28 0.825,29 6.781,30 50.6,31 1,32 0.862,33 1,34 2.029,35 1.013,36 60.955,37 5.586,38 0.965,39 6,41 3.055,42 5.055,43 3.055,44 0.106,45 37.3,46 0.943,48 0.852,49 0.977,50 2,51 0.488,53 23.063,54 1.377,56 2.072,58 10,59 0.266,60 1,61 0.221,62 19.498,63 28,64 1.349,65 15,66 5}
{0 CHEMBL1270230,1 1.114,5 1,7 2,8 0.655,10 0.733,11 0.94,12 3,14 0.908,15 1.945,18 2,19 0.073,20 4.851,22 0.674,23 0.692,24 1.079,26 0.353,27 0.931,29 8.216,30 38.2,32 0.762,34 1.965,35 0.066,36 116.151,37 4.459,38 0.727,39 5,41 3.128,42 5.128,43 3.128,45 44.1,46 0.353,48 0.931,49 1.021,51 0.857,52 4,53 6.465,54 1.449,55 2,56 2.028,57 1,59 0.172,60 3,61 0.311,62 5.785,63 17,64 0.795,65 15,66 5}
{0 CHEMBL1272089,1 1.303,2 2,3 2,4 2,5 2,8 0.69,10 0.861,11 0.812,12 3,13 2,14 1.061,15 1.969,16 1.148,17 1,18 2,19 -0.093,20 30.73,21 4,22 0.679,23 0.666,24 1.049,26 0.352,27 0.935,28 0.173,29 9.191,30 34.1,32 0.602,34 1.969,35 0.257,36 102.919,37 4.778,38 0.546,39 6,41 3.251,42 5.251,43 3.251,45 40.9,46 0.352,48 0.935,49 0.818,50 4,51 0.638,52 2,53 8.135,54 1.433,55 4,56 2.029,57 1,59 0.204,60 1,61 0.269,62 5.643,63 19,64 1.05,65 14,66 5.914}
{0 CHEMBL1287853,1 1.224,2 2,3 2,4 2,7 7,8 0.649,10 1.07,11 0.939,12 5,13 6,14 1.211,15 2.017,16 6.521,17 2,18 1,19 -0.223,20 60.338,21 11,22 0.608,23 0.65,24 1.52,26 0.987,27 0.841,28 0.787,29 7.188,30 49.3,32 0.881,34 2.016,35 0.954,36 89.122,37 5.411,38 0.851,39 6,41 3.215,42 5.215,43 3.215,45 37,46 0.987,48 0.841,49 0.985,50 3,51 0.608,52 4,53 19.753,54 1.437,55 12,56 2.011,57 1,58 13,59 0.243,60 7,61 0.232,62 19.611,63 23,64 1.309,65 16,66 6.347}
{0 CHEMBL1288582,1 1.136,5 1,8 0.675,10 0.781,11 0.799,14 1.026,15 1.971,18 1,19 0.028,20 4.651,21 1,22 0.685,23 0.704,24 1.064,26 0.149,27 0.97,28 0.136,29 8.26,30 37.5,32 0.687,34 1.978,35 0.251,36 66.897,37 4.391,38 0.797,39 4,40 1,41 3.099,42 5.099,43 3.099,45 46.9,46 0.149,48 0.97,49 0.89,51 0.825,52 2,53 5.937,54 1.562,55 3,56 2.005,59 0.187,60 2,61 0.306,62 5.357,63 18,64 0.899,65 14,66 5.058}
{0 CHEMBL1289926,1 1.18,7 4,8 0.616,10 0.785,11 0.878,12 1,14 1.081,15 1.983,18 2,19 0.09,20 5.913,21 1,22 0.689,23 0.727,24 0.947,26 0.103,27 0.981,28 0.241,29 8.402,30 39.1,32 0.711,34 1.978,35 0.324,36 68.122,37 4.752,38 0.846,39 4,41 3.022,42 5.022,43 3.022,45 47.8,46 0.103,48 0.981,49 0.875,51 0.839,52 3,53 10.629,54 1.631,55 8,56 2.015,59 0.194,60 9,61 0.297,62 7.861,63 21,64 0.794,65 21,66 5.409}
{0 CHEMBL1336,1 1.099,5 1,7 5,8 0.656,10 0.824,11 0.908,12 3,14 1.065,15 1.985,18 1,19 -0.089,20 35.352,21 2,22 0.696,23 0.691,24 1.018,26 0.365,27 0.935,28 0.238,29 9.685,30 33.3,32 0.554,34 1.995,35 0.258,36 70.818,37 4.837,38 0.611,39 4,41 2.944,42 4.944,43 2.944,45 43.8,46 0.406,48 0.927,49 0.927,51 0.703,53 8.02,54 1.441,55 8,56 1.999,59 0.187,60 4,61 0.286,62 5.104,63 18,64 0.944,65 19,66 5.456}
{0 CHEMBL1421,1 1.314,5 1,7 2,8 0.689,9 1,10 0.939,11 0.832,12 3,13 6,14 1.136,15 2.007,16 4.286,17 1,18 1,19 -0.284,20 53.106,21 8,22 0.642,23 0.679,24 1.516,26 0.568,27 0.903,28 0.605,29 8.272,30 44.1,31 1,32 0.673,33 1,34 1.998,35 0.668,36 92.627,37 5.151,38 0.718,39 7,41 2.855,42 4.855,43 2.855,45 37.3,46 0.568,48 0.903,49 0.852,50 3,51 0.576,53 13.753,54 1.4,55 1,56 2.006,59 0.237,60 5,61 0.246,62 11.465,63 23,64 0.997,65 14,66 5}
{0 CHEMBL14762,1 1.23,3 1,4 3,5 1,6 1,7 3,8 0.673,10 1.076,11 0.977,12 3,13 3,14 1.17,15 1.989,16 1.473,17 2,18 1,19 -0.298,20 38.665,21 8,22 0.598,23 0.637,24 1.604,25 2,26 0.697,27 0.878,28 0.469,29 6.817,30 50,32 0.904,34 1.983,35 0.623,36 88.277,37 5.061,38 0.894,39 6,40 1,41 3.01,42 5.01,43 3.01,44 0.161,45 36.5,46 0.697,47 1,48 0.878,49 1.024,50 3,51 0.577,52 6,53 13.299,54 1.418,56 2.043,57 1,58 8,59 0.249,61 0.236,62 12.071,63 15,64 1.231,65 11,66 5.737}
{0 CHEMBL1614701,1 1.174,5 1,6 1,7 4,8 0.667,10 0.773,11 0.712,12 1,13 2,14 1.049,15 1.922,16 -0.363,17 1,18 1,19 -0.097,20 21.153,21 3,22 0.694,23 0.711,24 1.144,26 0.208,27 0.961,28 0.172,29 10.898,30 35.7,32 0.484,34 1.912,35 0.256,36 103.275,37 4.72,38 0.584,39 4,41 3.175,42 5.175,43 3.175,45 40.5,46 0.208,47 1,48 0.961,49 0.67,51 0.593,52 2,53 7.961,54 1.449,55 1,56 1.996,59 0.223,60 3,61 0.255,62 3.015,63 15,64 0.767,65 14,66 5}
{0 CHEMBL1614725,1 1.187,3 1,4 1,5 2,7 2,8 0.664,10 0.915,11 0.886,12 2,13 3,14 1.134,15 1.991,16 0.762,17 1,18 1,19 -0.129,20 44.351,21 7,22 0.66,23 0.67,24 1.124,26 0.449,27 0.925,28 0.531,29 8.699,30 39.7,32 0.611,34 2.003,35 0.622,36 71.492,37 5.221,38 0.622,39 5,41 3.022,42 5.022,43 3.022,45 41.3,46 0.449,48 0.925,49 0.952,51 0.592,53 13.551,54 1.516,55 5,56 2.003,58 6,59 0.22,60 9,61 0.251,62 9.847,63 21,64 1.038,65 19,66 5}
{0 CHEMBL162,1 1.366,2 4,3 1,4 4,5 1,7 10,8 0.707,10 0.868,11 0.734,12 1,13 2,14 1.349,15 2.07,16 1.286,18 6,19 -0.127,20 43.083,21 9,22 0.656,23 0.685,24 1.254,26 0.365,27 0.938,28 0.67,29 7.649,30 42.6,32 0.724,34 2.068,35 0.758,36 39.82,37 5.337,38 0.771,39 4,41 3.602,42 5.602,43 3.602,44 -0.335,45 45.9,46 0.496,48 0.916,49 0.782,51 0.557,52 10,53 17.155,54 1.503,55 12,56 2.08,59 0.244,60 18,61 0.244,62 12.149,63 26,64 1.006,65 19,66 7.108}
{0 CHEMBL1721885,1 1.274,4 1,5 1,7 5,8 0.664,10 0.986,11 0.899,12 2,13 6,14 1.114,15 1.97,16 3.421,18 3,19 -0.109,20 32.432,21 9,22 0.621,23 0.643,24 1.261,26 0.568,27 0.903,28 0.612,29 7.501,30 45.8,32 0.784,34 1.97,35 0.825,36 55.931,37 5.19,38 0.836,39 4,40 1,41 3.22,42 5.22,43 3.22,44 -0.688,45 39,46 0.568,48 0.903,49 0.962,50 3,51 0.469,52 5,53 14.938,54 1.362,55 4,56 1.97,59 0.245,60 4,61 0.234,62 12.267,63 20,64 1.135,65 14,66 6.745}
{0 CHEMBL1738758,1 1.309,2 2,3 2,4 2,5 3,7 1,8 0.704,10 0.988,11 0.843,12 3,13 8,14 1.303,15 2.033,16 4,17 1,18 2,19 -0.187,20 51.765,21 10,22 0.635,23 0.64,24 1.257,26 0.608,27 0.899,28 0.636,29 8.194,30 41.5,31 1,32 0.69,33 1,34 2.038,35 0.663,36 109.167,37 5.292,38 0.707,39 8,41 3.259,42 5.259,43 3.259,45 36.9,46 0.608,48 0.899,49 0.845,50 4,51 0.5,52 4,53 15.673,54 1.397,55 3,56 2.043,57 1,59 0.235,60 1,61 0.242,62 11.827,63 25,64 1.202,65 14,66 5}
{0 CHEMBL1789941,1 1.375,2 4,3 5,4 6,8 0.674,10 0.944,11 1.025,12 1,13 5,14 1.211,15 1.943,16 5.413,18 2,19 -0.125,20 4.471,21 7,22 0.641,23 0.673,24 1.309,26 0.537,27 0.9,28 0.259,29 7.473,30 43.9,32 0.758,34 1.952,35 0.55,36 99.856,37 4.912,38 0.92,39 6,41 3.079,42 5.04,43 3.079,44 0.722,45 41.5,46 0.537,48 0.9,49 1.086,50 8,51 0.652,53 11.904,54 1.427,55 4,56 1.968,58 1,59 0.26,60 4,61 0.235,62 8.241,63 19,64 1.077,65 9,66 6.319}
{0 CHEMBL180022,1 1.241,5 1,7 3,8 0.65,10 0.927,11 0.818,12 1,13 3,14 1.067,15 1.992,16 1.309,17 1,18 2,19 -0.194,20 48.297,21 6,22 0.658,23 0.687,24 1.347,26 0.41,27 0.933,28 0.638,29 8.074,30 42,32 0.661,34 1.996,35 0.709,36 103.776,37 5.207,38 0.756,39 6,41 3.129,42 5.129,43 3.129,45 43.5,46 0.41,48 0.933,49 0.854,51 0.75,53 14.934,54 1.551,55 8,56 2.09,58 3,59 0.201,60 12,61 0.283,62 12.243,63 22,64 1.053,65 23,66 5}
{0 CHEMBL1807300,1 1.306,2 7,3 8,4 9,5 2,8 0.673,10 1.021,11 0.92,12 3,13 12,14 1.291,15 2.052,16 9.92,17 1,18 5,19 -0.139,20 57.624,21 17,22 0.626,23 0.649,24 1.222,26 0.79,27 0.88,28 1.012,29 7.546,30 45.3,32 0.734,34 2.047,35 1.068,36 94.281,37 5.714,38 0.74,39 8,41 3.258,42 5.258,43 3.258,44 0.017,45 40,46 0.79,48 0.88,49 0.935,50 14,51 0.51,52 2,53 26.999,54 1.452,55 15,56 2.078,57 1,58 8,59 0.262,60 12,61 0.22,62 19.238,63 35,64 1.178,65 21,66 6.408}
{0 CHEMBL1807301,1 1.306,2 7,3 8,4 9,5 2,8 0.668,10 1.038,11 0.903,12 3,13 12,14 1.291,15 2.052,16 11.597,17 1,18 5,19 -0.177,20 56.894,21 17,22 0.614,23 0.651,24 1.432,26 0.79,27 0.88,28 1.012,29 6.978,30 48.4,32 0.832,34 2.047,35 1.069,36 94.281,37 5.711,38 0.859,39 8,41 3.258,42 5.258,43 3.258,44 0.253,45 40,46 0.79,48 0.88,49 0.947,50 14,51 0.541,52 2,53 27.69,54 1.453,55 15,56 2.078,57 1,58 8,59 0.266,60 12,61 0.222,62 21.307,63 35,64 1.181,65 21,66 7.143}
{0 CHEMBL1807302,1 1.306,2 7,3 8,4 9,5 2,8 0.673,10 1.021,11 0.92,12 3,13 12,14 1.291,15 2.052,16 9.92,17 1,18 5,19 -0.139,20 57.624,21 17,22 0.626,23 0.649,24 1.222,26 0.79,27 0.88,28 1.012,29 7.546,30 45.3,32 0.734,34 2.047,35 1.068,36 94.281,37 5.714,38 0.74,39 8,41 3.258,42 5.258,43 3.258,44 0.017,45 40,46 0.79,48 0.88,49 0.935,50 14,51 0.51,52 2,53 26.999,54 1.452,55 15,56 2.078,57 1,58 8,59 0.262,60 12,61 0.22,62 19.238,63 35,64 1.178,65 21,66 6.695}
{0 CHEMBL1807303,1 1.411,2 5,3 6,4 7,5 2,8 0.665,10 1.051,11 0.824,12 3,13 8,14 1.306,15 2.06,16 6.404,17 1,18 5,19 -0.204,20 60.126,21 15,22 0.613,23 0.65,24 1.467,26 0.929,27 0.857,28 0.825,29 6.999,30 48.4,32 0.835,34 2.053,35 0.835,36 94.281,37 5.613,38 0.82,39 8,41 3.258,42 5.258,43 3.258,44 0.5,45 39.6,46 0.929,48 0.857,49 0.857,50 14,51 0.564,52 2,53 25.355,54 1.468,55 13,56 2.078,57 1,59 0.25,60 10,61 0.233,62 20.277,63 31,64 1.203,65 21,66 7.721}
{0 CHEMBL1807304,1 1.411,2 5,3 6,4 7,5 2,8 0.67,10 1.033,11 0.838,12 3,13 8,14 1.306,15 2.06,16 5.163,17 1,18 5,19 -0.159,20 60.857,21 15,22 0.626,23 0.648,24 1.243,26 0.929,27 0.857,28 0.825,29 7.592,30 45.1,32 0.733,34 2.053,35 0.835,36 94.281,37 5.616,38 0.7,39 8,41 3.258,42 5.258,43 3.258,44 0.342,45 39.6,46 0.929,48 0.857,49 0.846,50 14,51 0.53,52 2,53 24.549,54 1.466,55 13,56 2.078,57 1,59 0.247,60 10,61 0.23,62 18.215,63 31,64 1.2,65 21,66 6.686}
{0 CHEMBL1807305,1 1.306,2 3,3 5,4 5,5 2,8 0.668,10 1.04,11 0.829,12 3,13 9,14 1.278,15 2.053,16 7.244,17 1,18 5,19 -0.209,20 54.09,21 14,22 0.617,23 0.652,24 1.465,26 0.702,27 0.891,28 0.763,29 7.078,30 47.7,32 0.822,34 2.048,35 1.012,36 94.281,37 5.587,38 0.827,39 8,41 3.258,42 5.258,43 3.258,45 39.8,46 0.702,48 0.891,49 0.863,50 14,51 0.576,52 2,53 24.389,54 1.471,55 13,56 2.078,57 1,59 0.247,60 9,61 0.238,62 19.356,63 32,64 1.195,65 21,66 7.678}
{0 CHEMBL1807306,1 1.306,2 3,3 5,4 5,5 2,8 0.673,10 1.022,11 0.845,12 3,13 9,14 1.278,15 2.052,16 5.849,17 1,18 5,19 -0.162,20 54.821,21 14,22 0.63,23 0.65,24 1.238,26 0.702,27 0.891,28 0.763,29 7.691,30 44.3,32 0.721,34 2.048,35 1.012,36 94.281,37 5.591,38 0.705,39 8,41 3.258,42 5.258,43 3.258,45 39.8,46 0.702,48 0.891,49 0.851,50 14,51 0.541,52 2,53 23.567,54 1.469,55 13,56 2.078,57 1,59 0.244,60 9,61 0.234,62 17.241,63 32,64 1.192,65 21,66 6.836}
{0 CHEMBL1808334,1 1.306,2 2,3 4,4 4,5 1,8 0.647,10 0.937,11 0.894,12 3,13 4,14 1.278,15 2.051,16 3.2,17 1,18 4,19 -0.072,20 35.078,21 7,22 0.639,23 0.675,24 1.241,26 0.811,27 0.864,28 0.658,29 7.3,30 45.2,32 0.798,34 2.046,35 0.75,36 88.032,37 5.189,38 0.777,39 6,41 3.258,42 5.258,43 3.258,45 43.5,46 0.811,48 0.864,49 0.96,50 14,51 0.721,52 2,53 16.19,54 1.495,55 15,56 2.078,57 1,59 0.229,60 9,61 0.258,62 12.776,63 25,64 1.033,65 20,66 6.276}
{0 CHEMBL1808335,1 1.305,2 2,3 3,4 3,5 1,8 0.656,10 0.897,11 0.944,12 3,13 4,14 1.227,15 2.027,16 2.876,17 1,18 3,19 -0.074,20 31.767,21 5,22 0.653,23 0.685,24 1.222,26 0.513,27 0.912,28 0.484,29 7.581,30 42.9,32 0.76,34 2.01,35 0.655,36 88.032,37 5.1,38 0.849,39 6,41 3.255,42 5.255,43 3.255,45 44.6,46 0.549,48 0.905,49 0.994,50 4,51 0.75,52 3,53 14.247,54 1.476,55 10,56 2.058,57 1,58 2,59 0.213,60 4,61 0.277,62 10.868,63 25,64 0.998,65 20,66 4.921}
{0 CHEMBL1808336,1 1.306,2 2,3 4,4 4,5 2,8 0.653,10 0.964,11 0.84,12 3,13 4,14 1.278,15 2.051,16 3.138,17 1,18 4,19 -0.103,20 37.142,21 8,22 0.635,23 0.668,24 1.291,26 0.712,27 0.882,28 0.658,29 7.313,30 45.5,32 0.795,34 2.047,35 0.75,36 88.032,37 5.22,38 0.774,39 6,41 3.258,42 5.258,43 3.258,45 42.4,46 0.712,48 0.882,49 0.901,50 14,51 0.694,52 2,53 16.613,54 1.5,55 13,56 2.078,57 1,59 0.229,60 8,61 0.258,62 13.715,63 25,64 1.09,65 20,66 6.28}
{0 CHEMBL1808337,1 1.306,2 2,3 4,4 4,5 2,8 0.66,10 0.943,11 0.867,12 3,13 4,14 1.278,15 2.05,16 2.726,17 1,18 4,19 -0.083,20 37.873,21 8,22 0.652,23 0.665,24 1.077,26 0.712,27 0.882,28 0.658,29 8.13,30 40.9,32 0.675,34 2.047,35 0.75,36 88.032,37 5.225,38 0.627,39 6,41 3.258,42 5.258,43 3.258,45 42.4,46 0.712,48 0.882,49 0.885,50 14,51 0.641,52 2,53 15.777,54 1.501,55 13,56 2.078,57 1,59 0.227,60 8,61 0.252,62 11.468,63 25,64 1.087,65 20,66 6.085}
{0 CHEMBL1808338,1 1.306,2 2,3 4,4 4,5 2,8 0.654,10 0.939,11 0.825,12 4,13 4,14 1.278,15 2.052,16 2.99,17 1,18 5,19 -0.053,20 39.493,21 8,22 0.637,23 0.665,24 1.266,26 0.7,27 0.886,28 0.659,29 7.51,30 44.3,32 0.785,34 2.047,35 0.75,36 120.929,37 5.27,38 0.727,39 7,41 3.258,42 5.258,43 3.258,45 41.4,46 0.7,48 0.886,49 0.896,50 14,51 0.679,52 2,53 16.997,54 1.501,55 13,56 2.078,57 1,59 0.225,60 8,61 0.258,62 14.084,63 25,64 1.064,65 21,66 7.444}
{0 CHEMBL1808339,1 1.306,2 2,3 4,4 4,5 2,8 0.661,10 0.917,11 0.85,12 4,13 4,14 1.278,15 2.052,16 2.578,17 1,18 5,19 -0.057,20 40.224,21 8,22 0.654,23 0.662,24 1.075,26 0.7,27 0.886,28 0.659,29 8.281,30 40,32 0.679,34 2.047,35 0.75,36 120.929,37 5.275,38 0.598,39 7,41 3.258,42 5.258,43 3.258,45 41.4,46 0.7,48 0.886,49 0.88,50 14,51 0.631,52 2,53 16.102,54 1.499,55 13,56 2.078,57 1,59 0.223,60 8,61 0.253,62 11.809,63 25,64 1.062,65 21,66 6.854}
{0 CHEMBL1808340,1 1.4,2 5,3 6,4 7,5 2,8 0.663,10 1.024,11 0.865,12 4,13 8,14 1.306,15 2.057,16 6.828,17 1,18 5,19 -0.155,20 60.119,21 14,22 0.617,23 0.652,24 1.412,26 0.816,27 0.874,28 0.763,29 7.078,30 47.7,32 0.829,34 2.05,35 0.825,36 109.167,37 5.59,38 0.825,39 8,41 3.258,42 5.258,43 3.258,44 0.167,45 39.8,46 0.816,48 0.874,49 0.91,50 14,51 0.576,52 2,53 24.375,54 1.472,55 13,56 2.078,57 1,59 0.25,60 10,61 0.234,62 19.372,63 31,64 1.166,65 21,66 7.076}
{0 CHEMBL1808341,1 1.306,2 2,3 4,4 4,5 3,8 0.659,10 1.038,11 0.802,12 4,13 6,14 1.278,15 2.052,16 4.29,17 1,18 5,19 -0.184,20 47.102,21 12,22 0.616,23 0.65,24 1.449,26 0.816,27 0.872,28 0.75,29 7.105,30 47.6,32 0.832,34 2.047,35 0.763,36 109.167,37 5.466,38 0.802,39 8,41 3.258,42 5.258,43 3.258,45 39.3,46 0.816,48 0.872,49 0.835,50 14,51 0.602,52 2,53 21.657,54 1.488,55 13,56 2.078,57 1,59 0.236,60 8,61 0.246,62 18.345,63 25,64 1.189,65 21,66 7.481}
{0 CHEMBL1808342,1 1.306,2 2,3 4,4 4,5 3,8 0.665,10 1.018,11 0.817,12 4,13 6,14 1.278,15 2.052,16 3.464,17 1,18 5,19 -0.147,20 47.832,21 12,22 0.63,23 0.648,24 1.225,26 0.816,27 0.872,28 0.75,29 7.747,30 44,32 0.727,34 2.047,35 0.763,36 109.167,37 5.47,38 0.677,39 8,41 3.258,42 5.258,43 3.258,45 39.3,46 0.816,48 0.872,49 0.824,50 14,51 0.564,52 2,53 20.845,54 1.486,55 13,56 2.078,57 1,59 0.233,60 8,61 0.243,62 16.254,63 25,64 1.187,65 21,66 6.886}
{0 CHEMBL1808343,1 1.306,2 7,3 8,4 9,5 2,8 0.668,10 1.038,11 0.903,12 3,13 12,14 1.291,15 2.052,16 11.597,17 1,18 5,19 -0.177,20 56.894,21 17,22 0.614,23 0.651,24 1.432,26 0.79,27 0.88,28 1.012,29 6.978,30 48.4,32 0.832,34 2.047,35 1.069,36 94.281,37 5.711,38 0.859,39 8,41 3.258,42 5.258,43 3.258,44 0.253,45 40,46 0.79,48 0.88,49 0.947,50 14,51 0.541,52 2,53 27.69,54 1.453,55 15,56 2.078,57 1,58 8,59 0.266,60 12,61 0.222,62 21.307,63 35,64 1.181,65 21,66 6.987}
{0 CHEMBL188343,1 1.477,2 6,3 5,4 6,5 1,6 1,7 8,8 0.716,10 1.027,11 1.046,12 5,13 9,14 1.236,15 2.043,16 9.672,17 2,19 -0.291,20 52.362,21 10,22 0.61,23 0.645,24 1.581,25 1,26 0.893,27 0.846,28 0.757,29 7.028,30 48.2,31 1,32 0.836,33 1,34 2.034,35 0.825,36 106.288,37 5.259,38 0.984,39 7,41 2.917,42 4.917,43 2.917,44 0.458,45 37.5,46 0.893,47 1,48 0.846,49 1.097,50 6,51 0.534,52 8,53 16.073,54 1.391,56 2.096,57 1,58 4,59 0.268,61 0.227,62 12.854,63 27,64 1.212,65 11,66 8.398}
{0 CHEMBL1908391,1 1.323,7 2,8 0.66,10 0.935,11 0.866,12 2,13 5,14 1.16,15 2.023,16 5.273,17 1,18 4,19 -0.183,20 48.345,21 7,22 0.642,23 0.686,24 1.335,26 0.599,27 0.901,28 0.619,29 7.556,30 45.5,32 0.773,34 2.021,35 0.735,36 75.841,37 5.241,38 0.905,39 6,41 2.887,42 4.887,43 2.887,45 42.4,46 0.599,48 0.901,49 0.904,50 3,51 0.681,52 3,53 17.464,54 1.501,55 11,56 2.065,59 0.223,60 10,61 0.264,62 13.973,63 29,64 0.989,65 21,66 5}
{0 CHEMBL1908392,1 1.307,7 6,8 0.66,10 0.966,11 0.858,13 5,14 1.181,15 2.029,16 4.209,18 3,19 -0.214,20 36.272,21 7,22 0.633,23 0.669,24 1.391,26 0.709,27 0.883,28 0.678,29 7.189,30 46.3,32 0.825,34 2.028,35 0.825,36 42.944,37 5.287,38 0.906,39 5,41 3.219,42 5.219,43 3.219,45 43.3,46 0.709,48 0.883,49 0.863,51 0.681,52 8,53 17.929,54 1.46,55 19,56 2.062,59 0.213,60 20,61 0.272,62 14.24,63 27,64 1.08,65 22,66 7.658}
{0 CHEMBL1908393,1 1.292,2 4,3 4,4 5,7 5,8 0.668,10 0.995,11 0.963,12 2,13 10,14 1.207,15 1.997,16 6.493,18 1,19 -0.128,20 55.757,21 13,22 0.635,23 0.653,24 1.192,26 0.521,27 0.918,28 0.825,29 7.741,30 43.9,32 0.719,34 2,35 0.836,36 55.931,37 5.525,38 0.902,39 4,41 3.692,42 5.692,43 3.692,44 -1.089,45 41.5,46 0.521,48 0.918,49 1.042,50 4,51 0.522,52 4,53 19.578,54 1.434,55 2,56 2.076,58 2,59 0.248,60 10,61 0.238,62 15.93,63 31,64 1.181,65 21,66 6.367}
{0 CHEMBL1908394,1 1.326,4 1,6 1,7 3,8 0.671,10 0.946,11 0.791,12 1,13 5,14 1.203,15 2.028,16 4.865,18 3,19 -0.132,20 41.717,21 9,22 0.647,23 0.671,24 1.117,26 0.58,27 0.904,28 0.687,29 8.237,30 42.4,32 0.69,34 2.028,35 0.788,36 57.83,37 5.26,38 0.742,39 5,41 3.083,42 5.083,43 3.083,44 -0.969,45 40.9,46 0.61,47 1,48 0.899,49 0.8,51 0.526,52 2,53 16.555,54 1.47,55 3,56 2.056,58 3,59 0.238,60 6,61 0.239,62 12.176,63 26,64 1.031,65 18,66 5}
{0 CHEMBL1908395,1 1.457,2 6,3 6,4 6,5 2,7 3,8 0.654,10 1.048,11 0.95,12 2,13 9,14 1.393,15 2.016,16 8.225,18 2,19 -0.21,20 33.548,21 12,22 0.612,23 0.649,24 1.47,26 0.72,27 0.881,28 0.648,29 6.979,30 48.5,32 0.845,34 2.002,35 0.73,36 88.89,37 5.356,38 0.905,39 6,40 1,41 3.073,42 5.073,43 3.073,44 0.388,45 39.4,46 0.72,47 1,48 0.881,49 0.973,50 9,51 0.529,52 6,53 20.389,54 1.292,55 6,56 2.135,58 4,59 0.263,60 10,61 0.221,62 14.504,63 23,64 1.185,65 13,66 7.469}
{0 CHEMBL1908396,1 1.207,4 1,5 2,7 2,8 0.669,10 0.93,11 0.747,12 2,14 1.066,15 1.979,18 1,19 -0.185,20 39.065,21 5,22 0.657,23 0.682,24 1.317,26 0.431,27 0.926,28 0.556,29 8.286,30 41.4,32 0.716,34 1.994,35 0.573,36 69.593,37 4.952,38 0.848,39 4,41 3.023,42 5.023,43 3.023,44 -0.218,45 41.4,46 0.608,48 0.896,49 0.845,51 0.706,53 10.616,54 1.499,55 4,56 2.075,58 3,59 0.206,60 4,61 0.28,62 10.643,63 21,64 1.061,65 19,66 5}
{0 CHEMBL1908397,1 1.255,5 1,7 3,8 0.64,10 0.897,11 0.965,13 4,14 1.163,15 2.001,16 3.274,18 3,19 0.001,20 13.198,21 4,22 0.645,23 0.679,24 1.155,26 0.622,27 0.887,28 0.291,29 7.388,30 44.4,32 0.787,34 1.994,35 0.395,36 54.461,37 4.91,38 0.961,39 4,41 3.005,42 5.005,43 3.005,45 44.4,46 0.622,48 0.887,49 0.983,51 0.68,52 4,53 12.338,54 1.518,55 8,56 2.059,59 0.221,60 7,61 0.271,62 9.145,63 21,64 0.975,65 16,66 6.959}
{0 CHEMBL191003,1 1.15,5 2,7 5,8 0.657,10 0.77,11 0.952,12 6,14 1.047,15 1.989,17 1,18 1,19 -0.029,20 34.444,22 0.701,23 0.691,24 1.041,26 0.564,27 0.893,28 0.072,29 10.113,30 30.8,32 0.758,34 2.01,35 0.169,36 117.424,37 4.664,38 0.806,39 6,41 3.096,42 5.096,43 3.096,45 38.5,46 0.564,48 0.893,49 1.087,51 0.796,52 4,53 5.539,54 1.451,55 2,56 1.983,57 1,59 0.175,61 0.294,62 5.893,63 17,64 1.125,65 15,66 6.721}
{0 CHEMBL2042031,1 1.239,4 1,7 5,8 0.622,10 0.911,11 0.803,12 2,13 1,14 1.206,15 2.035,16 0.812,18 8,19 -0.006,20 28.762,21 6,22 0.648,23 0.668,24 0.976,26 0.603,27 0.901,28 0.497,29 7.862,30 42.6,32 0.731,34 2.034,35 0.779,36 85.704,37 5.197,38 0.706,39 4,41 3.096,42 5.096,43 3.096,44 -1.029,45 44.1,46 0.633,48 0.896,49 0.82,51 0.679,52 6,53 16.546,54 1.54,55 20,56 2.093,58 3,59 0.204,60 21,61 0.269,62 12.454,63 24,64 1.002,65 24,66 5.514}
{0 CHEMBL2042042,1 1.186,4 1,7 3,8 0.625,10 0.912,11 0.773,12 2,13 1,14 1.076,15 1.907,16 0.808,18 5,19 -0.019,20 24.805,21 6,22 0.647,23 0.67,24 0.991,26 0.56,27 0.905,28 0.504,29 8.315,30 42.4,32 0.716,34 1.913,35 0.538,36 85.704,37 5.015,38 0.751,39 4,41 3.065,42 5.065,43 3.065,44 -0.96,45 40.7,46 0.56,48 0.905,49 0.805,51 0.574,52 6,53 13.266,54 1.448,55 8,56 2.045,58 3,59 0.224,60 12,61 0.245,62 10.72,63 17,64 0.961,65 18,66 5.148}
{0 CHEMBL2042135,1 1.186,4 1,7 3,8 0.625,10 0.912,11 0.773,12 2,13 1,14 1.076,15 1.907,16 0.808,18 5,19 -0.019,20 24.805,21 6,22 0.647,23 0.67,24 0.991,26 0.56,27 0.905,28 0.504,29 8.315,30 42.4,32 0.716,34 1.913,35 0.538,36 85.704,37 5.015,38 0.751,39 4,41 3.065,42 5.065,43 3.065,44 -0.96,45 40.7,46 0.56,48 0.905,49 0.805,51 0.574,52 6,53 13.266,54 1.448,55 8,56 2.045,58 3,59 0.224,60 12,61 0.245,62 10.72,63 17,64 0.961,65 18,66 5.072}
{0 CHEMBL2042136,1 1.215,4 1,7 4,8 0.625,10 0.878,11 0.765,12 2,13 1,14 1.169,15 2.015,16 0.802,18 7,19 0.003,20 28.762,21 6,22 0.657,23 0.681,24 0.948,26 0.508,27 0.916,28 0.504,29 8.318,30 41.5,32 0.709,34 2.013,35 0.7,36 85.704,37 5.127,38 0.746,39 4,41 3.094,42 5.094,43 3.094,44 -1.024,45 43.1,46 0.539,48 0.911,49 0.789,51 0.645,52 6,53 15.169,54 1.517,55 16,56 2.057,58 3,59 0.216,60 18,61 0.256,62 11.559,63 23,64 0.921,65 22,66 5.318}
{0 CHEMBL2047943,1 1.477,2 6,3 5,4 6,5 2,6 1,7 8,8 0.708,9 1,10 1.046,11 1.007,12 4,13 9,14 1.251,15 2.051,16 9.676,17 2,18 1,19 -0.28,20 53.489,21 11,22 0.604,23 0.642,24 1.58,25 1,26 0.792,27 0.865,28 0.762,29 6.908,30 49.2,31 1,32 0.855,33 1,34 2.041,35 0.825,36 106.288,37 5.29,38 0.952,39 7,40 1,41 2.928,42 4.928,43 2.928,44 0.461,45 37.3,46 0.792,47 1,48 0.865,49 1.056,50 9,51 0.517,52 6,53 17.072,54 1.391,56 2.096,57 1,58 4,59 0.271,61 0.221,62 13.774,63 27,64 1.223,65 11,66 8.398}
{0 CHEMBL2047944,1 1.498,2 6,3 4,4 6,5 2,6 1,7 7,8 0.722,9 1,10 1.09,11 0.986,12 4,13 12,14 1.251,15 2.061,16 11.925,17 2,18 1,19 -0.339,20 68.351,21 15,22 0.597,23 0.634,24 1.673,25 1,26 0.899,27 0.854,28 0.825,29 6.843,30 50,31 1,32 0.856,33 1,34 2.06,35 0.825,36 109.412,37 5.518,38 1.007,39 8,40 1,41 2.929,42 4.929,43 2.929,44 1.066,45 36.1,46 0.899,47 1,48 0.854,49 1.019,50 3,51 0.431,52 6,53 21.236,54 1.359,56 2.1,57 1,58 8,59 0.279,61 0.213,62 17.215,63 33,64 1.303,65 11,66 6.444}
{0 CHEMBL2047945,1 1.52,2 5,3 6,4 6,5 2,6 1,7 5,8 0.692,9 1,10 1.057,11 1.008,12 3,13 10,14 1.251,15 2.055,16 11.085,17 1,18 1,19 -0.245,20 36.877,21 12,22 0.603,23 0.644,24 1.524,26 0.813,27 0.862,28 0.77,29 6.776,30 50,31 1,32 0.867,33 1,34 2.045,35 0.825,36 88.277,37 5.308,38 0.962,39 6,41 2.958,42 4.958,43 2.958,44 0.711,45 38.3,46 0.813,47 1,48 0.862,49 1.047,50 14,51 0.5,52 4,53 18.41,54 1.391,55 5,56 2.123,57 1,59 0.282,60 2,61 0.21,62 14.126,63 27,64 1.216,65 11,66 6.77}
{0 CHEMBL2047946,1 1.508,2 5,3 4,4 5,5 2,6 1,7 8,8 0.703,9 1,10 1.046,11 1.017,12 4,13 9,14 1.251,15 2.058,16 8.707,17 2,18 1,19 -0.226,20 53.489,21 12,22 0.597,23 0.635,24 1.561,25 1,26 0.762,27 0.873,28 0.825,29 6.822,30 50,31 1,32 0.887,33 1,34 2.05,35 0.825,36 139.185,37 5.38,38 0.962,39 8,40 1,41 2.929,42 4.929,43 2.929,44 1.035,45 35.9,46 0.762,47 1,48 0.873,49 1.066,50 7,51 0.484,52 6,53 18.947,54 1.383,56 2.107,57 1,58 5,59 0.274,61 0.216,62 15.247,63 27,64 1.21,65 11,66 7.456}
{0 CHEMBL2047947,1 1.251,5 3,6 1,7 2,8 0.741,9 1,10 1.046,11 0.859,12 3,13 8,14 1.213,15 2.009,16 6.411,17 1,18 1,19 -0.429,20 50.851,21 9,22 0.617,23 0.644,24 1.715,26 0.829,27 0.856,28 0.6,29 7.324,30 46.3,31 2,32 0.782,33 2,34 2.027,35 0.825,36 91.401,37 5.118,38 0.955,39 7,41 2.97,42 4.97,43 2.97,45 37,46 1.014,47 1,48 0.824,49 0.876,50 3,51 0.534,53 13.481,54 1.393,56 2.05,57 1,59 0.241,61 0.251,62 11.884,63 27,64 1.303,65 11,66 6.886}
{0 CHEMBL2047948,1 1.394,2 3,3 2,4 3,5 1,6 1,7 6,8 0.721,10 1.082,11 0.933,12 5,13 9,14 1.251,15 2.039,16 6.609,17 2,18 1,19 -0.393,20 67.278,21 12,22 0.607,23 0.635,24 1.723,25 1,26 0.769,27 0.873,28 0.825,29 7.174,30 47.8,31 1,32 0.812,33 1,34 2.04,35 0.825,36 109.412,37 5.369,38 0.909,39 8,41 2.928,42 4.928,43 2.928,44 0.179,45 35.8,46 0.769,47 1,48 0.873,49 0.961,50 3,51 0.486,52 8,53 17.425,54 1.38,56 2.051,57 1,58 3,59 0.256,60 2,61 0.233,62 15.07,63 27,64 1.327,65 12,66 7.553}
{0 CHEMBL2047949,1 1.38,2 3,3 2,4 3,5 2,6 1,7 5,8 0.725,9 1,10 1.033,11 0.972,12 4,13 8,14 1.251,15 2.037,16 7.61,17 2,18 1,19 -0.322,20 65.989,21 10,22 0.606,23 0.64,24 1.639,25 1,26 0.772,27 0.868,28 0.6,29 7.044,30 48.3,31 1,32 0.843,33 1,34 2.036,35 0.825,36 124.299,37 5.256,38 0.961,39 8,40 1,41 2.928,42 4.928,43 2.928,44 0.398,45 36.2,46 0.772,47 1,48 0.868,49 1.013,50 3,51 0.517,52 4,53 15.889,54 1.391,56 2.052,57 1,59 0.256,61 0.236,62 13.409,63 27,64 1.231,65 11,66 6.638}
{0 CHEMBL2047950,1 1.464,2 6,3 5,4 6,5 3,6 1,7 5,8 0.708,9 1,10 1.05,11 0.987,12 3,13 9,14 1.251,15 2.042,16 9.259,17 1,18 1,19 -0.293,20 43.333,21 11,22 0.61,23 0.643,24 1.571,26 0.806,27 0.862,28 0.756,29 7.044,30 48.3,31 1,32 0.822,33 1,34 2.029,35 0.825,36 88.277,37 5.252,38 0.935,39 6,41 2.907,42 4.907,43 2.907,44 0.211,45 37.9,46 0.806,47 1,48 0.862,49 1.047,50 9,51 0.517,52 4,53 16.314,54 1.391,56 2.084,57 1,58 4,59 0.27,61 0.222,62 13.241,63 27,64 1.255,65 11,66 7.854}
{0 CHEMBL2047951,1 1.457,2 6,3 4,4 6,5 2,6 1,7 7,8 0.71,9 1,10 1.028,11 1.008,12 4,13 8,14 1.251,15 2.048,16 6.843,17 2,18 1,19 -0.264,20 54.652,21 11,22 0.606,23 0.639,24 1.572,25 1,26 0.746,27 0.874,28 0.71,29 7.06,30 48.3,31 1,32 0.849,33 1,34 2.041,35 0.825,36 106.288,37 5.309,38 0.939,39 7,40 1,41 2.928,42 4.928,43 2.928,44 0.1,45 36.7,46 0.746,47 1,48 0.874,49 1.069,50 3,51 0.5,52 6,53 16.937,54 1.387,56 2.076,57 1,58 8,59 0.266,61 0.223,62 13.827,63 27,64 1.209,65 11,66 9}
{0 CHEMBL2047952,1 1.477,2 6,3 5,4 6,5 3,6 1,7 6,8 0.721,9 1,10 1.028,11 1.015,12 4,13 9,14 1.237,15 2.04,16 7.802,17 2,19 -0.228,20 56.862,21 11,22 0.625,23 0.636,24 1.292,25 1,26 0.779,27 0.868,28 0.762,29 7.959,30 43.3,31 1,32 0.693,33 1,34 2.037,35 0.825,36 106.288,37 5.292,38 0.785,39 7,40 1,41 2.925,42 4.925,43 2.925,44 0.278,45 36.7,46 0.779,47 1,48 0.868,49 1.009,50 6,51 0.471,52 5,53 16.013,54 1.388,56 2.096,57 1,58 4,59 0.259,61 0.224,62 11.566,63 27,64 1.268,65 11,66 9}
{0 CHEMBL2047953,1 1.477,2 6,3 5,4 6,5 2,6 1,7 6,8 0.705,9 1,10 1.032,11 1.004,12 4,13 9,14 1.279,15 2.063,16 8.581,17 2,19 -0.257,20 52.452,21 11,22 0.617,23 0.652,24 1.575,25 1,26 0.786,27 0.868,28 0.812,29 7.607,30 46.8,31 1,32 0.841,33 1,34 2.046,35 0.825,36 106.288,37 5.347,38 0.997,39 7,40 1,41 2.992,42 4.992,43 2.992,44 0.354,45 35.5,46 0.786,47 1,48 0.868,49 1.107,50 6,51 0.561,52 5,53 17.43,54 1.402,56 2.096,57 1,58 4,59 0.26,61 0.224,62 16.048,63 27,64 1.293,65 11,66 6}
{0 CHEMBL2047954,1 1.477,2 6,3 5,4 6,5 2,6 1,7 7,8 0.702,9 1,10 1.004,11 1.004,12 4,13 9,14 1.242,15 2.036,16 9.645,17 2,19 -0.24,20 51.324,21 11,22 0.614,23 0.659,24 1.492,25 1,26 0.779,27 0.868,28 0.762,29 7.327,30 48.3,31 1,32 0.794,33 1,34 2.029,35 0.825,36 106.288,37 5.28,38 1.055,39 7,40 1,41 2.922,42 4.922,43 2.922,44 0.456,45 36.7,46 0.779,47 1,48 0.868,49 1.08,50 6,51 0.516,52 5,53 17.111,54 1.39,56 2.096,57 1,58 4,59 0.283,61 0.21,62 14.066,63 27,64 1.082,65 11,66 6.292}
{0 CHEMBL2047955,1 1.477,2 6,3 5,4 6,5 3,6 1,7 6,8 0.718,9 1,10 1.056,11 0.983,12 4,13 9,14 1.237,15 2.041,16 9.412,17 2,19 -0.32,20 56.131,21 11,22 0.606,23 0.639,24 1.627,25 1,26 0.779,27 0.868,28 0.762,29 7.06,30 48.3,31 1,32 0.83,33 1,34 2.037,35 0.825,36 106.288,37 5.287,38 0.964,39 7,40 1,41 2.924,42 4.924,43 2.924,44 0.436,45 36.7,46 0.779,47 1,48 0.868,49 1.03,50 6,51 0.516,52 5,53 16.594,54 1.39,56 2.096,57 1,58 4,59 0.265,61 0.228,62 13.796,63 27,64 1.273,65 11,66 8.398}
{0 CHEMBL2047956,1 1.477,2 6,3 5,4 6,5 3,6 1,7 6,8 0.711,9 1,10 1.072,11 1.019,12 4,13 10,14 1.238,15 2.042,16 10.001,17 2,19 -0.308,20 57.294,21 12,22 0.602,23 0.636,24 1.624,25 1,26 0.774,27 0.871,28 0.825,29 6.946,30 49.2,31 1,32 0.847,33 1,34 2.038,35 0.825,36 106.288,37 5.35,38 0.967,39 7,40 1,41 2.924,42 4.924,43 2.924,44 0.435,45 36.5,46 0.774,47 1,48 0.871,49 1.085,50 6,51 0.5,52 5,53 17.468,54 1.389,56 2.096,57 1,58 7,59 0.274,60 1,61 0.219,62 14.721,63 27,64 1.281,65 11,66 9}
{0 CHEMBL2047957,1 1.477,2 6,3 5,4 6,5 2,6 1,7 7,8 0.712,9 1,10 1.016,11 1.015,12 4,13 9,14 1.245,15 2.047,16 7.667,17 2,18 1,19 -0.201,20 56.054,21 11,22 0.624,23 0.639,24 1.259,25 1,26 0.792,27 0.865,28 0.762,29 7.823,30 44.1,31 1,32 0.706,33 1,34 2.041,35 0.825,36 106.288,37 5.3,38 0.81,39 7,40 1,41 3.054,42 5.054,43 3.054,44 0.27,45 37.3,46 0.792,47 1,48 0.865,49 1.046,50 6,51 0.47,52 6,53 16.129,54 1.389,56 2.096,57 1,58 4,59 0.264,61 0.22,62 11.634,63 27,64 1.219,65 11,66 8.523}
{0 CHEMBL2047958,1 1.477,2 6,3 5,4 6,5 4,6 1,7 6,8 0.718,9 1,10 1.051,11 1.008,12 4,13 9,14 1.276,15 2.051,16 10.155,17 2,19 -0.31,20 59.59,21 11,22 0.601,23 0.637,24 1.636,25 1,26 0.766,27 0.871,28 0.762,29 6.928,30 49.2,31 1,32 0.861,33 1,34 2.044,35 0.825,36 124.299,37 5.33,38 0.962,39 8,40 1,41 2.924,42 4.924,43 2.924,44 0.441,45 36.1,46 0.766,47 1,48 0.871,49 1.057,50 6,51 0.516,52 6,53 17.437,54 1.39,56 2.096,57 1,58 4,59 0.267,61 0.226,62 14.33,63 27,64 1.242,65 11,66 9}
{0 CHEMBL2047959,1 1.477,2 6,3 5,4 6,5 3,6 1,7 6,8 0.707,9 1,10 1.078,11 0.967,12 4,13 9,14 1.328,15 2.067,16 8.199,17 2,19 -0.367,20 62.163,21 12,22 0.609,23 0.645,24 1.716,25 1,26 0.799,27 0.868,28 0.825,29 7.473,30 47.8,31 1,32 0.838,33 1,34 2.054,35 0.825,36 107.806,37 5.415,38 0.977,39 8,40 1,41 3.079,42 5.079,43 3.079,44 0.398,45 34.3,46 0.799,47 1,48 0.868,49 1.059,50 6,51 0.543,52 5,53 18.723,54 1.392,56 2.096,57 1,58 4,59 0.259,61 0.224,62 17.885,63 27,64 1.383,65 11,66 8.699}
{0 CHEMBL2047960,1 1.477,2 6,3 6,4 7,5 3,6 1,7 6,8 0.709,9 1,10 1.134,11 1,12 4,13 16,14 1.386,15 2.069,16 13,17 2,19 -0.386,20 73.678,21 18,22 0.595,23 0.633,24 1.768,25 1,26 0.869,27 0.865,28 0.825,29 7.138,30 50,31 1,32 0.859,33 1,34 2.059,35 0.911,36 110.931,37 5.699,38 1.009,39 9,40 1,41 3.117,42 5.117,43 3.117,44 0.391,45 33.7,46 0.869,47 1,48 0.865,49 1.039,50 6,51 0.442,52 5,53 25.621,54 1.357,56 2.096,57 1,58 4,59 0.281,61 0.207,62 23.379,63 33,64 1.427,65 11,66 8.699}
{0 CHEMBL2047961,1 1.477,2 11,3 9,4 11,5 3,6 1,7 6,8 0.7,9 1,10 1.079,11 1.053,12 4,13 13,14 1.47,15 2.067,16 12.05,17 2,19 -0.265,20 63.89,21 17,22 0.597,23 0.632,24 1.604,25 1,26 0.834,27 0.868,28 0.825,29 6.86,30 50,31 1,32 0.868,33 1,34 2.062,35 0.825,36 109.412,37 5.659,38 0.952,39 8,40 1,41 2.933,42 4.933,43 2.933,44 0.221,45 36.3,46 0.834,47 1,48 0.868,49 1.112,50 10,51 0.438,52 5,53 24.81,54 1.357,55 2,56 2.096,57 1,58 8,59 0.29,61 0.199,62 18.891,63 33,64 1.257,65 12,66 8.523}
{0 CHEMBL2047962,1 1.477,2 6,3 5,4 6,5 3,6 1,7 6,8 0.731,9 1,10 1.124,11 0.934,12 4,13 13,14 1.311,15 2.06,16 12.539,17 2,19 -0.45,20 71.118,21 16,22 0.594,23 0.63,24 1.816,25 1,26 0.894,27 0.859,28 0.825,29 6.86,30 50,31 1,32 0.854,33 1,34 2.058,35 0.825,36 115.661,37 5.611,38 0.952,39 10,40 1,41 2.924,42 4.924,43 2.924,44 0.411,45 35,46 0.894,47 1,48 0.859,49 0.945,50 6,51 0.438,52 5,53 23.388,54 1.357,56 2.096,57 1,58 4,59 0.271,61 0.219,62 19.014,63 33,64 1.357,65 12,66 8.523}
{0 CHEMBL2047963,1 1.477,2 6,3 5,4 6,5 5,6 1,7 6,8 0.716,9 1,10 1.062,11 0.95,12 5,13 9,14 1.296,15 2.054,16 8.185,17 2,19 -0.369,20 63.153,21 12,22 0.609,23 0.636,24 1.707,25 1,26 0.736,27 0.88,28 0.762,29 7.252,30 47.1,31 1,32 0.81,33 1,34 2.05,35 0.825,36 127.423,37 5.432,38 0.885,39 9,40 1,41 2.925,42 4.925,43 2.925,44 0.393,45 35.7,46 0.736,47 1,48 0.88,49 1.003,50 6,51 0.514,52 5,53 19.055,54 1.384,56 2.096,57 1,58 4,59 0.253,61 0.235,62 15.42,63 27,64 1.288,65 13,66 8.046}
{0 CHEMBL2047964,1 1.477,2 6,3 5,4 6,5 3,6 1,7 6,8 0.712,9 1,10 1.008,11 0.97,12 4,13 9,14 1.298,15 2.058,16 8.763,17 2,19 -0.32,20 60.717,21 11,22 0.624,23 0.654,24 1.583,25 1,26 0.649,27 0.895,28 0.825,29 7.329,30 45.8,31 1,32 0.792,33 1,34 2.054,35 0.825,36 126.198,37 5.465,38 0.914,39 9,40 1,41 2.925,42 4.925,43 2.925,44 0.404,45 38.9,46 0.649,47 1,48 0.895,49 1.021,50 6,51 0.603,52 5,53 19.817,54 1.45,56 2.096,57 1,58 4,59 0.244,61 0.248,62 15.4,63 33,64 1.202,65 17,66 8.523}
{0 CHEMBL2047965,1 1.477,2 6,3 5,4 6,5 3,6 1,7 6,8 0.711,9 1,10 1.034,11 0.98,12 4,13 10,14 1.322,15 2.062,16 10.926,17 2,19 -0.321,20 65.748,21 12,22 0.613,23 0.649,24 1.598,25 1,26 0.668,27 0.892,28 0.825,29 7.037,30 47.9,31 1,32 0.835,33 1,34 2.056,35 0.825,36 126.198,37 5.487,38 0.966,39 9,40 1,41 2.924,42 4.924,43 2.924,44 0.427,45 38.4,46 0.668,47 1,48 0.892,49 1.019,50 6,51 0.579,52 5,53 20.79,54 1.453,56 2.096,57 1,58 4,59 0.252,61 0.242,62 16.549,63 33,64 1.218,65 16,66 8.046}
{0 CHEMBL2047966,1 1.477,2 8,3 6,4 8,5 4,6 1,7 6,8 0.724,9 1,10 1.076,11 0.993,12 4,13 12,14 1.297,15 2.054,16 10.495,17 2,19 -0.368,20 67.797,21 15,22 0.601,23 0.633,24 1.715,25 1,26 0.694,27 0.889,28 0.825,29 7.049,30 48.7,31 1,32 0.838,33 1,34 2.049,35 0.911,36 112.537,37 5.576,38 0.935,39 9,40 1,41 2.924,42 4.924,43 2.924,44 0.001,45 35.5,46 0.694,47 1,48 0.889,49 1.034,50 6,51 0.449,52 5,53 22.008,54 1.361,56 2.096,57 1,58 4,59 0.273,61 0.215,62 17.604,63 32,64 1.292,65 12,66 8.301}
{0 CHEMBL2047967,1 1.477,2 7,3 6,4 7,5 3,6 1,7 6,8 0.716,9 1,10 1.103,11 1.004,12 4,13 13,14 1.376,15 2.059,16 14.528,17 2,19 -0.329,20 66.766,21 16,22 0.593,23 0.632,24 1.669,25 1,26 0.73,27 0.883,28 0.825,29 6.756,30 50.7,31 1,32 0.87,33 1,34 2.052,35 0.842,36 109.412,37 5.561,38 1.011,39 8,40 1,41 2.924,42 4.924,43 2.924,44 1.127,45 36,46 0.73,47 1,48 0.883,49 1.034,50 6,51 0.432,52 5,53 22.69,54 1.362,55 2,56 2.096,57 1,58 6,59 0.287,61 0.206,62 18.121,63 32,64 1.309,65 11,66 8.046}
{0 CHEMBL2047968,1 1.477,2 9,3 7,4 9,5 3,6 1,7 8,8 0.716,9 1,10 1.103,11 1.014,12 4,13 13,14 1.437,15 2.067,16 14.461,17 2,19 -0.329,20 74.452,21 16,22 0.593,23 0.632,24 1.669,25 1,26 0.89,27 0.857,28 0.825,29 6.756,30 50.7,31 1,32 0.87,33 1,34 2.061,35 0.825,36 109.412,37 5.575,38 1.007,39 8,40 1,41 2.924,42 4.924,43 2.924,44 1.095,45 36,46 0.89,47 1,48 0.857,49 1.053,50 6,51 0.432,52 5,53 22.678,54 1.36,56 2.096,57 1,58 4,59 0.287,61 0.206,62 18.121,63 33,64 1.309,65 11,66 7.959}
{0 CHEMBL2047969,1 1.477,2 10,3 8,4 10,5 3,6 1,7 8,8 0.707,9 1,10 1.125,11 0.968,12 4,13 12,14 1.419,15 2.063,16 12.342,17 2,19 -0.348,20 79.15,21 18,22 0.59,23 0.63,24 1.706,25 1,26 0.836,27 0.869,28 0.825,29 6.688,30 51.2,31 1,32 0.883,33 1,34 2.054,35 0.912,36 112.537,37 5.671,38 0.949,39 9,40 1,41 2.957,42 4.957,43 2.957,44 1.002,45 35.7,46 0.836,47 1,48 0.869,49 0.998,50 6,51 0.427,52 5,53 25.75,54 1.354,56 2.096,57 1,58 8,59 0.285,60 1,61 0.203,62 20.267,63 32,64 1.32,65 12,66 8.398}
{0 CHEMBL2047970,1 1.477,2 8,3 7,4 8,5 3,6 1,7 8,8 0.712,9 1,10 1.088,11 1.01,12 4,13 13,14 1.421,15 2.065,16 12.169,17 2,19 -0.318,20 70.173,21 16,22 0.6,23 0.634,24 1.65,25 1,26 0.867,27 0.862,28 0.825,29 6.945,30 49.4,31 1,32 0.839,33 1,34 2.058,35 0.825,36 109.412,37 5.59,38 0.97,39 8,40 1,41 2.936,42 4.936,43 2.936,44 0.503,45 36.4,46 0.867,47 1,48 0.862,49 1.052,50 6,51 0.449,52 5,53 22.936,54 1.361,56 2.096,57 1,58 8,59 0.282,60 1,61 0.21,62 17.958,63 33,64 1.299,65 12,66 8.398}
{0 CHEMBL2047971,1 1.477,2 8,3 7,4 8,5 3,6 1,7 8,8 0.711,9 1,10 1.115,11 1.021,12 4,13 14,14 1.467,15 2.067,16 15.825,17 2,19 -0.319,20 65.184,21 17,22 0.59,23 0.63,24 1.665,25 1,26 0.881,27 0.86,28 0.825,29 6.676,30 51.3,31 1,32 0.884,33 1,34 2.06,35 0.825,36 109.412,37 5.613,38 1.021,39 8,40 1,41 2.924,42 4.924,43 2.924,44 1.197,45 35.9,46 0.881,47 1,48 0.86,49 1.052,50 6,51 0.421,52 5,53 24.101,54 1.358,56 2.097,57 1,58 9,59 0.292,60 1,61 0.201,62 19.018,63 33,64 1.315,65 11,66 8.301}
{0 CHEMBL2047972,1 1.477,2 8,3 8,4 9,5 3,6 1,7 8,8 0.706,9 1,10 1.1,11 1.026,12 4,13 14,14 1.461,15 2.066,16 13.331,17 2,19 -0.309,20 64.143,21 17,22 0.597,23 0.632,24 1.646,25 1,26 0.859,27 0.864,28 0.825,29 6.86,30 50,31 1,32 0.853,33 1,34 2.058,35 0.825,36 109.412,37 5.632,38 0.98,39 8,40 1,41 2.924,42 4.924,43 2.924,44 0.846,45 36.3,46 0.859,47 1,48 0.864,49 1.069,50 7,51 0.438,52 5,53 24.179,54 1.359,55 1,56 2.096,57 1,58 8,59 0.286,60 3,61 0.205,62 18.871,63 33,64 1.305,65 12,66 8.523}
{0 CHEMBL2048078,1 1.477,2 8,3 8,4 9,5 3,6 1,7 8,8 0.707,9 1,10 1.125,11 0.995,12 4,13 14,14 1.462,15 2.067,16 14.345,17 2,19 -0.348,20 67.817,21 18,22 0.59,23 0.63,24 1.706,25 1,26 0.875,27 0.863,28 0.825,29 6.688,30 51.2,31 1,32 0.883,33 1,34 2.061,35 0.825,36 112.537,37 5.683,38 0.97,39 9,40 1,41 2.924,42 4.924,43 2.924,44 0.868,45 35.7,46 0.875,47 1,48 0.863,49 1.026,50 7,51 0.427,52 5,53 25.994,54 1.355,55 1,56 2.096,57 1,58 8,59 0.286,60 3,61 0.203,62 20.267,63 33,64 1.32,65 12,66 8.301}
{0 CHEMBL2048079,1 1.477,2 8,3 7,4 8,5 3,6 1,7 8,8 0.689,9 1,10 1.153,11 1.023,12 4,13 12,14 1.465,15 2.066,16 14.287,17 2,19 -0.314,20 63.643,21 17,22 0.58,23 0.626,24 1.678,25 1,26 0.965,27 0.847,28 0.825,29 6.415,30 53.2,31 1,32 0.943,33 1,34 2.058,35 0.869,36 109.412,37 5.601,38 0.987,39 8,40 1,41 2.924,42 4.924,43 2.924,44 1.22,45 35.4,46 0.965,47 1,48 0.847,49 1.063,50 6,51 0.432,52 5,53 23.968,54 1.371,56 2.097,57 1,58 15,59 0.297,60 1,61 0.194,62 19.634,63 27,64 1.326,65 11,66 8.398}
{0 CHEMBL2048080,1 1.477,2 10,3 9,4 11,5 3,6 1,7 8,8 0.702,9 1,10 1.135,11 0.985,12 4,13 13,14 1.46,15 2.065,16 13.505,17 2,19 -0.339,20 73.12,21 19,22 0.587,23 0.628,24 1.701,25 1,26 0.831,27 0.871,28 0.825,29 6.619,30 51.7,31 1,32 0.896,33 1,34 2.055,35 0.913,36 112.537,37 5.71,38 0.961,39 9,40 1,41 2.924,42 4.924,43 2.924,44 1.35,45 35.6,46 0.831,47 1,48 0.871,49 1.015,50 7,51 0.417,52 5,53 26.979,54 1.352,55 1,56 2.096,57 1,58 8,59 0.289,60 5,61 0.198,62 21.154,63 32,64 1.325,65 12,66 8.155}
{0 CHEMBL2048081,1 1.477,2 10,3 10,4 11,5 3,6 1,7 8,8 0.699,9 1,10 1.092,11 1.052,12 4,13 14,14 1.46,15 2.065,16 14.964,17 2,19 -0.278,20 62.603,21 17,22 0.595,23 0.635,24 1.61,25 1,26 0.87,27 0.862,28 0.825,29 6.744,30 50.6,31 1,32 0.873,33 1,34 2.055,35 0.913,36 109.412,37 5.636,38 0.963,39 8,40 1,41 2.924,42 4.924,43 2.924,44 0.895,45 36.7,46 0.87,47 1,48 0.862,49 1.102,50 7,51 0.449,52 5,53 24.668,54 1.363,55 1,56 2.096,57 1,58 12,59 0.294,60 7,61 0.198,62 18.823,63 32,64 1.268,65 12,66 8.155}
{0 CHEMBL2048082,1 1.477,2 9,3 7,4 9,5 4,6 1,7 8,8 0.711,9 1,10 1.053,11 1.034,12 4,13 11,14 1.427,15 2.067,16 10.22,17 2,19 -0.282,20 67.883,21 15,22 0.604,23 0.636,24 1.608,25 1,26 0.767,27 0.876,28 0.825,29 7.037,30 48.6,31 1,32 0.84,33 1,34 2.064,35 0.825,36 109.412,37 5.534,38 0.942,39 8,40 1,41 2.963,42 4.963,43 2.963,44 0.084,45 36.5,46 0.767,47 1,48 0.876,49 1.091,50 6,51 0.461,52 7,53 21.645,54 1.365,56 2.096,57 1,58 8,59 0.28,60 1,61 0.209,62 17.063,63 31,64 1.241,65 12,66 8.398}
{0 CHEMBL2048912,1 1.167,5 3,7 2,8 0.674,10 0.837,11 0.799,12 2,13 2,14 1.143,15 1.987,16 0.95,17 1,18 1,19 -0.158,20 40.463,21 5,22 0.672,23 0.705,24 1.312,26 0.392,27 0.934,28 0.469,29 8.701,30 40,32 0.633,34 1.992,35 0.597,36 119.365,37 5.152,38 0.65,39 7,40 1,41 3.237,42 5.237,43 3.237,45 41.7,46 0.392,48 0.934,49 0.823,51 0.681,53 13.32,54 1.608,55 4,56 1.998,58 6,59 0.22,60 6,61 0.26,62 10.35,63 24,64 0.927,65 20,66 5}
{0 CHEMBL2148053,1 1.294,5 2,7 2,8 0.662,10 0.897,11 0.828,12 2,13 2,14 1.151,15 2.029,16 0.599,17 1,19 -0.188,20 39.611,21 6,22 0.671,23 0.703,24 1.396,26 0.456,27 0.923,28 0.596,29 9.073,30 40.3,32 0.649,34 2.002,35 0.725,36 71.492,37 5.2,38 0.771,39 5,41 3.352,42 5.352,43 3.352,45 40.3,46 0.456,48 0.923,49 0.966,51 0.689,53 14.168,54 1.524,55 7,56 1.988,58 6,59 0.215,60 7,61 0.257,62 11.273,63 21,64 1.088,65 19,66 5}
{0 CHEMBL215152,1 1.267,3 2,4 2,5 1,7 3,8 0.662,10 0.992,11 1.003,12 3,13 7,14 1.171,15 1.996,16 4.032,17 1,18 1,19 -0.137,20 51.895,21 8,22 0.627,23 0.649,24 1.298,26 0.28,27 0.954,28 0.549,29 7.577,30 44.8,32 0.782,34 2.001,35 0.871,36 106.043,37 5.289,38 0.895,39 7,40 1,41 2.975,42 4.975,43 2.975,45 38.8,46 0.28,48 0.954,49 1.079,51 0.622,52 3,53 15.28,54 1.511,55 2,56 2.064,58 3,59 0.227,60 7,61 0.261,62 13.616,63 21,64 1.15,65 18,66 5.071}
{0 CHEMBL2171745,1 1.207,5 1,7 2,8 0.698,10 1.046,11 0.776,12 3,13 4,14 1.077,15 1.953,16 1.99,17 2,18 2,19 -0.246,20 43.578,21 7,22 0.636,23 0.634,24 1.273,25 1,26 0.699,27 0.875,28 0.341,29 8.397,30 40.8,32 0.657,34 1.984,35 0.575,36 72.717,37 4.9,38 0.75,39 5,41 2.985,42 4.985,43 2.985,45 36.7,46 0.699,48 0.875,49 0.789,51 0.517,52 1,53 9.703,54 1.314,55 2,56 2.003,57 1,59 0.218,60 1,61 0.259,62 8.288,63 18,64 1.317,65 11,66 7.602}
{0 CHEMBL221959,1 1.441,2 2,3 2,4 3,7 2,8 0.696,10 1.069,11 0.885,12 1,13 4,14 0.99,15 1.931,16 2.206,18 1,19 -0.402,20 21.804,21 8,22 0.617,23 0.647,24 1.683,26 0.407,27 0.925,28 0.593,29 7.266,30 46.5,31 1,32 0.793,33 1,34 1.957,35 0.604,36 87.665,37 4.92,38 0.86,39 6,41 3.046,42 4.985,43 3.046,44 0.606,45 37.2,46 0.407,48 0.925,49 0.91,50 3,51 0.565,52 1,53 11.503,54 1.315,55 1,56 2.07,58 3,59 0.246,60 3,61 0.237,62 9.09,63 15,64 1.281,65 7,66 5}
{0 CHEMBL223360,1 1.241,7 2,8 0.634,10 0.77,11 0.932,12 3,14 1.122,15 2.012,18 4,19 0.119,20 22.095,21 1,22 0.672,23 0.69,24 0.909,26 0.321,27 0.942,28 0.273,29 8.162,30 39.1,32 0.729,34 2.013,35 0.311,36 102.245,37 4.824,38 0.71,39 5,40 1,41 3.18,42 5.18,43 3.18,45 45.7,46 0.321,48 0.942,49 1.005,50 3,51 0.821,52 9,53 9.722,54 1.543,55 6,56 2.089,59 0.185,60 4,61 0.298,62 7.914,63 21,64 0.816,65 20,66 5}
{0 CHEMBL230011,1 1.164,5 1,7 10,8 0.673,9 1,10 0.682,11 0.881,12 3,14 1.03,15 1.943,18 2,19 0.048,20 9.826,22 0.692,23 0.7,24 1.065,26 0.55,27 0.897,28 0.106,29 8.659,30 35,32 0.755,34 1.939,35 0.144,36 132.936,37 4.657,38 0.628,39 6,41 3.116,42 5.116,43 3.116,45 45,46 0.65,48 0.878,49 1.018,51 0.923,52 6,53 6.727,54 1.585,55 5,56 2.064,57 1,59 0.165,60 6,61 0.316,62 6.242,63 22,64 0.753,65 18,66 5.114}
{0 CHEMBL2309006,1 1.367,2 2,3 1,4 2,5 2,7 14,8 0.705,10 0.775,11 0.759,12 1,13 3,14 1.279,15 2.042,16 0.278,18 6,19 -0.042,20 33.429,21 7,22 0.679,23 0.698,24 1.118,26 0.273,27 0.953,28 0.568,29 8.139,30 38.9,32 0.699,34 2.047,35 0.755,36 21.809,37 5.244,38 0.693,39 3,40 1,41 3.709,42 5.709,43 3.709,44 -0.487,45 48.1,46 0.421,48 0.927,49 0.845,51 0.591,52 13,53 14.241,54 1.509,55 11,56 2.08,59 0.239,60 18,61 0.245,62 9.631,63 25,64 0.879,65 19,66 8.187}
{0 CHEMBL2309609,1 1.377,2 4,3 1,4 4,7 4,8 0.692,10 0.863,11 0.757,12 1,13 2,14 1.349,15 2.07,16 0.99,18 7,19 -0.151,20 44.101,21 9,22 0.668,23 0.695,24 1.239,26 0.415,27 0.933,28 0.769,29 7.818,30 41.1,32 0.699,34 2.068,35 0.846,36 24.933,37 5.485,38 0.77,39 4,41 3.603,42 5.603,43 3.603,44 -1.211,45 47.9,46 0.524,48 0.915,49 0.8,51 0.628,52 4,53 19.605,54 1.543,55 15,56 2.08,59 0.229,60 21,61 0.258,62 13.58,63 32,64 0.997,65 26,66 6.456}
{0 CHEMBL2348417,1 1.161,2 1,3 1,4 1,7 4,8 0.664,10 0.785,11 0.905,12 3,13 4,14 1.144,15 1.968,16 1.145,17 2,18 2,19 -0.043,20 45.619,21 4,22 0.684,23 0.715,24 1.15,25 1,26 0.14,27 0.976,28 0.378,29 8.913,30 38.6,32 0.64,34 1.975,35 0.649,36 87.603,37 5.11,38 0.794,39 5,40 1,41 2.99,42 4.99,43 2.99,45 43.9,46 0.14,48 0.976,49 0.918,51 0.7,52 4,53 13.262,54 1.56,55 10,56 1.999,58 2,59 0.222,60 12,61 0.267,62 9.011,63 26,64 0.826,65 21,66 5}
{0 CHEMBL24828,1 1.444,2 2,3 2,4 2,8 0.667,10 0.951,11 0.796,12 1,13 5,14 1.181,15 2.041,16 5.092,17 1,18 1,19 -0.203,20 33.11,21 8,22 0.643,23 0.678,24 1.279,26 0.584,27 0.899,28 0.541,29 8.804,30 44.4,32 0.508,34 2.028,35 0.587,36 100.66,37 5.087,38 0.585,39 4,41 3.026,42 5.026,43 3.026,44 0.532,45 40.7,46 0.584,48 0.899,49 0.751,51 0.583,53 14.399,54 1.434,55 5,56 2.076,58 5,59 0.247,60 6,61 0.237,62 9.037,63 22,64 0.997,65 14,66 5}
{0 CHEMBL249697,1 1.266,5 2,7 2,8 0.684,10 0.96,11 0.842,12 1,13 2,14 1.033,15 1.846,16 1.255,17 1,18 1,19 -0.209,20 14.709,21 4,22 0.619,23 0.655,24 1.453,25 1,26 0.431,27 0.917,28 0.162,29 7.093,30 47.2,32 0.855,34 1.839,35 0.259,36 85.765,37 4.615,38 0.767,39 5,40 1,41 3.111,42 5.111,43 3.111,45 38.9,46 0.431,47 1,48 0.917,49 0.929,50 3,51 0.658,52 1,53 8.461,54 1.477,56 2.116,59 0.22,60 2,61 0.265,62 7.979,63 13,64 1.086,65 10,66 5}
{0 CHEMBL255863,1 1.17,6 1,7 3,8 0.673,10 0.869,11 0.848,12 3,14 1.134,15 2.026,17 1,18 4,19 -0.147,20 46.278,21 3,22 0.685,23 0.691,24 1.087,26 0.234,27 0.961,28 0.521,29 8.681,30 36.1,32 0.632,34 2.039,35 0.634,36 105.063,37 5.077,38 0.665,39 7,41 2.993,42 4.993,43 2.993,45 45.9,46 0.234,47 1,48 0.961,49 0.88,50 3,51 0.782,52 2,53 11.338,54 1.603,55 14,56 2.045,57 1,59 0.183,60 10,61 0.295,62 8.678,63 29,64 1.01,65 25,66 5}
{0 CHEMBL259084,1 1.18,7 1,8 0.654,10 0.726,11 0.862,12 3,13 1,14 1.091,15 2.011,16 0.109,17 1,18 5,19 -0.037,20 35.76,21 1,22 0.731,23 0.735,24 0.908,26 0.367,27 0.935,28 0.225,29 9.732,30 30.6,32 0.538,34 2.018,35 0.323,36 68.367,37 4.932,38 0.627,39 4,41 3.224,42 5.224,43 3.224,45 51,46 0.367,48 0.935,49 0.879,51 0.809,52 2,53 8.972,54 1.539,55 14,56 2.023,57 1,59 0.184,60 11,61 0.299,62 4.764,63 27,64 0.79,65 24,66 5}
{0 CHEMBL261849,1 1.209,3 1,4 1,7 2,8 0.648,10 0.943,11 0.809,12 3,13 2,14 1.132,15 1.994,16 1,18 3,19 -0.053,20 34.768,21 4,22 0.632,23 0.658,24 1.249,26 0.521,27 0.907,28 0.374,29 7.479,30 44.9,32 0.814,34 1.993,35 0.528,36 99.365,37 4.764,38 0.86,39 4,41 2.848,42 4.848,43 2.848,45 40.8,46 0.643,48 0.885,49 0.848,50 2,51 0.759,52 2,53 10.287,54 1.437,55 7,56 2.039,57 1,59 0.191,60 7,61 0.294,62 10.086,63 18,64 1.105,65 16,66 5}
{0 CHEMBL278041,1 1.119,8 0.64,10 0.759,11 0.959,12 1,14 1.081,15 1.997,18 3,19 -0.021,20 1.825,22 0.701,23 0.717,24 0.924,26 0.615,27 0.884,28 0.218,29 8.497,30 35.9,32 0.679,34 1.996,35 0.218,36 50.357,37 4.641,38 0.787,39 3,41 3.103,42 5.103,43 3.103,45 51.3,46 0.615,47 1,48 0.884,49 1.035,51 0.9,53 7.893,54 1.462,55 12,56 2.012,59 0.174,60 18,61 0.314,62 5.82,63 23,64 0.825,65 20,66 5.347}
{0 CHEMBL288441,1 1.336,3 1,4 1,8 0.674,10 0.979,11 0.71,13 7,14 1.233,15 2.032,16 6.832,17 1,18 2,19 -0.293,20 46.674,21 10,22 0.642,23 0.677,24 1.513,26 0.619,27 0.897,28 0.641,29 8.162,30 44.6,32 0.608,34 2.03,35 0.671,36 72.104,37 5.227,38 0.709,39 5,41 3.122,42 5.122,43 3.122,45 40,46 0.712,48 0.882,49 0.683,51 0.583,53 16.176,54 1.428,55 4,56 2.082,59 0.234,60 4,61 0.25,62 12.114,63 22,64 1.108,65 15,66 5}
{0 CHEMBL296468,1 1.39,2 2,3 2,4 2,7 1,8 0.65,10 1.001,11 0.906,12 2,13 5,14 1.203,15 1.946,16 4.242,19 -0.12,20 36.798,21 10,22 0.615,23 0.67,24 1.328,26 1.128,27 0.799,28 0.469,29 7.767,30 49,32 0.768,34 1.925,35 0.493,36 69.593,37 4.99,38 0.796,39 4,41 3.319,42 5.255,43 3.319,44 0.087,45 34.7,46 1.128,48 0.799,49 0.945,50 9,51 0.42,53 13.753,54 1.259,55 3,56 2.039,58 4,59 0.304,60 4,61 0.173,62 11.51,63 16,64 0.982,65 7,66 5}
{0 CHEMBL300138,1 1.434,2 3,3 2,4 3,7 4,8 0.673,10 0.891,11 0.856,12 2,13 5,14 1.2,15 2.031,16 4.823,18 4,19 -0.177,20 30.58,21 7,22 0.66,23 0.692,24 1.287,26 0.57,27 0.906,28 0.794,29 7.583,30 42.6,32 0.74,34 2.027,35 0.825,36 41.719,37 5.356,38 0.868,39 5,41 3.407,42 5.407,43 3.407,44 0.311,45 47.1,46 0.688,48 0.887,49 0.869,51 0.679,52 4,53 19.155,54 1.545,55 11,56 2.083,59 0.224,60 14,61 0.266,62 13.098,63 35,64 1.001,65 25,66 5}
{0 CHEMBL31965,1 1.292,3 1,4 1,5 1,7 3,8 0.676,10 0.954,11 0.91,12 2,13 7,14 1.193,15 1.991,16 5.554,17 1,18 1,19 -0.212,20 45.905,21 7,22 0.648,23 0.671,24 1.32,26 0.475,27 0.919,28 0.499,29 8.237,30 42.4,32 0.63,34 1.993,35 0.566,36 72.717,37 5.173,38 0.783,39 5,41 3.039,42 5.039,43 3.039,45 40.7,46 0.475,48 0.919,49 0.934,51 0.603,53 13.657,54 1.428,55 3,56 2.064,59 0.226,60 7,61 0.26,62 10.471,63 22,64 1.102,65 17,66 5}
{0 CHEMBL377300,1 1.125,4 1,5 1,8 0.676,10 0.933,11 0.797,13 1,14 1.067,15 1.942,16 0.152,18 2,19 -0.103,20 17.207,21 5,22 0.648,23 0.661,24 1.164,26 0.354,27 0.936,28 0.342,29 8.053,30 41.3,32 0.708,34 1.973,35 0.464,36 51.398,37 4.828,38 0.679,39 4,41 3.104,42 5.104,43 3.104,44 -0.597,45 41.3,46 0.354,48 0.936,49 0.96,50 3,51 0.63,52 1,53 8.969,54 1.526,55 3,56 1.978,58 3,59 0.218,60 4,61 0.261,62 8.482,63 18,64 1.113,65 14,66 5}
{0 CHEMBL379218,1 1.258,3 1,4 2,5 1,7 1,8 0.62,10 0.88,11 0.945,13 2,14 1.213,15 2.03,16 1.226,18 4,19 0.112,20 9.41,21 4,22 0.644,23 0.68,24 1.021,26 0.383,27 0.932,28 0.249,29 7.316,30 44.9,32 0.817,34 2.013,35 0.496,36 83.009,37 4.921,38 0.91,39 4,41 3.059,42 5.059,43 3.059,44 -0.069,45 44.9,46 0.383,48 0.932,49 1.003,51 0.759,52 3,53 12.615,54 1.536,55 4,56 2.067,58 2,59 0.212,60 3,61 0.277,62 10.103,63 21,64 0.944,65 18,66 5}
{0 CHEMBL384304,1 1.414,2 3,3 2,4 3,7 1,8 0.667,10 1.008,11 0.879,12 3,13 4,14 1.07,15 2.007,16 1.813,17 1,18 2,19 -0.177,20 46.697,21 7,22 0.64,23 0.651,24 1.282,25 1,26 0.657,27 0.884,28 0.53,29 8.657,30 41.2,32 0.76,34 2.019,35 0.569,36 85.998,37 5.061,38 0.896,39 5,41 3.193,42 5.193,43 3.193,44 -0.079,45 35.3,46 0.657,48 0.884,49 1.037,51 0.6,52 4,53 11.228,54 1.325,56 2.027,57 1,59 0.223,60 2,61 0.247,62 11.052,63 18,64 1.34,65 11,66 5.208}
{0 CHEMBL386051,1 1.162,7 1,8 0.655,10 0.759,11 0.74,12 2,14 1.091,15 1.977,17 1,18 2,19 -0.137,20 34.898,21 2,22 0.718,23 0.759,24 1.185,26 0.389,27 0.929,28 0.241,29 9.853,30 35.6,32 0.554,34 1.963,35 0.437,36 54.706,37 4.736,38 0.771,39 4,41 3.179,42 5.179,43 3.179,45 46.7,46 0.389,48 0.929,49 0.835,51 0.776,52 1,53 8.664,54 1.464,55 3,56 2.012,57 1,59 0.209,60 3,61 0.273,62 4.901,63 22,64 0.775,65 19,66 5}
{0 CHEMBL428690,1 1.426,2 2,3 1,4 2,5 1,7 4,8 0.643,10 0.837,11 0.841,13 3,14 1.128,15 1.992,16 1.726,18 3,19 0.009,20 26.694,21 6,22 0.66,23 0.682,24 1.115,26 0.224,27 0.96,28 0.38,29 8.372,30 41.7,32 0.646,34 1.985,35 0.562,36 3.124,37 5.01,38 0.673,39 1,41 3.274,42 5.274,43 3.274,44 -1.171,45 43.8,46 0.224,48 0.96,49 0.896,51 0.589,52 4,53 13.079,54 1.347,55 7,56 2.077,58 3,59 0.235,60 10,61 0.242,62 8.515,63 22,64 0.899,65 15,66 5}
{0 CHEMBL440084,1 1.115,5 1,8 0.672,10 0.766,11 0.862,12 2,13 1,14 1.109,15 1.996,16 0.212,18 3,19 -0.021,20 10.192,21 1,22 0.698,23 0.71,24 1.081,26 0.267,27 0.951,28 0.218,29 8.543,30 35.6,32 0.673,34 1.998,35 0.394,36 83.254,37 4.749,38 0.805,39 4,41 3.103,42 5.103,43 3.103,45 48.9,46 0.267,47 1,48 0.951,49 0.92,51 0.845,53 8.617,54 1.439,55 15,56 2.017,59 0.181,60 14,61 0.308,62 6.777,63 26,64 0.9,65 21,66 5}
{0 CHEMBL445813,1 1.377,2 3,3 2,4 3,5 2,7 4,8 0.66,10 0.817,11 0.974,12 2,13 4,14 1.072,15 1.968,16 3.431,18 1,19 0.014,20 37.709,21 5,22 0.664,23 0.69,24 1.267,26 0.667,27 0.876,28 0.234,29 9.102,30 40.5,32 0.557,34 1.964,35 0.288,36 87.358,37 4.897,38 0.649,39 5,40 1,41 2.991,42 4.991,43 2.991,44 0.09,45 38.1,46 0.667,48 0.876,49 0.96,51 0.54,52 5,53 11.089,54 1.313,56 2.033,59 0.245,61 0.237,62 6.342,63 17,64 0.844,65 11,66 5}
{0 CHEMBL450786,1 1.32,2 5,3 4,4 5,7 3,8 0.651,10 0.91,11 0.873,12 1,13 9,14 1.29,15 1.94,16 7.905,18 4,19 -0.094,20 41.308,21 12,22 0.652,23 0.693,24 1.296,26 0.643,27 0.897,28 0.908,29 8.333,30 44.2,32 0.667,34 1.926,35 1.002,36 41.045,37 5.513,38 0.724,39 4,41 3.246,42 5.246,43 3.246,44 0.203,45 41.6,46 0.643,48 0.897,49 0.908,50 3,51 0.558,52 5,53 22.885,54 1.419,55 19,56 1.989,58 8,59 0.256,60 19,61 0.222,62 16.315,63 30,64 1.043,65 20,66 5}
{0 CHEMBL464552,1 1.186,2 1,3 1,4 1,5 1,7 5,8 0.699,10 0.965,11 0.747,12 5,13 3,14 1.098,15 1.987,16 1.619,17 2,18 3,19 -0.258,20 63.795,21 7,22 0.64,23 0.658,24 1.409,26 0.486,27 0.92,28 0.605,29 7.833,30 42.6,32 0.738,34 1.999,35 0.68,36 110.637,37 5.235,38 0.753,39 8,41 3.084,42 5.084,43 3.084,45 39.7,46 0.486,48 0.92,49 0.786,51 0.641,52 7,53 14.684,54 1.507,55 3,56 1.995,57 1,58 2,59 0.206,60 3,61 0.275,62 13.017,63 24,64 1.157,65 20,66 7.119}
{0 CHEMBL475251,1 1.087,5 1,7 3,8 0.706,10 0.986,11 0.688,12 6,14 1.068,15 1.994,17 2,19 -0.275,20 67.244,21 6,22 0.646,23 0.651,24 1.402,26 0.838,27 0.856,28 0.562,29 8.255,30 40.4,32 0.693,34 2.02,35 0.574,36 104.389,37 5.003,38 0.665,39 6,41 3.249,42 5.249,43 3.249,45 38.6,46 0.983,48 0.831,49 0.846,51 0.676,52 3,53 9.366,54 1.431,56 1.968,57 1,58 6,59 0.197,61 0.281,62 9.999,63 22,64 1.268,65 16,66 5.959}
{0 CHEMBL477772,1 1.212,7 1,8 0.661,10 0.943,11 0.735,12 4,14 1.185,15 2.037,17 1,18 2,19 -0.169,20 41.389,21 4,22 0.648,23 0.679,24 1.405,26 0.426,27 0.926,28 0.571,29 8.103,30 42.6,32 0.81,33 1,34 2.027,35 0.599,36 104.437,37 4.955,38 0.775,39 7,41 3.09,42 5.09,43 3.09,45 38.9,46 0.426,48 0.926,49 0.841,50 3,51 0.774,52 2,53 11.033,54 1.555,55 1,56 2.032,57 1,59 0.194,60 3,61 0.278,62 12.929,63 21,64 1.222,65 17,66 6.824}
{0 CHEMBL483321,1 1.221,5 1,7 1,8 0.65,10 0.952,11 0.86,12 2,13 2,14 1.129,15 2.017,16 0.467,17 1,18 3,19 -0.171,20 35.961,21 5,22 0.646,23 0.674,24 1.323,26 0.295,27 0.951,28 0.584,29 7.574,30 43.5,32 0.773,34 2.02,35 0.618,36 86.378,37 5.066,38 0.856,39 5,41 2.997,42 4.997,43 2.997,45 43.5,46 0.295,48 0.951,49 0.912,50 3,51 0.743,52 3,53 13.253,54 1.591,55 11,56 2.099,59 0.198,60 10,61 0.288,62 12.045,63 22,64 1.106,65 22,66 5}
{0 CHEMBL491473,1 1.24,2 2,3 3,4 3,7 1,8 0.682,10 1,11 0.858,13 7,14 1.211,15 1.988,16 7.491,18 2,19 -0.195,20 29.075,21 9,22 0.632,23 0.658,24 1.282,26 0.592,27 0.9,28 0.584,29 7.509,30 45,32 0.744,34 1.999,35 0.886,36 53.481,37 5.18,38 0.842,39 4,41 3.047,42 5.047,43 3.047,45 41.7,46 0.592,48 0.9,49 0.93,51 0.591,53 14.879,54 1.52,55 3,56 2.045,58 4,59 0.24,60 5,61 0.248,62 12.288,63 24,64 1.191,65 16,66 5}
{0 CHEMBL494089,1 1.422,2 2,3 2,4 2,5 2,7 1,8 0.685,10 1.013,11 0.883,12 1,13 6,14 1.146,15 1.991,16 5.417,19 -0.13,20 27.057,21 11,22 0.613,23 0.638,24 1.432,26 0.625,27 0.893,28 0.592,29 7.337,30 46.6,32 0.814,34 1.991,35 0.599,36 125.571,37 5.18,38 0.755,39 7,41 3.185,42 5.139,43 3.185,44 0.436,45 36.2,46 0.625,47 1,48 0.893,49 1.029,50 2,51 0.484,52 1,53 14.886,54 1.408,55 3,56 2.058,58 11,59 0.264,60 1,61 0.216,62 12.784,63 20,64 1.172,65 8,66 5}
{0 CHEMBL509032,1 1.446,2 3,3 2,4 4,5 1,7 6,8 0.679,10 1.061,11 0.869,12 3,13 8,14 1.331,15 2.095,16 8.935,17 2,19 -0.294,20 76.143,21 14,22 0.613,23 0.657,24 1.607,26 0.842,27 0.868,28 0.825,29 7.491,30 48.8,31 1,32 0.776,33 1,34 2.064,35 0.825,36 78.966,37 5.577,38 0.824,39 7,41 3.028,42 5.028,43 3.028,44 0.081,45 36.6,46 0.842,48 0.868,49 0.885,51 0.548,52 2,53 23.955,54 1.419,55 2,56 2.085,57 1,58 6,59 0.253,60 4,61 0.227,62 20.736,63 30,64 1.256,65 16,66 7.301}
{0 CHEMBL513909,1 1.4,2 9,3 7,4 10,5 1,7 3,8 0.691,10 1.127,11 0.934,12 3,13 9,14 1.313,15 2.046,16 9.06,17 1,18 1,19 -0.336,20 69.22,21 16,22 0.594,23 0.631,24 1.678,26 0.792,27 0.874,28 0.825,29 6.776,30 50.6,31 1,32 0.864,33 1,34 2.047,35 0.876,36 78.966,37 5.562,38 0.894,39 7,41 3.179,42 5.179,43 3.179,44 0.261,45 36.4,46 0.792,48 0.874,49 0.975,50 7,51 0.447,52 3,53 22.827,54 1.283,56 2.051,57 1,58 6,59 0.278,60 4,61 0.206,62 18.11,63 27,64 1.322,65 12,66 5.602}
{0 CHEMBL521851,1 1.334,7 1,8 0.7,9 1,10 0.973,11 0.802,13 9,14 1.224,15 2.064,16 6.219,18 2,19 -0.254,20 35.664,21 10,22 0.644,23 0.682,24 1.477,26 0.786,27 0.868,28 0.825,29 8.286,30 43.5,31 1,32 0.755,33 1,34 2.04,35 0.832,36 74.664,37 5.279,38 0.947,39 7,41 3.106,42 5.106,43 3.106,45 37.1,46 0.786,48 0.868,49 0.842,51 0.557,53 16.27,54 1.457,55 2,56 2.038,59 0.251,60 3,61 0.234,62 14.833,63 30,64 1.185,65 13,66 5.367}
{0 CHEMBL522892,1 1.307,7 3,8 0.698,10 0.876,11 0.817,12 2,13 4,14 1.151,15 2.053,16 3.933,18 1,19 -0.139,20 38.408,21 5,22 0.649,23 0.67,24 1.227,26 0.535,27 0.905,28 0.343,29 7.85,30 42,31 1,32 0.733,33 1,34 2.066,35 0.641,36 90.728,37 5.047,38 0.767,39 6,41 3.24,42 5.24,43 3.24,45 42,46 0.535,47 1,48 0.905,49 0.88,51 0.621,52 6,53 12.309,54 1.442,55 1,56 2.047,59 0.218,60 2,61 0.265,62 9.549,63 25,64 1.004,65 16,66 5}
{0 CHEMBL525191,1 1.219,2 2,3 2,4 2,5 1,7 5,8 0.64,10 0.857,11 0.903,13 4,14 1.066,15 1.94,16 2.121,18 5,19 0.08,20 8.152,21 4,22 0.656,23 0.681,24 1.047,26 0.372,27 0.931,28 0.218,29 7.777,30 41.9,32 0.762,34 1.944,35 0.297,36 48.473,37 4.805,38 0.878,39 4,41 3.165,42 5.165,43 3.165,45 44.2,46 0.372,48 0.931,49 0.927,50 2,51 0.7,52 3,53 10.613,54 1.45,55 5,56 2.024,59 0.221,60 6,61 0.271,62 8.273,63 20,64 0.91,65 15,66 5}
{0 CHEMBL535,1 1.217,5 1,7 3,8 0.638,10 1.031,11 0.866,12 2,13 4,14 1.113,15 1.965,16 3.24,18 3,19 -0.12,20 30.71,21 8,22 0.611,23 0.643,24 1.273,26 0.732,27 0.874,28 0.612,29 7.117,30 48.2,32 0.827,34 1.96,35 0.869,36 55.931,37 5.08,38 0.753,39 4,41 3.22,42 5.22,43 3.22,45 39.3,46 0.732,48 0.874,49 0.935,50 3,51 0.517,52 4,53 13.974,54 1.383,55 6,56 1.969,58 6,59 0.244,60 4,61 0.234,62 12.112,63 14,64 1.147,65 14,66 6.638}
{0 CHEMBL553,1 1.189,8 0.655,10 1.008,11 0.78,12 1,13 4,14 1.065,15 1.977,16 1.726,17 1,18 2,19 -0.249,20 33.398,21 6,22 0.638,23 0.662,24 1.4,26 0.721,27 0.873,28 0.418,29 7.567,30 44.2,32 0.769,34 1.969,35 0.557,36 51.582,37 4.845,38 1.004,39 3,41 3.024,42 5.024,43 3.024,45 42.3,46 0.76,48 0.867,49 0.778,51 0.672,53 10.493,54 1.479,55 5,56 2.063,59 0.21,60 6,61 0.281,62 10.332,63 16,64 1.227,65 14,66 5.216}
{0 CHEMBL554,1 1.278,5 1,7 4,8 0.65,10 0.875,11 0.949,12 1,13 4,14 1.209,15 2.021,16 1.023,17 1,18 3,19 -0.083,20 40.3,21 5,22 0.677,23 0.703,24 1.128,26 0.224,27 0.963,28 0.619,29 8.805,30 39.4,32 0.688,34 2.007,35 0.706,36 69.593,37 5.243,38 0.966,39 4,41 3.053,42 5.053,43 3.053,45 43.9,46 0.224,48 0.963,49 1.127,51 0.75,52 3,53 14.463,54 1.607,55 9,56 2.082,59 0.204,60 13,61 0.276,62 12.31,63 27,64 1.073,65 24,66 5}
{0 CHEMBL558752,1 1.136,5 1,7 2,8 0.696,10 0.848,11 0.851,12 3,14 1.097,15 2.007,17 1,18 1,19 -0.13,20 34.25,21 3,22 0.705,23 0.683,24 0.992,26 0.42,27 0.927,28 0.357,29 9.782,30 30.2,32 0.548,34 2.014,35 0.394,36 87.052,37 4.965,38 0.574,39 6,41 2.998,42 4.998,43 2.998,45 45.3,46 0.42,47 2,48 0.927,49 0.901,51 0.676,53 8.136,54 1.574,55 6,56 2.009,59 0.189,60 4,61 0.283,62 4.994,63 26,64 1.029,65 21,66 5}
{0 CHEMBL559845,1 1.303,2 2,3 2,4 2,5 1,8 0.677,10 0.844,11 0.853,12 3,13 2,14 1.062,15 1.975,16 1.475,17 1,18 2,19 -0.047,20 27.935,21 3,22 0.662,23 0.682,24 1.224,26 0.469,27 0.912,28 0.218,29 8.01,30 40,32 0.725,34 1.962,35 0.26,36 102.919,37 4.72,38 0.716,39 6,41 3.251,42 5.251,43 3.251,45 42.5,46 0.469,48 0.912,49 0.937,50 4,51 0.75,52 2,53 8.657,54 1.428,55 6,56 2.036,57 1,59 0.203,60 2,61 0.282,62 7.196,63 19,64 0.961,65 14,66 6.301}
{0 CHEMBL562030,1 1.304,2 2,3 2,4 2,5 1,8 0.661,10 0.874,11 0.919,12 3,13 3,14 1.151,15 2.017,16 1.979,17 1,18 3,19 -0.075,20 35.232,21 4,22 0.661,23 0.69,24 1.211,26 0.505,27 0.912,28 0.463,29 7.746,30 41.5,32 0.74,34 2.004,35 0.634,36 88.032,37 5.024,38 0.83,39 6,41 3.255,42 5.255,43 3.255,45 45.3,46 0.543,48 0.905,49 0.969,50 4,51 0.774,52 2,53 12.907,54 1.482,55 11,56 2.044,57 1,59 0.204,60 5,61 0.286,62 9.894,63 25,64 0.978,65 20,66 4.959}
{0 CHEMBL562104,1 1.304,2 2,3 2,4 2,5 1,8 0.68,10 0.909,11 0.815,12 3,13 2,14 1.062,15 1.975,16 1.553,17 1,18 2,19 -0.144,20 28.775,21 4,22 0.651,23 0.676,24 1.335,26 0.5,27 0.908,28 0.26,29 7.777,30 41.9,32 0.736,34 1.962,35 0.457,36 88.032,37 4.785,38 0.751,39 6,41 3.255,42 5.255,43 3.255,45 41.9,46 0.5,48 0.908,49 0.871,50 4,51 0.72,52 2,53 9.707,54 1.423,55 6,56 2.036,57 1,59 0.209,60 2,61 0.278,62 8.148,63 19,64 1.049,65 14,66 5.664}
{0 CHEMBL563150,1 1.304,2 2,3 2,4 2,5 1,8 0.667,10 0.85,11 0.922,12 3,13 2,14 1.063,15 2,16 1.494,17 1,18 2,19 -0.076,20 36.275,21 3,22 0.671,23 0.696,24 1.199,26 0.655,27 0.884,28 0.273,29 7.93,30 40,32 0.718,34 1.994,35 0.492,36 88.032,37 4.961,38 0.794,39 6,41 3.256,42 5.256,43 3.256,45 46,46 0.815,48 0.856,49 0.993,50 4,51 0.817,52 2,53 11.403,54 1.488,55 11,56 2.037,57 1,59 0.196,60 6,61 0.293,62 8.907,63 25,64 0.957,65 20,66 5}
{0 CHEMBL572878,1 1.29,2 2,3 2,4 2,7 3,8 0.689,10 0.965,11 0.932,12 3,13 6,14 1.089,15 1.981,16 5.843,17 1,19 -0.188,20 58.816,21 9,22 0.629,23 0.668,24 1.424,26 0.779,27 0.869,28 0.803,29 7.617,30 45.9,31 1,32 0.766,33 1,34 1.972,35 0.825,36 109.167,37 5.18,38 0.835,39 8,40 1,41 2.913,42 4.913,43 2.913,44 0.189,45 37.7,46 0.779,48 0.869,49 0.974,50 4,51 0.591,52 2,53 14.782,54 1.358,55 3,56 1.997,57 1,59 0.244,60 8,61 0.241,62 13.326,63 26,64 1.035,65 14,66 5.046}
{0 CHEMBL572881,1 1.272,7 4,8 0.652,10 0.917,11 0.896,12 2,13 2,14 1.107,15 1.995,16 1.461,17 2,18 3,19 -0.095,20 44.521,21 5,22 0.638,23 0.673,24 1.272,25 2,26 0.579,27 0.898,28 0.469,29 7.324,30 45.1,32 0.813,34 1.989,35 0.537,36 87.603,37 5.002,38 0.839,39 5,41 3.444,42 5.444,43 3.444,45 43.1,46 0.579,48 0.898,49 0.937,50 6,51 0.75,52 6,53 13.703,54 1.45,55 5,56 2.028,59 0.211,60 7,61 0.272,62 10.48,63 21,64 1.011,65 17,66 5}
{0 CHEMBL573339,1 1.218,7 1,8 0.712,9 1,10 0.87,11 0.837,13 4,14 1.097,15 1.957,16 2.753,18 2,19 -0.256,20 16.024,21 4,22 0.676,23 0.689,24 1.35,26 0.476,27 0.912,28 0.237,29 8.295,30 38.1,31 1,32 0.676,33 1,34 1.975,35 0.259,36 53.481,37 4.81,38 0.844,39 4,41 3.224,42 5.224,43 3.224,45 45.2,46 0.476,48 0.912,49 0.911,51 0.731,53 8.985,54 1.525,55 4,56 2.025,59 0.206,60 4,61 0.286,62 7.051,63 25,64 1.072,65 15,66 5}
{0 CHEMBL574738,1 1.341,7 3,8 0.684,10 1.035,11 0.904,12 3,13 6,14 1.168,15 2.008,16 4.244,17 1,18 2,19 -0.229,20 62.867,21 9,22 0.626,23 0.642,24 1.291,25 1,26 0.68,27 0.888,28 0.653,29 7.789,30 44.1,32 0.725,34 2.021,35 0.824,36 93.852,37 5.307,38 0.789,39 7,41 3.062,42 5.062,43 3.062,45 38.2,46 0.71,48 0.883,49 0.917,51 0.566,52 3,53 16.266,54 1.394,55 9,56 2.053,58 3,59 0.223,60 4,61 0.257,62 13.199,63 24,64 1.233,65 17,66 6.638}
{0 CHEMBL576982,1 1.256,5 1,7 3,8 0.688,10 0.958,11 0.833,12 3,13 6,14 1.208,15 1.997,16 5.072,18 1,19 -0.182,20 41.564,21 10,22 0.639,23 0.672,24 1.367,26 0.907,27 0.853,28 0.69,29 7.788,30 44.4,32 0.737,34 1.999,35 0.825,36 76.814,37 5.359,38 0.791,39 6,41 3.322,42 5.322,43 3.322,45 40.3,46 0.907,47 1,48 0.853,49 0.894,50 9,51 0.575,52 2,53 18.301,54 1.517,55 8,56 2.022,59 0.243,60 8,61 0.24,62 14.964,63 29,64 1.062,65 19,66 5}
{0 CHEMBL601719,1 1.392,2 3,3 2,4 4,5 1,7 4,8 0.658,10 0.868,11 0.877,12 1,13 4,14 1.171,15 2.004,16 4.068,18 3,19 -0.029,20 28.517,21 7,22 0.656,23 0.688,24 1.135,26 0.515,27 0.91,28 0.494,29 8.661,30 42.3,32 0.571,34 2.012,35 0.639,36 86.133,37 5.103,38 0.64,39 5,41 2.952,42 4.952,43 2.952,44 -0.243,45 40.4,46 0.515,48 0.91,49 0.903,51 0.567,52 1,53 13.474,54 1.409,55 4,56 2.039,58 3,59 0.247,60 7,61 0.234,62 8.72,63 23,64 0.917,65 14,66 5}
{0 CHEMBL607707,1 1.241,5 1,7 3,8 0.644,10 0.918,11 0.778,12 1,13 2,14 1.048,15 1.951,16 1.007,17 1,18 2,19 -0.156,20 40.331,21 5,22 0.661,23 0.685,24 1.222,26 0.469,27 0.919,28 0.469,29 8.357,30 41.1,32 0.629,34 1.952,35 0.633,36 86.991,37 5.005,38 0.686,39 5,41 3.129,42 5.129,43 3.129,45 42.9,46 0.469,48 0.919,49 0.817,51 0.712,53 11.813,54 1.477,55 4,56 2.09,58 3,59 0.204,60 8,61 0.276,62 9.303,63 16,64 1.027,65 18,66 5}
{0 CHEMBL608154,1 1.208,5 2,7 2,8 0.673,10 0.793,11 0.708,12 1,14 1.042,15 1.994,18 3,19 -0.122,20 14.608,21 2,22 0.695,23 0.716,24 1.223,26 0.232,27 0.957,28 0.276,29 8.947,30 36.6,32 0.569,34 2.004,35 0.333,36 68.367,37 4.644,38 0.624,39 4,40 1,41 3.235,42 5.235,43 3.235,45 46.3,46 0.232,48 0.957,49 0.745,51 0.788,52 1,53 7.388,54 1.558,55 6,56 2.014,59 0.189,60 4,61 0.295,62 5.726,63 19,64 0.891,65 17,66 5}
{0 CHEMBL7064,1 1.278,8 0.632,10 0.658,11 0.84,14 0.989,15 1.892,18 4,19 0.248,20 0.417,22 0.734,23 0.75,24 0.704,27 1,29 8.81,30 32,32 0.606,34 1.889,36 33.326,37 4.232,38 0.723,39 2,41 3.387,42 5.387,43 3.387,45 56,46 0.08,48 0.983,49 0.907,51 0.912,53 5.179,54 1.481,55 2,56 2.105,59 0.184,60 5,61 0.308,62 3.207,63 15,64 0.683,65 14,66 7.009}
{0 CHEMBL91829,1 1.309,2 2,3 1,4 2,7 3,8 0.679,10 0.943,11 0.786,12 2,13 5,14 1.204,15 2.026,16 3.644,18 4,19 -0.211,20 21.51,21 8,22 0.644,23 0.675,24 1.368,26 0.754,27 0.874,28 0.647,29 7.438,30 44.4,32 0.757,34 2.024,35 0.837,36 24.933,37 5.269,38 0.874,39 4,41 3.405,42 5.405,43 3.405,44 0.074,45 44.4,46 0.881,48 0.853,49 0.786,51 0.586,52 4,53 17.839,54 1.472,55 10,56 2.05,59 0.233,60 10,61 0.252,62 12.794,63 27,64 1.083,65 20,66 5}
{0 CHEMBL939,1 1.292,3 1,4 1,7 1,8 0.685,10 0.989,11 0.833,12 1,13 7,14 1.182,15 1.991,16 5.899,17 1,18 1,19 -0.241,20 41.089,21 8,22 0.641,23 0.665,24 1.345,26 0.559,27 0.903,28 0.498,29 8.126,30 43.6,32 0.626,34 1.993,35 0.59,36 54.706,37 5.085,38 0.792,39 4,41 3.023,42 5.023,43 3.023,45 40,46 0.559,48 0.903,49 0.838,51 0.565,53 12.9,54 1.427,55 2,56 2.056,59 0.235,60 4,61 0.253,62 10.201,63 22,64 1.16,65 14,66 5}
{0 CHEMBL941,1 1.323,7 2,8 0.669,10 0.972,11 0.877,12 3,13 5,14 1.16,15 2.045,16 5.237,17 1,18 4,19 -0.243,20 48.345,21 7,22 0.635,23 0.671,24 1.433,26 0.581,27 0.905,28 0.691,29 7.26,30 45.6,32 0.808,34 2.05,35 0.735,36 92.627,37 5.286,38 0.919,39 7,41 2.89,42 4.89,43 2.89,45 42.6,46 0.581,48 0.905,49 0.878,50 3,51 0.716,52 2,53 17.809,54 1.525,55 13,56 2.065,57 1,59 0.209,60 11,61 0.279,62 14.153,63 30,64 1.104,65 22,66 5}
