{
  "data_set_description": {
    "collection_date": "November 2013",
    "creator": "Dr Jeremy Besnard, Dr Ivan Olier, Dr Noureddin Sadawi, Dr Larisa Soldatova, Dr Crina Grosan, Prof Ross King, Dr Richard Bickerton, Prof Andrew Hopkins and Dr Willem van Hoorn",
    "default_target_attribute": "pXC50",
    "description": "This dataset contains QSAR data (from ChEMBL version 17) showing activity values (unit is pseudo-pCI50) of several compounds on drug target ChEMBL_ID: CHEMBL2034807 (TID: 104547), and it has 33 rows and 1217 features (not including molecule IDs and class feature: molecule_id and pXC50). The features represent Molecular Descriptors which were generated from SMILES strings. Missing value imputation was applied to this dataset (By choosing the Median).",
    "description_version": "1",
    "file_id": "3633226",
    "format": "ARFF",
    "id": "38213",
    "licence": "Public",
    "md5_checksum": "39bfd1dcd113f17d1ffeb5664e5b30f9",
    "minio_url": "https://data.openml.org/datasets/0003/38213/dataset_38213.pq",
    "name": "QSAR-DATASET-FOR-DRUG-TARGET-CHEMBL2034807",
    "original_data_url": "https://www.ebi.ac.uk/chembl/target/inspect/CHEMBL2034807",
    "parquet_url": "https://data.openml.org/datasets/0003/38213/dataset_38213.pq",
    "processing_date": "2018-10-04 05:54:50",
    "row_id_attribute": "molecule_id",
    "status": "deactivated",
    "tag": [
      "MetaQSAR",
      "study_13"
    ],
    "upload_date": "2016-07-16T03:22:26",
    "url": "https://api.openml.org/data/v1/download/3633226/QSAR-DATASET-FOR-DRUG-TARGET-CHEMBL2034807.arff",
    "version": "11",
    "visibility": "public"
  }
}