{
  "data_set_description": {
    "collection_date": "November 2013",
    "creator": "Dr Jeremy Besnard, Dr Ivan Olier, Dr Noureddin Sadawi, Dr Larisa Soldatova, Dr Crina Grosan, Prof Ross King, Dr Richard Bickerton, Prof Andrew Hopkins and Dr Willem van Hoorn",
    "default_target_attribute": "pXC50",
    "description": "This dataset contains QSAR data (from ChEMBL version 17) showing activity values (unit is pseudo-pCI50) of several compounds on drug target ChEMBL_ID: CHEMBL6145 (TID: 102448), and it has 204 rows and 43 features (not including molecule IDs and class feature: molecule_id and pXC50). The features represent Basic Molecular Descriptors which were generated from SMILES strings.  Missing value imputation was applied to this dataset (By choosing the Median).",
    "description_version": "1",
    "file_id": "3633225",
    "format": "ARFF",
    "id": "38212",
    "licence": "Public",
    "md5_checksum": "95fec6a478e7a59f0f8f6af33b076d43",
    "minio_url": "https://data.openml.org/datasets/0003/38212/dataset_38212.pq",
    "name": "QSAR-DATASET-FOR-DRUG-TARGET-CHEMBL6145",
    "original_data_url": "https://www.ebi.ac.uk/chembl/target/inspect/CHEMBL6145",
    "parquet_url": "https://data.openml.org/datasets/0003/38212/dataset_38212.pq",
    "processing_date": "2018-10-04 06:00:50",
    "row_id_attribute": "molecule_id",
    "status": "deactivated",
    "tag": [
      "MetaQSAR",
      "study_13"
    ],
    "upload_date": "2016-07-16T03:22:17",
    "url": "https://api.openml.org/data/v1/download/3633225/QSAR-DATASET-FOR-DRUG-TARGET-CHEMBL6145.arff",
    "version": "12",
    "visibility": "public"
  }
}