{
  "data_set_description": {
    "collection_date": "November 2013",
    "creator": "Dr Jeremy Besnard, Dr Ivan Olier, Dr Noureddin Sadawi, Dr Larisa Soldatova, Dr Crina Grosan, Prof Ross King, Dr Richard Bickerton, Prof Andrew Hopkins and Dr Willem van Hoorn",
    "default_target_attribute": "pXC50",
    "description": "This dataset contains QSAR data (from ChEMBL version 17) showing activity values (unit is pseudo-pCI50) of several compounds on drug target ChEMBL_ID: CHEMBL4193 (TID: 100225), and it has 23 rows and 43 features (not including molecule IDs and class feature: molecule_id and pXC50). The features represent Basic Molecular Descriptors which were generated from SMILES strings.  Missing value imputation was applied to this dataset (By choosing the Median).",
    "description_version": "1",
    "file_id": "3633124",
    "format": "ARFF",
    "id": "38209",
    "licence": "Public",
    "md5_checksum": "7d1653a9ff49f79538c72e490ac6f35f",
    "minio_url": "https://data.openml.org/datasets/0003/38209/dataset_38209.pq",
    "name": "QSAR-DATASET-FOR-DRUG-TARGET-CHEMBL4193",
    "original_data_url": "https://www.ebi.ac.uk/chembl/target/inspect/CHEMBL4193",
    "parquet_url": "https://data.openml.org/datasets/0003/38209/dataset_38209.pq",
    "processing_date": "2018-10-04 05:54:42",
    "row_id_attribute": "molecule_id",
    "status": "deactivated",
    "tag": [
      "MetaQSAR",
      "study_13"
    ],
    "upload_date": "2016-07-16T03:21:38",
    "url": "https://api.openml.org/data/v1/download/3633124/QSAR-DATASET-FOR-DRUG-TARGET-CHEMBL4193.arff",
    "version": "12",
    "visibility": "public"
  }
}