{
  "data_qualities": {
    "quality": [
      {
        "name": "AutoCorrelation",
        "value": "0.16813907096038758"
      },
      {
        "name": "CfsSubsetEval_DecisionStumpAUC",
        "value": "0.7903714453605835"
      },
      {
        "name": "CfsSubsetEval_DecisionStumpErrRate",
        "value": "0.5485111839293346"
      },
      {
        "name": "CfsSubsetEval_DecisionStumpKappa",
        "value": "0.28827201632685395"
      },
      {
        "name": "CfsSubsetEval_NaiveBayesAUC",
        "value": "0.7903714453605835"
      },
      {
        "name": "CfsSubsetEval_NaiveBayesErrRate",
        "value": "0.5485111839293346"
      },
      {
        "name": "CfsSubsetEval_NaiveBayesKappa",
        "value": "0.28827201632685395"
      },
      {
        "name": "CfsSubsetEval_kNN1NAUC",
        "value": "0.7903714453605835"
      },
      {
        "name": "CfsSubsetEval_kNN1NErrRate",
        "value": "0.5485111839293346"
      },
      {
        "name": "CfsSubsetEval_kNN1NKappa",
        "value": "0.28827201632685395"
      },
      {
        "name": "ClassEntropy",
        "value": "2.7584684466767917"
      },
      {
        "name": "DecisionStumpAUC",
        "value": "0.7649964093493558"
      },
      {
        "name": "DecisionStumpErrRate",
        "value": "0.5542100014247043"
      },
      {
        "name": "DecisionStumpKappa",
        "value": "0.2772002929222708"
      },
      {
        "name": "Dimensionality",
        "value": "0.008690696680438809"
      },
      {
        "name": "EquivalentNumberOfAtts",
        "value": "28.226612789918043"
      },
      {
        "name": "J48.00001.AUC",
        "value": "0.794716535497546"
      },
      {
        "name": "J48.00001.ErrRate",
        "value": "0.5526428266134777"
      },
      {
        "name": "J48.00001.Kappa",
        "value": "0.2898287661764161"
      },
      {
        "name": "J48.0001.AUC",
        "value": "0.794716535497546"
      },
      {
        "name": "J48.0001.ErrRate",
        "value": "0.5526428266134777"
      },
      {
        "name": "J48.0001.Kappa",
        "value": "0.2898287661764161"
      },
      {
        "name": "J48.001.AUC",
        "value": "0.794716535497546"
      },
      {
        "name": "J48.001.ErrRate",
        "value": "0.5526428266134777"
      },
      {
        "name": "J48.001.Kappa",
        "value": "0.2898287661764161"
      },
      {
        "name": "MajorityClassPercentage",
        "value": "27.61077076506625"
      },
      {
        "name": "MajorityClassSize",
        "value": "1938.0"
      },
      {
        "name": "MaxAttributeEntropy",
        "value": "7.915126707190236"
      },
      {
        "name": "MaxKurtosisOfNumericAtts",
        "value": []
      },
      {
        "name": "MaxMeansOfNumericAtts",
        "value": []
      },
      {
        "name": "MaxMutualInformation",
        "value": "0.80654025223146"
      },
      {
        "name": "MaxNominalAttDistinctValues",
        "value": "488.0"
      },
      {
        "name": "MaxSkewnessOfNumericAtts",
        "value": []
      },
      {
        "name": "MaxStdDevOfNumericAtts",
        "value": []
      },
      {
        "name": "MeanAttributeEntropy",
        "value": "1.9199535044430214"
      },
      {
        "name": "MeanKurtosisOfNumericAtts",
        "value": []
      },
      {
        "name": "MeanMeansOfNumericAtts",
        "value": []
      },
      {
        "name": "MeanMutualInformation",
        "value": "0.09772580462300666"
      },
      {
        "name": "MeanNoiseToSignalRatio",
        "value": "18.646330995682842"
      },
      {
        "name": "MeanNominalAttDistinctValues",
        "value": "49.03278688524591"
      },
      {
        "name": "MeanSkewnessOfNumericAtts",
        "value": []
      },
      {
        "name": "MeanStdDevOfNumericAtts",
        "value": []
      },
      {
        "name": "MinAttributeEntropy",
        "value": "-0.0"
      },
      {
        "name": "MinKurtosisOfNumericAtts",
        "value": []
      },
      {
        "name": "MinMeansOfNumericAtts",
        "value": []
      },
      {
        "name": "MinMutualInformation",
        "value": "0.0"
      },
      {
        "name": "MinNominalAttDistinctValues",
        "value": "1.0"
      },
      {
        "name": "MinSkewnessOfNumericAtts",
        "value": []
      },
      {
        "name": "MinStdDevOfNumericAtts",
        "value": []
      },
      {
        "name": "MinorityClassPercentage",
        "value": "3.6757372845134633"
      },
      {
        "name": "MinorityClassSize",
        "value": "258.0"
      },
      {
        "name": "NaiveBayesAUC",
        "value": "0.7383513949164907"
      },
      {
        "name": "NaiveBayesErrRate",
        "value": "0.6818635133209859"
      },
      {
        "name": "NaiveBayesKappa",
        "value": "0.20685383706253013"
      },
      {
        "name": "NumberOfBinaryFeatures",
        "value": "8.0"
      },
      {
        "name": "NumberOfClasses",
        "value": "8.0"
      },
      {
        "name": "NumberOfFeatures",
        "value": "61.0"
      },
      {
        "name": "NumberOfInstances",
        "value": "7019.0"
      },
      {
        "name": "NumberOfInstancesWithMissingValues",
        "value": "7019.0"
      },
      {
        "name": "NumberOfMissingValues",
        "value": "48089.0"
      },
      {
        "name": "NumberOfNumericFeatures",
        "value": "0.0"
      },
      {
        "name": "NumberOfSymbolicFeatures",
        "value": "61.0"
      },
      {
        "name": "PercentageOfBinaryFeatures",
        "value": "13.114754098360656"
      },
      {
        "name": "PercentageOfInstancesWithMissingValues",
        "value": "100.0"
      },
      {
        "name": "PercentageOfMissingValues",
        "value": "11.231575185853854"
      },
      {
        "name": "PercentageOfNumericFeatures",
        "value": "0.0"
      },
      {
        "name": "PercentageOfSymbolicFeatures",
        "value": "100.0"
      },
      {
        "name": "Quartile1AttributeEntropy",
        "value": "0.918606251363508"
      },
      {
        "name": "Quartile1KurtosisOfNumericAtts",
        "value": []
      },
      {
        "name": "Quartile1MeansOfNumericAtts",
        "value": []
      },
      {
        "name": "Quartile1MutualInformation",
        "value": "0.02064051789118"
      },
      {
        "name": "Quartile1SkewnessOfNumericAtts",
        "value": []
      },
      {
        "name": "Quartile1StdDevOfNumericAtts",
        "value": []
      },
      {
        "name": "Quartile2AttributeEntropy",
        "value": "1.2973171920283262"
      },
      {
        "name": "Quartile2KurtosisOfNumericAtts",
        "value": []
      },
      {
        "name": "Quartile2MeansOfNumericAtts",
        "value": []
      },
      {
        "name": "Quartile2MutualInformation",
        "value": "0.052036475211604996"
      },
      {
        "name": "Quartile2SkewnessOfNumericAtts",
        "value": []
      },
      {
        "name": "Quartile2StdDevOfNumericAtts",
        "value": []
      },
      {
        "name": "Quartile3AttributeEntropy",
        "value": "2.4335107588316895"
      },
      {
        "name": "Quartile3KurtosisOfNumericAtts",
        "value": []
      },
      {
        "name": "Quartile3MeansOfNumericAtts",
        "value": []
      },
      {
        "name": "Quartile3MutualInformation",
        "value": "0.1272600779860775"
      },
      {
        "name": "Quartile3SkewnessOfNumericAtts",
        "value": []
      },
      {
        "name": "Quartile3StdDevOfNumericAtts",
        "value": []
      },
      {
        "name": "REPTreeDepth1AUC",
        "value": "0.49985767654996216"
      },
      {
        "name": "REPTreeDepth1ErrRate",
        "value": "0.7238922923493375"
      },
      {
        "name": "REPTreeDepth1Kappa",
        "value": "0.0"
      },
      {
        "name": "REPTreeDepth2AUC",
        "value": "0.49985767654996216"
      },
      {
        "name": "REPTreeDepth2ErrRate",
        "value": "0.7238922923493375"
      },
      {
        "name": "REPTreeDepth2Kappa",
        "value": "0.0"
      },
      {
        "name": "REPTreeDepth3AUC",
        "value": "0.49985767654996216"
      },
      {
        "name": "REPTreeDepth3ErrRate",
        "value": "0.7238922923493375"
      },
      {
        "name": "REPTreeDepth3Kappa",
        "value": "0.0"
      },
      {
        "name": "RandomTreeDepth1AUC",
        "value": "0.585499077483726"
      },
      {
        "name": "RandomTreeDepth1ErrRate",
        "value": "0.7170537113548938"
      },
      {
        "name": "RandomTreeDepth1Kappa",
        "value": "0.109849716291366"
      },
      {
        "name": "RandomTreeDepth2AUC",
        "value": "0.585499077483726"
      },
      {
        "name": "RandomTreeDepth2ErrRate",
        "value": "0.7170537113548938"
      },
      {
        "name": "RandomTreeDepth2Kappa",
        "value": "0.109849716291366"
      },
      {
        "name": "RandomTreeDepth3AUC",
        "value": "0.585499077483726"
      },
      {
        "name": "RandomTreeDepth3ErrRate",
        "value": "0.7170537113548938"
      },
      {
        "name": "RandomTreeDepth3Kappa",
        "value": "0.109849716291366"
      },
      {
        "name": "StdvNominalAttDistinctValues",
        "value": "94.86533740222065"
      },
      {
        "name": "kNN1NAUC",
        "value": "0.6399319629373834"
      },
      {
        "name": "kNN1NErrRate",
        "value": "0.6619176520871919"
      },
      {
        "name": "kNN1NKappa",
        "value": "0.19321924907774557"
      }
    ]
  }
}