"molecule_id","FCFP4_1024b1","FCFP4_1024b10","FCFP4_1024b100","FCFP4_1024b1000","FCFP4_1024b1001","FCFP4_1024b1002","FCFP4_1024b1003","FCFP4_1024b1004","FCFP4_1024b1005","FCFP4_1024b1006","FCFP4_1024b1007","FCFP4_1024b1008","FCFP4_1024b1009","FCFP4_1024b101","FCFP4_1024b1010","FCFP4_1024b1011","FCFP4_1024b1012","FCFP4_1024b1013","FCFP4_1024b1014","FCFP4_1024b1015","FCFP4_1024b1016","FCFP4_1024b1017","FCFP4_1024b1018","FCFP4_1024b1019","FCFP4_1024b102","FCFP4_1024b1020","FCFP4_1024b1021","FCFP4_1024b1022","FCFP4_1024b1023","FCFP4_1024b1024","FCFP4_1024b103","FCFP4_1024b104","FCFP4_1024b105","FCFP4_1024b106","FCFP4_1024b107","FCFP4_1024b108","FCFP4_1024b109","FCFP4_1024b11","FCFP4_1024b110","FCFP4_1024b111","FCFP4_1024b112","FCFP4_1024b113","FCFP4_1024b114","FCFP4_1024b115","FCFP4_1024b116","FCFP4_1024b117","FCFP4_1024b118","FCFP4_1024b119","FCFP4_1024b12","FCFP4_1024b120","FCFP4_1024b121","pXC50"
{1 1,50 1,52 5.802}
{0 CHEMBL1087588,1 1,10 1,52 4.667}
{0 CHEMBL1200832,1 1,2 1,14 1,52 5.587}
{0 CHEMBL1222385,1 1,2 1,35 1,52 4.604}
{0 CHEMBL1234,1 1,23 1,33 1,52 6.138}
{0 CHEMBL1242180,1 1,52 4.269}
{0 CHEMBL1278181,1 1,31 1,35 1,52 6.098}
{0 CHEMBL1299903,1 1,52 4.781}
{0 CHEMBL1299925,1 1,2 1,52 5.116}
{0 CHEMBL1300080,1 1,2 1,35 1,52 4.702}
{0 CHEMBL1300301,1 1,4 1,52 4.857}
{0 CHEMBL1300319,1 1,35 1,52 6.376}
{0 CHEMBL1300956,1 1,9 1,52 5.391}
{0 CHEMBL1300966,1 1,39 1,41 1,52 5.723}
{0 CHEMBL1301480,1 1,3 1,35 1,52 5.613}
{0 CHEMBL1301505,1 1,21 1,52 4.722}
{0 CHEMBL1301513,1 1,7 1,52 6.112}
{0 CHEMBL1301784,1 1,2 1,7 1,52 6.394}
{0 CHEMBL1301892,1 1,23 1,35 1,52 5.6}
{0 CHEMBL1302439,1 1,35 1,48 1,52 4.085}
{0 CHEMBL1302895,1 1,52 6.016}
{0 CHEMBL1302990,1 1,35 1,52 4.489}
{0 CHEMBL1303401,1 1,35 1,52 5.488}
{0 CHEMBL1303524,1 1,24 1,52 6.095}
{0 CHEMBL1303629,1 1,12 1,52 4.76}
{0 CHEMBL1303772,1 1,26 1,39 1,52 6.445}
{0 CHEMBL1304361,1 1,15 1,24 1,35 1,52 5.278}
{0 CHEMBL1304402,1 1,2 1,34 1,52 5.933}
{0 CHEMBL1304603,1 1,7 1,52 4.47}
{0 CHEMBL1304796,1 1,35 1,52 5.507}
{0 CHEMBL1304950,1 1,35 1,52 5.973}
{0 CHEMBL1305001,1 1,35 1,52 6.206}
{0 CHEMBL1305011,1 1,39 1,49 1,52 5.132}
{0 CHEMBL1305864,1 1,7 1,10 1,35 1,52 6.398}
{0 CHEMBL1306283,1 1,8 1,52 4.893}
{0 CHEMBL1306690,1 1,52 5.538}
{0 CHEMBL1306749,1 1,52 5.153}
{0 CHEMBL1306949,1 1,35 1,52 6.062}
{0 CHEMBL1306983,1 1,52 5.431}
{0 CHEMBL1307255,1 1,3 1,7 1,50 1,52 6.47}
{0 CHEMBL1307271,1 1,34 1,52 5.561}
{0 CHEMBL1307281,1 1,35 1,52 5.891}
{0 CHEMBL1307383,1 1,39 1,52 5.675}
{0 CHEMBL1307453,1 1,2 1,52 5.874}
{0 CHEMBL1308052,1 1,24 1,49 1,52 5.688}
{0 CHEMBL1308432,1 1,25 1,35 1,52 5.474}
{0 CHEMBL1308766,1 1,24 1,52 4.821}
{0 CHEMBL1309154,1 1,52 5.241}
{0 CHEMBL1309248,1 1,2 1,35 1,52 6.093}
{0 CHEMBL1309354,1 1,24 1,39 1,52 6.078}
{0 CHEMBL1309890,1 1,42 1,52 4.394}
{0 CHEMBL1309909,1 1,52 5.272}
{0 CHEMBL1309987,1 1,2 1,5 1,30 1,44 1,52 5.034}
{0 CHEMBL1310139,1 1,14 1,52 5.921}
{0 CHEMBL1310176,1 1,35 1,39 1,52 5.11}
{0 CHEMBL1310341,1 1,52 5.974}
{0 CHEMBL1310438,1 1,52 6.105}
{0 CHEMBL1310527,1 1,10 1,52 5.357}
{0 CHEMBL1310713,4 1,52 4.924}
{0 CHEMBL1311007,1 1,7 1,52 6.156}
{0 CHEMBL1311826,1 1,52 5.547}
{0 CHEMBL1312049,1 1,52 6.83}
{0 CHEMBL1312275,1 1,52 6.234}
{0 CHEMBL1312320,1 1,5 1,35 1,52 5.698}
{0 CHEMBL1312619,1 1,52 5.83}
{0 CHEMBL1312781,1 1,35 1,49 1,52 5.306}
{0 CHEMBL1312909,1 1,35 1,52 5.583}
{0 CHEMBL1312953,1 1,39 1,52 5.502}
{0 CHEMBL1313101,1 1,35 1,52 5.946}
{0 CHEMBL1313174,1 1,35 1,52 5.584}
{0 CHEMBL1313263,1 1,52 5.307}
{0 CHEMBL1313283,1 1,52 5.95}
{0 CHEMBL1314102,1 1,39 1,52 5.891}
{0 CHEMBL1314125,1 1,52 5.994}
{0 CHEMBL1316141,1 1,7 1,26 1,52 5.473}
{0 CHEMBL1317642,1 1,35 1,52 4.663}
{0 CHEMBL1317657,1 1,2 1,7 1,26 1,52 4.951}
{0 CHEMBL1318350,1 1,25 1,52 4.495}
{0 CHEMBL1318693,1 1,52 4.857}
{0 CHEMBL1318943,1 1,35 1,39 1,52 6.125}
{0 CHEMBL1319004,1 1,2 1,36 1,52 5.756}
{0 CHEMBL1319079,1 1,6 1,35 1,52 6.019}
{0 CHEMBL1319643,1 1,7 1,43 1,50 1,52 5.855}
{0 CHEMBL1319778,1 1,52 5.315}
{0 CHEMBL1320189,1 1,52 5.133}
{0 CHEMBL1320281,1 1,7 1,52 5.883}
{0 CHEMBL1320542,1 1,20 1,52 5.739}
{0 CHEMBL1321271,1 1,36 1,52 5.784}
{0 CHEMBL1322052,1 1,35 1,52 4.31}
{0 CHEMBL1322516,1 1,31 1,34 1,50 1,52 5.537}
{0 CHEMBL1322595,1 1,35 1,52 4.787}
{0 CHEMBL1322883,1 1,52 4.961}
{0 CHEMBL1323428,1 1,2 1,52 5.483}
{0 CHEMBL1323512,52 6.824}
{0 CHEMBL1323553,1 1,2 1,18 1,35 1,52 5.25}
{0 CHEMBL1323662,1 1,39 1,52 6.162}
{0 CHEMBL1323744,1 1,35 1,52 4.881}
{0 CHEMBL1324011,1 1,52 6.145}
{0 CHEMBL1324118,1 1,52 4.349}
{0 CHEMBL1324371,1 1,2 1,52 5.447}
{0 CHEMBL1324454,1 1,52 4.878}
{0 CHEMBL1324531,1 1,10 1,35 1,52 6.824}
{0 CHEMBL1325209,1 1,26 1,52 4.122}
{0 CHEMBL1325275,1 1,52 5.414}
{0 CHEMBL1325277,1 1,4 1,39 1,52 5.248}
{0 CHEMBL1326083,1 1,2 1,34 1,52 6.205}
{0 CHEMBL1326523,1 1,35 1,52 4.602}
{0 CHEMBL1326983,1 1,52 6.054}
{0 CHEMBL1327172,1 1,52 4.792}
{0 CHEMBL1327205,1 1,24 1,52 5.837}
{0 CHEMBL1327372,1 1,7 1,52 5.656}
{0 CHEMBL1327656,1 1,52 4.762}
{0 CHEMBL1327894,1 1,52 6.058}
{0 CHEMBL1328053,1 1,2 1,35 1,52 6.005}
{0 CHEMBL1328182,1 1,2 1,52 6.013}
{0 CHEMBL1328184,1 1,52 4.505}
{0 CHEMBL1328373,1 1,7 1,52 5.55}
{0 CHEMBL1328504,1 1,35 1,52 5.406}
{0 CHEMBL1328566,1 1,24 1,35 1,52 4.771}
{0 CHEMBL1329129,1 1,35 1,52 4.946}
{0 CHEMBL1329232,1 1,25 1,52 5.021}
{0 CHEMBL1329395,1 1,2 1,52 5.18}
{0 CHEMBL1329507,1 1,24 1,49 1,52 4.756}
{0 CHEMBL1330113,1 1,35 1,52 4.703}
{0 CHEMBL1330453,1 1,4 1,50 1,52 4.505}
{0 CHEMBL1330558,52 4.821}
{0 CHEMBL1330616,1 1,20 1,35 1,52 4.38}
{0 CHEMBL1331790,1 1,35 1,52 4.506}
{0 CHEMBL1331900,1 1,35 1,52 5.121}
{0 CHEMBL1332215,1 1,39 1,52 4.962}
{0 CHEMBL1332450,1 1,2 1,34 1,52 5.793}
{0 CHEMBL1332555,1 1,15 1,17 1,52 6.02}
{0 CHEMBL1333095,1 1,40 1,52 6.114}
{0 CHEMBL1333178,1 1,52 5.107}
{0 CHEMBL1333255,1 1,25 1,26 1,39 1,52 6.326}
{0 CHEMBL1333504,1 1,35 1,52 5.872}
{0 CHEMBL1333987,1 1,49 1,52 5.966}
{0 CHEMBL1334044,1 1,52 4.887}
{0 CHEMBL1334371,1 1,39 1,52 5.662}
{0 CHEMBL1334557,1 1,52 4.736}
{0 CHEMBL1334608,1 1,15 1,35 1,52 6.112}
{0 CHEMBL1334791,1 1,35 1,50 1,52 5.463}
{0 CHEMBL1335030,1 1,52 6.06}
{0 CHEMBL1336054,1 1,24 1,36 1,46 1,52 5.9}
{0 CHEMBL1336526,1 1,7 1,24 1,52 4.749}
{0 CHEMBL1336535,1 1,35 1,52 6.609}
{0 CHEMBL1336675,1 1,52 5.592}
{0 CHEMBL1336735,1 1,2 1,26 1,39 1,52 6.042}
{0 CHEMBL1337045,1 1,24 1,26 1,49 1,52 6.031}
{0 CHEMBL1337224,1 1,2 1,31 1,52 5.493}
{0 CHEMBL1337528,1 1,52 5.398}
{0 CHEMBL1337614,1 1,2 1,34 1,52 5.616}
{0 CHEMBL1337651,1 1,39 1,52 5.237}
{0 CHEMBL1337700,1 1,2 1,26 1,52 6.098}
{0 CHEMBL1338492,1 1,35 1,52 5.841}
{0 CHEMBL1339092,1 1,52 5.021}
{0 CHEMBL1339909,1 1,52 5.964}
{0 CHEMBL1339997,1 1,35 1,52 6.153}
{0 CHEMBL1340255,1 1,52 5.764}
{0 CHEMBL1340417,52 6.188}
{0 CHEMBL1340519,1 1,11 1,52 4.894}
{0 CHEMBL1340602,1 1,2 1,6 1,52 5.475}
{0 CHEMBL1340678,1 1,52 6.047}
{0 CHEMBL1340874,1 1,3 1,52 5.217}
{0 CHEMBL1341308,1 1,35 1,52 5.784}
{0 CHEMBL1341697,1 1,27 1,49 1,52 6.024}
{0 CHEMBL1341995,1 1,2 1,34 1,52 5.469}
{0 CHEMBL1342064,1 1,52 4.617}
{0 CHEMBL1342093,1 1,39 1,52 4.609}
{0 CHEMBL1343568,1 1,39 1,52 5.634}
{0 CHEMBL1345042,1 1,6 1,52 4.642}
{0 CHEMBL1345665,1 1,21 1,52 5.341}
{0 CHEMBL1345820,1 1,35 1,52 5.649}
{0 CHEMBL1346226,1 1,2 1,31 1,52 4.633}
{0 CHEMBL1346637,1 1,2 1,52 6.191}
{0 CHEMBL1346781,1 1,24 1,35 1,49 1,52 4.665}
{0 CHEMBL1346822,1 1,39 1,52 5.981}
{0 CHEMBL1347084,1 1,2 1,27 1,52 6.099}
{0 CHEMBL1347598,1 1,2 1,52 5.086}
{0 CHEMBL1347600,1 1,35 1,38 1,52 5.722}
{0 CHEMBL1347656,1 1,11 1,52 4.761}
{0 CHEMBL1347962,1 1,4 1,52 5.094}
{0 CHEMBL1348012,1 1,26 1,52 4.905}
{0 CHEMBL1348093,1 1,40 1,52 5.254}
{0 CHEMBL1348119,1 1,35 1,52 6.045}
{0 CHEMBL1348263,1 1,31 1,35 1,52 5.786}
{0 CHEMBL1348448,1 1,52 4.781}
{0 CHEMBL1348468,1 1,36 1,52 6.339}
{0 CHEMBL1348582,1 1,42 1,52 5.968}
{0 CHEMBL1348654,1 1,35 1,52 5.994}
{0 CHEMBL1348836,1 1,52 5.923}
{0 CHEMBL1349146,1 1,52 5.782}
{0 CHEMBL1349480,1 1,24 1,52 4.845}
{0 CHEMBL1349566,1 1,2 1,35 1,52 6.048}
{0 CHEMBL1349793,1 1,52 5.026}
{0 CHEMBL1350003,1 1,7 1,24 1,35 1,52 5.933}
{0 CHEMBL1350011,1 1,39 1,52 5.755}
{0 CHEMBL1350245,1 1,16 1,51 1,52 6.198}
{0 CHEMBL1350252,1 1,52 5.987}
{0 CHEMBL1350258,1 1,26 1,52 5.667}
{0 CHEMBL1350460,1 1,52 4.925}
{0 CHEMBL1350489,1 1,39 1,52 4.73}
{0 CHEMBL1350780,1 1,52 5.644}
{0 CHEMBL1351158,1 1,35 1,52 5.704}
{0 CHEMBL1351171,1 1,35 1,52 4.608}
{0 CHEMBL1351542,1 1,2 1,34 1,49 1,52 5.392}
{0 CHEMBL1352025,1 1,21 1,52 4.513}
{0 CHEMBL1352172,1 1,52 4.576}
{0 CHEMBL1352200,1 1,11 1,52 5.711}
{0 CHEMBL1352234,1 1,7 1,26 1,52 5.132}
{0 CHEMBL1352575,1 1,8 1,52 4.852}
{0 CHEMBL1352792,1 1,52 4.622}
{0 CHEMBL1352909,1 1,52 5.426}
{0 CHEMBL1353042,1 1,11 1,52 6.184}
{0 CHEMBL1353371,1 1,52 4.934}
{0 CHEMBL1353757,1 1,52 6.05}
{0 CHEMBL1353996,1 1,18 1,35 1,52 5.528}
{0 CHEMBL1355133,1 1,35 1,52 5.652}
{0 CHEMBL1358933,1 1,7 1,38 1,52 4.967}
{0 CHEMBL1359343,1 1,13 1,35 1,52 4.716}
{0 CHEMBL1359871,1 1,2 1,18 1,52 5.484}
{0 CHEMBL1360400,1 1,16 1,35 1,38 1,52 5.67}
{0 CHEMBL1360446,1 1,52 4.645}
{0 CHEMBL1360505,1 1,11 1,52 6.064}
{0 CHEMBL1361307,1 1,35 1,52 6.02}
{0 CHEMBL1362036,1 1,35 1,52 5.827}
{0 CHEMBL1362077,1 1,23 1,24 1,52 6.095}
{0 CHEMBL1362096,1 1,2 1,52 5.545}
{0 CHEMBL1362788,1 1,35 1,49 1,52 6.127}
{0 CHEMBL1362878,1 1,52 5.11}
{0 CHEMBL1363032,1 1,2 1,18 1,35 1,52 5.925}
{0 CHEMBL1363249,1 1,2 1,34 1,52 4.806}
{0 CHEMBL1364010,1 1,2 1,18 1,20 1,35 1,52 4.748}
{0 CHEMBL1364071,1 1,16 1,35 1,38 1,52 4.783}
{0 CHEMBL1364648,1 1,2 1,7 1,18 1,52 5.023}
{0 CHEMBL1364999,1 1,52 6.71}
{0 CHEMBL1365796,1 1,35 1,52 4.636}
{0 CHEMBL1365988,1 1,33 1,52 6.076}
{0 CHEMBL1366104,1 1,2 1,52 6.541}
{0 CHEMBL1366140,1 1,8 1,52 5.218}
{0 CHEMBL1366561,1 1,26 1,52 4.966}
{0 CHEMBL1366992,1 1,35 1,39 1,52 5.446}
{0 CHEMBL1367086,1 1,36 1,52 6.337}
{0 CHEMBL1368410,1 1,52 5.682}
{0 CHEMBL1368792,1 1,52 5.525}
{0 CHEMBL1368802,1 1,3 1,35 1,52 4.925}
{0 CHEMBL1369425,1 1,35 1,52 6.158}
{0 CHEMBL1369698,1 1,52 5.169}
{0 CHEMBL1369893,1 1,33 1,52 4.62}
{0 CHEMBL1370051,1 1,3 1,24 1,39 1,52 5.512}
{0 CHEMBL1370113,1 1,52 4.358}
{0 CHEMBL1370513,1 1,33 1,52 5.821}
{0 CHEMBL1370536,1 1,25 1,52 4.659}
{0 CHEMBL1371004,1 1,38 1,52 5.82}
{0 CHEMBL1371081,1 1,35 1,52 5.973}
{0 CHEMBL1371877,1 1,24 1,52 6.403}
{0 CHEMBL1372207,1 1,2 1,13 1,52 4.789}
{0 CHEMBL1372492,1 1,35 1,52 5.592}
{0 CHEMBL1372534,1 1,24 1,52 5.401}
{0 CHEMBL1372734,1 1,35 1,52 6.066}
{0 CHEMBL1372914,1 1,52 5.665}
{0 CHEMBL1372972,1 1,39 1,52 5.825}
{0 CHEMBL1373577,1 1,29 1,52 4.391}
{0 CHEMBL1373678,1 1,7 1,52 6.714}
{0 CHEMBL1374462,1 1,2 1,19 1,31 1,52 6.921}
{0 CHEMBL1374970,26 1,52 5.204}
{0 CHEMBL1374991,1 1,2 1,18 1,39 1,52 6.033}
{0 CHEMBL1375220,1 1,35 1,52 4.612}
{0 CHEMBL1375251,1 1,52 5.727}
{0 CHEMBL1375925,1 1,35 1,52 5.565}
{0 CHEMBL1376904,1 1,35 1,52 5.576}
{0 CHEMBL1377316,1 1,52 4.749}
{0 CHEMBL1377379,1 1,52 5.838}
{0 CHEMBL1377705,1 1,35 1,38 1,52 6.146}
{0 CHEMBL1377849,1 1,52 6.921}
{0 CHEMBL1378479,1 1,52 6.638}
{0 CHEMBL1378785,1 1,35 1,52 5.771}
{0 CHEMBL1379118,1 1,52 5.526}
{0 CHEMBL1379187,1 1,26 1,52 5.922}
{0 CHEMBL1379480,1 1,35 1,52 5.904}
{0 CHEMBL1379535,1 1,26 1,52 5.514}
{0 CHEMBL1379688,1 1,52 6.032}
{0 CHEMBL1379888,1 1,9 1,52 6.479}
{0 CHEMBL1380406,1 1,27 1,52 5.72}
{0 CHEMBL1380557,1 1,52 5.186}
{0 CHEMBL1380975,1 1,52 4.61}
{0 CHEMBL1381257,1 1,2 1,4 1,24 1,49 1,50 1,52 5.09}
{0 CHEMBL1381621,1 1,52 5.472}
{0 CHEMBL1381627,1 1,20 1,52 5.358}
{0 CHEMBL1381679,1 1,35 1,52 5.609}
{0 CHEMBL1382011,1 1,35 1,52 5.761}
{0 CHEMBL1382191,1 1,25 1,52 4.732}
{0 CHEMBL1382884,1 1,52 5.206}
{0 CHEMBL1383409,1 1,35 1,52 4.774}
{0 CHEMBL1383706,1 1,10 1,24 1,52 5.892}
{0 CHEMBL1383721,1 1,35 1,52 4.73}
{0 CHEMBL1383805,1 1,33 1,52 5.309}
{0 CHEMBL1383916,1 1,35 1,52 6.15}
{0 CHEMBL1384166,1 1,7 1,52 4.684}
{0 CHEMBL1384718,1 1,25 1,36 1,52 6.921}
{0 CHEMBL1385118,1 1,17 1,52 4.724}
{0 CHEMBL1385141,1 1,39 1,52 6.005}
{0 CHEMBL1385466,1 1,52 5.331}
{0 CHEMBL1385558,1 1,33 1,52 6.067}
{0 CHEMBL1385760,1 1,2 1,52 6.29}
{0 CHEMBL1386049,1 1,52 5.769}
{0 CHEMBL1386593,1 1,40 1,52 4.764}
{0 CHEMBL1386774,1 1,52 5.768}
{0 CHEMBL1387387,1 1,8 1,35 1,52 6.091}
{0 CHEMBL1387710,1 1,26 1,35 1,52 4.697}
{0 CHEMBL1387894,1 1,2 1,35 1,50 1,52 4.525}
{0 CHEMBL1388100,1 1,39 1,52 5.301}
{0 CHEMBL1388294,1 1,7 1,52 6.025}
{0 CHEMBL1388595,1 1,35 1,52 6.145}
{0 CHEMBL1388684,1 1,50 1,52 5.63}
{0 CHEMBL1388803,1 1,4 1,30 1,35 1,52 5.803}
{0 CHEMBL1389047,1 1,52 5.852}
{0 CHEMBL1389225,1 1,49 1,52 5.189}
{0 CHEMBL1389318,1 1,35 1,52 6.921}
{0 CHEMBL1389335,1 1,2 1,13 1,21 1,26 1,35 1,52 6.204}
{0 CHEMBL1389542,1 1,2 1,35 1,52 6.536}
{0 CHEMBL1389836,1 1,52 4.849}
{0 CHEMBL1390196,1 1,26 1,35 1,52 4.644}
{0 CHEMBL1390303,1 1,7 1,52 4.903}
{0 CHEMBL1390492,1 1,35 1,52 6.152}
{0 CHEMBL1390521,1 1,52 5.063}
{0 CHEMBL1390645,1 1,35 1,52 4.953}
{0 CHEMBL1390658,1 1,52 5.698}
{0 CHEMBL1390766,1 1,35 1,52 4.77}
{0 CHEMBL1390963,1 1,11 1,52 5.908}
{0 CHEMBL1391547,1 1,15 1,19 1,24 1,29 1,35 1,52 4.752}
{0 CHEMBL1391737,1 1,52 5.18}
{0 CHEMBL1391743,1 1,52 5.764}
{0 CHEMBL1391911,1 1,52 5.723}
{0 CHEMBL1391974,1 1,52 5.279}
{0 CHEMBL1392455,1 1,52 6.921}
{0 CHEMBL1392500,1 1,35 1,52 5.114}
{0 CHEMBL1392564,1 1,2 1,35 1,52 4.739}
{0 CHEMBL1392756,1 1,2 1,8 1,39 1,52 5.506}
{0 CHEMBL1392918,1 1,2 1,31 1,52 5.451}
{0 CHEMBL1393007,1 1,52 5.791}
{0 CHEMBL1393266,1 1,16 1,52 5.122}
{0 CHEMBL1393700,1 1,33 1,39 1,52 4.669}
{0 CHEMBL1393829,1 1,33 1,52 4.848}
{0 CHEMBL1397742,1 1,16 1,52 5.641}
{0 CHEMBL1398613,1 1,52 4.831}
{0 CHEMBL1399543,52 6.012}
{0 CHEMBL1401039,1 1,39 1,52 5.503}
{0 CHEMBL1401057,1 1,21 1,35 1,52 5.396}
{0 CHEMBL1401645,1 1,10 1,26 1,52 5.397}
{0 CHEMBL1402968,1 1,52 6.87}
{0 CHEMBL1403085,1 1,2 1,28 1,52 6.03}
{0 CHEMBL1403955,1 1,2 1,18 1,31 1,35 1,52 4.388}
{0 CHEMBL1404086,1 1,24 1,36 1,46 1,52 5.7}
{0 CHEMBL140425,52 4.006}
{0 CHEMBL1404493,1 1,25 1,52 6.921}
{0 CHEMBL1404792,1 1,25 1,52 4.86}
{0 CHEMBL1405150,1 1,33 1,34 1,52 4.786}
{0 CHEMBL1405172,1 1,35 1,39 1,52 5.919}
{0 CHEMBL1405204,1 1,52 5.45}
{0 CHEMBL1405220,1 1,24 1,34 1,52 5.803}
{0 CHEMBL1405639,1 1,2 1,48 1,52 5.074}
{0 CHEMBL1406031,1 1,47 1,52 5.958}
{0 CHEMBL1406127,1 1,7 1,52 4.838}
{0 CHEMBL1407169,26 1,52 5.928}
{0 CHEMBL1407461,1 1,52 5.781}
{0 CHEMBL1407632,1 1,2 1,27 1,35 1,52 5.425}
{0 CHEMBL1408094,1 1,35 1,52 6.836}
{0 CHEMBL1408342,1 1,35 1,52 5.508}
{0 CHEMBL1408577,1 1,52 5.91}
{0 CHEMBL1408965,1 1,52 6.674}
{0 CHEMBL1409067,1 1,7 1,46 1,52 4.925}
{0 CHEMBL1409333,1 1,52 5.334}
{0 CHEMBL1409335,1 1,39 1,52 4.623}
{0 CHEMBL1409365,1 1,52 4.945}
{0 CHEMBL1412002,1 1,33 1,52 4.7}
{0 CHEMBL1412068,1 1,15 1,35 1,52 5.475}
{0 CHEMBL1412677,1 1,2 1,18 1,24 1,52 5.938}
{0 CHEMBL1413011,1 1,52 5.275}
{0 CHEMBL1413859,1 1,2 1,24 1,52 5.177}
{0 CHEMBL1414068,1 1,22 1,35 1,52 5.586}
{0 CHEMBL1414580,1 1,52 5.382}
{0 CHEMBL1414734,36 1,52 4.716}
{0 CHEMBL1415893,1 1,2 1,48 1,52 5.548}
{0 CHEMBL1416096,1 1,52 5.856}
{0 CHEMBL1416601,1 1,52 5.615}
{0 CHEMBL1416961,1 1,4 1,50 1,52 5.98}
{0 CHEMBL1417242,1 1,21 1,35 1,52 5.219}
{0 CHEMBL1417809,1 1,15 1,52 5.018}
{0 CHEMBL1418430,1 1,39 1,52 4.969}
{0 CHEMBL1418460,1 1,25 1,52 4.96}
{0 CHEMBL1418709,1 1,52 5.776}
{0 CHEMBL1418792,1 1,52 4.865}
{0 CHEMBL1419066,1 1,35 1,52 6.297}
{0 CHEMBL1419305,1 1,52 4.858}
{0 CHEMBL1419335,1 1,38 1,52 4.966}
{0 CHEMBL1419381,1 1,52 6.008}
{0 CHEMBL1419772,1 1,24 1,26 1,35 1,49 1,52 6.037}
{0 CHEMBL1420064,1 1,35 1,52 6.205}
{0 CHEMBL1420500,1 1,7 1,24 1,26 1,52 6.097}
{0 CHEMBL1420535,1 1,33 1,39 1,52 5.18}
{0 CHEMBL1420556,26 1,52 6.083}
{0 CHEMBL1420598,1 1,2 1,18 1,35 1,52 4.888}
{0 CHEMBL1420628,1 1,2 1,35 1,52 4.528}
{0 CHEMBL1420684,1 1,2 1,3 1,52 5.482}
{0 CHEMBL1421670,1 1,35 1,52 5.877}
{0 CHEMBL1422400,1 1,24 1,35 1,43 1,52 4.886}
{0 CHEMBL1422472,1 1,2 1,31 1,52 5.581}
{0 CHEMBL1422507,1 1,39 1,52 4.782}
{0 CHEMBL1422696,1 1,35 1,52 5.44}
{0 CHEMBL1422799,1 1,52 4.651}
{0 CHEMBL1423240,1 1,52 5.773}
{0 CHEMBL1423518,1 1,42 1,52 5.633}
{0 CHEMBL1423611,1 1,24 1,35 1,50 1,52 5.702}
{0 CHEMBL1424082,1 1,39 1,52 5.587}
{0 CHEMBL1424331,1 1,5 1,27 1,35 1,52 5.672}
{0 CHEMBL1424665,1 1,2 1,52 4.745}
{0 CHEMBL1424729,1 1,2 1,21 1,35 1,52 5.29}
{0 CHEMBL1424999,1 1,2 1,52 5.782}
{0 CHEMBL1425019,1 1,15 1,38 1,52 5.466}
{0 CHEMBL1425238,1 1,26 1,43 1,52 5.226}
{0 CHEMBL1426078,1 1,52 5.614}
{0 CHEMBL1426112,1 1,7 1,26 1,47 1,52 6.396}
{0 CHEMBL1426155,1 1,35 1,52 4.771}
{0 CHEMBL1426244,1 1,35 1,52 4.324}
{0 CHEMBL1426337,1 1,35 1,52 5.89}
{0 CHEMBL1426340,1 1,35 1,52 5.859}
{0 CHEMBL1426383,1 1,33 1,35 1,52 5.917}
{0 CHEMBL1426693,1 1,2 1,52 6.021}
{0 CHEMBL1427020,1 1,16 1,52 4.84}
{0 CHEMBL1427508,1 1,5 1,35 1,52 5.249}
{0 CHEMBL1427734,1 1,35 1,52 5.862}
{0 CHEMBL1428240,1 1,23 1,35 1,42 1,52 6.351}
{0 CHEMBL1428287,1 1,35 1,52 4.497}
{0 CHEMBL1429632,1 1,2 1,52 5.722}
{0 CHEMBL1429789,1 1,52 5.359}
{0 CHEMBL1429917,1 1,31 1,52 5.786}
{0 CHEMBL1429980,1 1,35 1,52 5.915}
{0 CHEMBL1430168,1 1,52 5.398}
{0 CHEMBL1430319,1 1,4 1,52 5.367}
{0 CHEMBL1430800,1 1,35 1,52 5.939}
{0 CHEMBL1430893,1 1,52 5.543}
{0 CHEMBL1431312,1 1,35 1,52 4.875}
{0 CHEMBL1431325,1 1,39 1,52 5.84}
{0 CHEMBL1431693,1 1,26 1,39 1,52 5.489}
{0 CHEMBL1431710,1 1,6 1,52 6.873}
{0 CHEMBL1431928,1 1,2 1,20 1,34 1,52 5.563}
{0 CHEMBL1432888,1 1,15 1,38 1,52 5.381}
{0 CHEMBL1433075,1 1,2 1,7 1,52 4.97}
{0 CHEMBL1433124,52 4.669}
{0 CHEMBL1434175,1 1,11 1,52 5.842}
{0 CHEMBL1436213,1 1,52 5.701}
{0 CHEMBL1437579,1 1,52 5.854}
{0 CHEMBL1438970,1 1,35 1,52 5.918}
{0 CHEMBL1439020,1 1,2 1,35 1,52 4.607}
{0 CHEMBL1439576,1 1,10 1,35 1,52 5.166}
{0 CHEMBL1439734,1 1,52 5.755}
{0 CHEMBL1440514,1 1,26 1,43 1,52 5.94}
{0 CHEMBL1440605,1 1,39 1,52 6.054}
{0 CHEMBL1441218,1 1,31 1,35 1,52 6.424}
{0 CHEMBL1441467,1 1,35 1,52 5.828}
{0 CHEMBL1441766,1 1,18 1,52 4.723}
{0 CHEMBL1442114,1 1,26 1,52 5.718}
{0 CHEMBL1442155,1 1,39 1,52 5.118}
{0 CHEMBL1442280,1 1,34 1,52 6.483}
{0 CHEMBL1442383,1 1,10 1,52 5.536}
{0 CHEMBL1442500,1 1,52 5.859}
{0 CHEMBL1442895,1 1,52 4.766}
{0 CHEMBL1443478,1 1,7 1,26 1,52 5.956}
{0 CHEMBL1443512,1 1,2 1,35 1,39 1,52 5.573}
{0 CHEMBL1443564,1 1,35 1,52 5.372}
{0 CHEMBL1443898,1 1,40 1,52 5.748}
{0 CHEMBL1444553,1 1,3 1,52 4.926}
{0 CHEMBL1444761,1 1,52 5.74}
{0 CHEMBL1445902,1 1,35 1,36 1,52 4.684}
{0 CHEMBL1446034,1 1,7 1,39 1,52 6.635}
{0 CHEMBL1447186,1 1,35 1,52 5.562}
{0 CHEMBL1447219,1 1,35 1,49 1,52 5.362}
{0 CHEMBL1447697,1 1,35 1,52 6.16}
{0 CHEMBL1447974,1 1,52 5.058}
{0 CHEMBL1448584,1 1,2 1,35 1,52 4.653}
{0 CHEMBL1448722,1 1,4 1,6 1,52 5.173}
{0 CHEMBL1448895,1 1,2 1,8 1,52 5.774}
{0 CHEMBL1449277,1 1,24 1,26 1,39 1,52 6.366}
{0 CHEMBL1449523,1 1,51 1,52 6.06}
{0 CHEMBL1449718,1 1,52 5.214}
{0 CHEMBL1449720,1 1,52 5.649}
{0 CHEMBL1449883,1 1,33 1,34 1,52 6.011}
{0 CHEMBL1449892,1 1,52 5.204}
{0 CHEMBL1450261,1 1,2 1,18 1,35 1,52 6.248}
{0 CHEMBL1450615,1 1,4 1,51 1,52 6.115}
{0 CHEMBL1451008,1 1,52 4.913}
{0 CHEMBL1451060,1 1,52 6.381}
{0 CHEMBL1451169,1 1,35 1,52 6.138}
{0 CHEMBL1451747,1 1,2 1,21 1,52 5.192}
{0 CHEMBL1451931,1 1,29 1,52 5.73}
{0 CHEMBL1451977,1 1,52 5.747}
{0 CHEMBL1452090,1 1,33 1,52 6.29}
{0 CHEMBL1452116,1 1,52 6.267}
{0 CHEMBL1452636,1 1,2 1,30 1,36 1,52 5.668}
{0 CHEMBL1452711,1 1,52 5.664}
{0 CHEMBL1452779,38 1,52 6.69}
{0 CHEMBL1453521,1 1,52 5.899}
{0 CHEMBL1453870,1 1,35 1,52 5.27}
{0 CHEMBL1453906,1 1,16 1,24 1,39 1,52 6.158}
{0 CHEMBL1453929,1 1,2 1,52 5.903}
{0 CHEMBL1454030,1 1,52 4.265}
{0 CHEMBL1454827,1 1,34 1,52 5.721}
{0 CHEMBL1454910,52 6.167}
{0 CHEMBL1455137,1 1,27 1,47 1,52 6.921}
{0 CHEMBL1455396,1 1,17 1,42 1,52 5.736}
{0 CHEMBL1455523,1 1,52 5.352}
{0 CHEMBL1455627,1 1,52 5.423}
{0 CHEMBL1456703,1 1,35 1,52 5.416}
{0 CHEMBL1457034,1 1,35 1,52 5.322}
{0 CHEMBL1457139,1 1,35 1,52 5.564}
{0 CHEMBL1457949,1 1,16 1,39 1,52 5.453}
{0 CHEMBL1458812,1 1,52 4.622}
{0 CHEMBL1458975,1 1,52 5.525}
{0 CHEMBL1459813,1 1,52 5.225}
{0 CHEMBL1460056,1 1,7 1,26 1,47 1,52 6.359}
{0 CHEMBL1460249,1 1,24 1,52 6.194}
{0 CHEMBL1460522,1 1,52 5.031}
{0 CHEMBL1460705,1 1,35 1,52 4.649}
{0 CHEMBL1460823,1 1,35 1,52 4.874}
{0 CHEMBL1462215,1 1,52 6.539}
{0 CHEMBL1462283,1 1,35 1,52 4.772}
{0 CHEMBL1462375,1 1,50 1,52 6.757}
{0 CHEMBL1463,1 1,52 6.148}
{0 CHEMBL1463257,1 1,52 4.978}
{0 CHEMBL1463647,1 1,52 6.921}
{0 CHEMBL1463750,1 1,3 1,52 5.676}
{0 CHEMBL1463786,1 1,35 1,52 6.205}
{0 CHEMBL1463847,1 1,7 1,24 1,26 1,52 6.198}
{0 CHEMBL1463934,1 1,35 1,52 5.763}
{0 CHEMBL1464110,1 1,52 5.014}
{0 CHEMBL1464385,1 1,22 1,52 5.856}
{0 CHEMBL1464485,1 1,2 1,6 1,24 1,35 1,52 6.401}
{0 CHEMBL1465741,1 1,52 5.074}
{0 CHEMBL1465946,1 1,52 6.022}
{0 CHEMBL1466179,1 1,21 1,52 6.527}
{0 CHEMBL1466593,1 1,52 5.779}
{0 CHEMBL1466831,1 1,35 1,52 5.18}
{0 CHEMBL1467211,1 1,2 1,35 1,52 4.286}
{0 CHEMBL1467326,1 1,2 1,52 5.604}
{0 CHEMBL1467755,1 1,52 5.345}
{0 CHEMBL1467782,1 1,52 4.46}
{0 CHEMBL1467856,1 1,39 1,52 5.766}
{0 CHEMBL1467876,1 1,35 1,50 1,52 5.882}
{0 CHEMBL1468024,1 1,35 1,52 5.267}
{0 CHEMBL1468055,1 1,52 5.578}
{0 CHEMBL1468306,1 1,2 1,34 1,52 5.576}
{0 CHEMBL1468661,1 1,36 1,52 4.723}
{0 CHEMBL1468668,1 1,18 1,24 1,52 5.889}
{0 CHEMBL1468776,1 1,24 1,52 4.749}
{0 CHEMBL1468811,1 1,35 1,52 5.695}
{0 CHEMBL1469362,1 1,2 1,35 1,38 1,52 6.431}
{0 CHEMBL1469379,1 1,10 1,35 1,52 5.493}
{0 CHEMBL1469579,1 1,24 1,36 1,46 1,52 5.623}
{0 CHEMBL1469827,1 1,52 5.466}
{0 CHEMBL1469885,1 1,2 1,52 5.049}
{0 CHEMBL1470259,1 1,33 1,52 4.348}
{0 CHEMBL1470382,1 1,52 4.792}
{0 CHEMBL1470587,1 1,35 1,52 5.511}
{0 CHEMBL1470712,1 1,52 4.906}
{0 CHEMBL1471157,1 1,35 1,52 5.697}
{0 CHEMBL1471206,1 1,52 5.494}
{0 CHEMBL1471845,1 1,20 1,52 5.017}
{0 CHEMBL1471948,1 1,52 5.037}
{0 CHEMBL1472100,1 1,39 1,52 5.755}
{0 CHEMBL1472105,1 1,3 1,52 5.023}
{0 CHEMBL1472326,1 1,21 1,27 1,39 1,52 5.554}
{0 CHEMBL1472418,1 1,16 1,35 1,52 5.842}
{0 CHEMBL1474564,1 1,24 1,35 1,52 5.666}
{0 CHEMBL1475477,1 1,3 1,52 5.592}
{0 CHEMBL1476264,1 1,39 1,52 5.375}
{0 CHEMBL1477033,1 1,35 1,52 5.854}
{0 CHEMBL1477121,1 1,7 1,35 1,52 6.648}
{0 CHEMBL1477212,26 1,52 6.315}
{0 CHEMBL1477419,1 1,2 1,35 1,52 5.528}
{0 CHEMBL1478041,1 1,35 1,52 5.937}
{0 CHEMBL1478465,1 1,52 5.326}
{0 CHEMBL1478797,1 1,35 1,52 6.434}
{0 CHEMBL1479557,1 1,6 1,35 1,52 6.138}
{0 CHEMBL1479804,1 1,21 1,35 1,52 6.013}
{0 CHEMBL1479834,1 1,39 1,52 4.855}
{0 CHEMBL1480135,1 1,25 1,52 5.719}
{0 CHEMBL1480337,1 1,7 1,26 1,52 6.201}
{0 CHEMBL1480733,1 1,22 1,25 1,39 1,52 6.301}
{0 CHEMBL1480836,1 1,33 1,35 1,52 4.642}
{0 CHEMBL1481132,1 1,52 4.628}
{0 CHEMBL1481374,1 1,2 1,34 1,52 5.038}
{0 CHEMBL1481390,1 1,35 1,52 4.927}
{0 CHEMBL1481606,1 1,42 1,52 5.688}
{0 CHEMBL1481697,1 1,35 1,52 5.911}
{0 CHEMBL1481740,1 1,2 1,26 1,52 4.511}
{0 CHEMBL1481746,1 1,21 1,26 1,52 5.277}
{0 CHEMBL1481806,1 1,14 1,27 1,39 1,52 5.445}
{0 CHEMBL1483015,7 1,11 1,34 1,52 6}
{0 CHEMBL1483252,1 1,2 1,34 1,52 6.152}
{0 CHEMBL1483291,1 1,3 1,52 4.976}
{0 CHEMBL1483620,1 1,10 1,15 1,24 1,35 1,52 4.806}
{0 CHEMBL1483825,1 1,7 1,35 1,52 5.641}
{0 CHEMBL1483964,1 1,10 1,16 1,35 1,52 4.603}
{0 CHEMBL1484227,1 1,27 1,52 4.728}
{0 CHEMBL1484231,1 1,5 1,35 1,52 5.612}
{0 CHEMBL1484275,1 1,18 1,24 1,45 1,52 4.788}
{0 CHEMBL1484332,1 1,27 1,47 1,52 6.815}
{0 CHEMBL1484777,1 1,6 1,35 1,52 4.837}
{0 CHEMBL1485259,1 1,39 1,52 6.102}
{0 CHEMBL1485579,1 1,35 1,38 1,52 4.264}
{0 CHEMBL1486827,1 1,52 5.076}
{0 CHEMBL1486894,1 1,35 1,52 5.439}
{0 CHEMBL1487401,1 1,25 1,35 1,52 5.654}
{0 CHEMBL1487498,1 1,52 6.5}
{0 CHEMBL1487639,1 1,52 5.522}
{0 CHEMBL1488035,1 1,7 1,52 6.054}
{0 CHEMBL1488279,1 1,35 1,52 6.496}
{0 CHEMBL1488696,1 1,52 5.389}
{0 CHEMBL1489113,1 1,31 1,35 1,39 1,52 5.699}
{0 CHEMBL1489330,1 1,39 1,52 5.295}
{0 CHEMBL1489407,1 1,35 1,49 1,52 5.684}
{0 CHEMBL1489956,1 1,52 5.688}
{0 CHEMBL1489966,1 1,35 1,48 1,52 5.263}
{0 CHEMBL1490481,1 1,35 1,52 5.519}
{0 CHEMBL1490555,1 1,52 4.205}
{0 CHEMBL1490887,1 1,2 1,31 1,52 5.378}
{0 CHEMBL1491222,1 1,2 1,34 1,52 5.562}
{0 CHEMBL1491815,1 1,35 1,52 4.55}
{0 CHEMBL1492078,1 1,35 1,52 5.372}
{0 CHEMBL1492246,1 1,35 1,52 5.478}
{0 CHEMBL1492376,1 1,34 1,52 4.91}
{0 CHEMBL1492378,1 1,52 6.68}
{0 CHEMBL1493391,1 1,39 1,52 6.149}
{0 CHEMBL1493512,1 1,39 1,52 5.19}
{0 CHEMBL1493928,1 1,52 5.834}
{0 CHEMBL1494506,1 1,42 1,52 4.797}
{0 CHEMBL1495072,1 1,2 1,24 1,52 5.837}
{0 CHEMBL1495354,1 1,14 1,39 1,52 4.711}
{0 CHEMBL1496096,1 1,35 1,52 5.431}
{0 CHEMBL1496313,1 1,52 5.591}
{0 CHEMBL1497081,1 1,52 5.249}
{0 CHEMBL1497295,1 1,43 1,52 5.193}
{0 CHEMBL1497325,1 1,11 1,50 1,52 6.126}
{0 CHEMBL1497549,1 1,25 1,35 1,52 4.645}
{0 CHEMBL1498022,1 1,52 5.79}
{0 CHEMBL1498377,1 1,52 4.732}
{0 CHEMBL1498830,1 1,15 1,35 1,38 1,52 5.65}
{0 CHEMBL1499233,1 1,33 1,34 1,52 4.977}
{0 CHEMBL1499342,1 1,52 5.694}
{0 CHEMBL1499496,1 1,6 1,35 1,52 4.202}
{0 CHEMBL1499658,1 1,52 5.246}
{0 CHEMBL1499893,1 1,7 1,24 1,49 1,52 5.61}
{0 CHEMBL1499914,1 1,27 1,52 5.068}
{0 CHEMBL1500144,1 1,23 1,35 1,52 5.213}
{0 CHEMBL1500188,1 1,52 4.694}
{0 CHEMBL1500266,1 1,52 4.476}
{0 CHEMBL1500363,1 1,52 4.695}
{0 CHEMBL1500742,1 1,2 1,26 1,52 5.527}
{0 CHEMBL1500960,1 1,31 1,52 5.008}
{0 CHEMBL1501102,1 1,45 1,52 5.878}
{0 CHEMBL1501432,1 1,52 5.2}
{0 CHEMBL1502020,1 1,2 1,18 1,24 1,52 5.673}
{0 CHEMBL1502351,1 1,35 1,52 6.044}
{0 CHEMBL1502352,1 1,17 1,52 4.995}
{0 CHEMBL1502530,1 1,2 1,18 1,35 1,52 5.982}
{0 CHEMBL1502929,1 1,26 1,52 5.792}
{0 CHEMBL1502943,1 1,24 1,27 1,35 1,52 5.845}
{0 CHEMBL1503006,1 1,2 1,35 1,52 6.127}
{0 CHEMBL1503033,1 1,27 1,52 5.765}
{0 CHEMBL1503173,1 1,41 1,52 4.874}
{0 CHEMBL1503392,1 1,52 5.959}
{0 CHEMBL1503699,1 1,52 5.682}
{0 CHEMBL1503985,1 1,15 1,35 1,52 6.517}
{0 CHEMBL1504220,1 1,35 1,52 5.576}
{0 CHEMBL1504407,1 1,14 1,52 5.377}
{0 CHEMBL1504550,1 1,23 1,39 1,52 4.724}
{0 CHEMBL1504569,1 1,2 1,49 1,52 4.852}
{0 CHEMBL1504771,1 1,2 1,24 1,39 1,52 5.801}
{0 CHEMBL1504794,1 1,15 1,49 1,52 4.764}
{0 CHEMBL1504897,1 1,18 1,24 1,26 1,52 5.188}
{0 CHEMBL1505022,1 1,46 1,52 4.688}
{0 CHEMBL1505028,1 1,36 1,52 5.936}
{0 CHEMBL1505039,1 1,35 1,52 5.724}
{0 CHEMBL1505060,1 1,2 1,6 1,52 4.904}
{0 CHEMBL1505070,1 1,35 1,52 4.807}
{0 CHEMBL1505071,1 1,52 5.919}
{0 CHEMBL1505875,1 1,35 1,49 1,52 5.706}
{0 CHEMBL1506098,1 1,39 1,52 5.21}
{0 CHEMBL1506216,1 1,52 5.386}
{0 CHEMBL1506285,1 1,52 5.674}
{0 CHEMBL1506580,1 1,35 1,52 4.858}
{0 CHEMBL1508339,1 1,8 1,39 1,52 6.035}
{0 CHEMBL1508474,1 1,35 1,52 5.986}
{0 CHEMBL1508647,1 1,52 5.99}
{0 CHEMBL1508788,1 1,26 1,52 5.518}
{0 CHEMBL1509083,1 1,7 1,24 1,26 1,52 5.678}
{0 CHEMBL1509327,1 1,52 5.533}
{0 CHEMBL1509727,1 1,52 4.677}
{0 CHEMBL1510020,1 1,4 1,50 1,52 6.13}
{0 CHEMBL1510332,1 1,35 1,52 5.48}
{0 CHEMBL1510452,1 1,39 1,52 4.529}
{0 CHEMBL1510684,1 1,5 1,7 1,10 1,22 1,52 4.695}
{0 CHEMBL1510925,1 1,38 1,52 5.419}
{0 CHEMBL1511029,1 1,31 1,52 5.532}
{0 CHEMBL1514530,1 1,33 1,52 4.536}
{0 CHEMBL1516976,1 1,7 1,24 1,52 5.813}
{0 CHEMBL1517151,1 1,35 1,52 6.375}
{0 CHEMBL1517325,1 1,4 1,36 1,52 4.918}
{0 CHEMBL1517609,1 1,50 1,52 5.537}
{0 CHEMBL1517847,1 1,52 5.698}
{0 CHEMBL1518057,1 1,26 1,52 5.229}
{0 CHEMBL1518827,1 1,26 1,35 1,52 5.368}
{0 CHEMBL1518873,1 1,30 1,32 1,43 1,52 6.921}
{0 CHEMBL1519338,1 1,2 1,52 4.793}
{0 CHEMBL1519370,1 1,35 1,52 5.828}
{0 CHEMBL1519450,1 1,52 4.281}
{0 CHEMBL1519558,1 1,52 5.302}
{0 CHEMBL1519576,1 1,18 1,52 5.5}
{0 CHEMBL1519707,1 1,7 1,27 1,52 5.477}
{0 CHEMBL1519767,1 1,2 1,18 1,35 1,39 1,52 5.88}
{0 CHEMBL1519902,1 1,52 5.79}
{0 CHEMBL1519958,1 1,7 1,35 1,52 4.855}
{0 CHEMBL1520111,1 1,8 1,35 1,52 5.73}
{0 CHEMBL1520157,1 1,35 1,52 6.144}
{0 CHEMBL1520187,1 1,2 1,37 1,52 4.831}
{0 CHEMBL1520276,1 1,52 6.063}
{0 CHEMBL1520537,1 1,52 6.772}
{0 CHEMBL1520556,1 1,26 1,39 1,50 1,52 5.566}
{0 CHEMBL1521297,1 1,52 4.969}
{0 CHEMBL1521380,1 1,52 5.181}
{0 CHEMBL1521890,1 1,52 5.437}
{0 CHEMBL1521991,1 1,35 1,49 1,52 5.582}
{0 CHEMBL1522211,1 1,33 1,52 4.698}
{0 CHEMBL1522486,52 5.029}
{0 CHEMBL1522592,1 1,35 1,52 4.606}
{0 CHEMBL1522797,1 1,23 1,31 1,52 4.652}
{0 CHEMBL1522807,1 1,24 1,35 1,52 6.018}
{0 CHEMBL1522867,1 1,36 1,52 5.713}
{0 CHEMBL1523909,1 1,3 1,24 1,26 1,52 5.463}
{0 CHEMBL1524014,1 1,52 6.635}
{0 CHEMBL1524144,1 1,23 1,24 1,39 1,52 5.452}
{0 CHEMBL1524400,1 1,52 5.101}
{0 CHEMBL1524515,1 1,2 1,35 1,52 5.284}
{0 CHEMBL1524828,1 1,52 4.606}
{0 CHEMBL1524829,1 1,52 5.019}
{0 CHEMBL1524956,1 1,34 1,52 6.733}
{0 CHEMBL1525081,1 1,52 4.855}
{0 CHEMBL1525576,1 1,15 1,35 1,52 6.008}
{0 CHEMBL1527022,1 1,52 5.963}
{0 CHEMBL1527078,1 1,2 1,52 4.676}
{0 CHEMBL1527180,1 1,5 1,36 1,47 1,52 5.098}
{0 CHEMBL1528049,1 1,35 1,50 1,52 5.414}
{0 CHEMBL1528325,1 1,2 1,31 1,52 5.988}
{0 CHEMBL1528330,1 1,52 6.116}
{0 CHEMBL1528425,1 1,34 1,52 4.816}
{0 CHEMBL1528505,1 1,52 6.122}
{0 CHEMBL1528603,1 1,35 1,52 5.073}
{0 CHEMBL1528681,1 1,2 1,26 1,39 1,52 6.159}
{0 CHEMBL1528975,1 1,15 1,35 1,52 5.123}
{0 CHEMBL1529188,1 1,35 1,52 6.471}
{0 CHEMBL1529521,1 1,35 1,52 5.63}
{0 CHEMBL1529553,1 1,2 1,52 5.659}
{0 CHEMBL1530097,1 1,2 1,52 5.313}
{0 CHEMBL1530274,1 1,26 1,52 4.801}
{0 CHEMBL1530885,1 1,15 1,27 1,52 5.644}
{0 CHEMBL1532068,1 1,33 1,52 6.146}
{0 CHEMBL1533086,1 1,36 1,52 6.019}
{0 CHEMBL1533308,1 1,2 1,11 1,52 5.424}
{0 CHEMBL1533353,1 1,2 1,52 4.162}
{0 CHEMBL1533463,1 1,35 1,52 5.396}
{0 CHEMBL1534035,1 1,35 1,52 6.041}
{0 CHEMBL1534520,1 1,35 1,52 6.314}
{0 CHEMBL1534596,1 1,35 1,52 5.806}
{0 CHEMBL1535169,1 1,35 1,52 5.476}
{0 CHEMBL1535194,1 1,39 1,52 5.666}
{0 CHEMBL1535361,1 1,35 1,49 1,52 5.613}
{0 CHEMBL1535533,1 1,52 4.895}
{0 CHEMBL1535759,1 1,35 1,52 4.795}
{0 CHEMBL1535900,1 1,52 5.788}
{0 CHEMBL1536073,1 1,52 5.497}
{0 CHEMBL1536196,1 1,36 1,52 5.165}
{0 CHEMBL1536493,1 1,52 5.452}
{0 CHEMBL1536737,1 1,2 1,18 1,35 1,39 1,52 5.591}
{0 CHEMBL1536869,1 1,35 1,36 1,38 1,52 4.729}
{0 CHEMBL1537190,1 1,16 1,35 1,38 1,52 6.149}
{0 CHEMBL1537417,1 1,36 1,52 6.48}
{0 CHEMBL1537448,1 1,52 5.416}
{0 CHEMBL1537696,1 1,25 1,39 1,52 5.954}
{0 CHEMBL1538246,1 1,52 6.253}
{0 CHEMBL1538392,1 1,49 1,52 5.595}
{0 CHEMBL1538399,1 1,2 1,38 1,52 5.583}
{0 CHEMBL1538428,1 1,52 5.365}
{0 CHEMBL1538652,1 1,34 1,35 1,52 5.005}
{0 CHEMBL1539512,1 1,18 1,52 5.969}
{0 CHEMBL1539624,1 1,8 1,26 1,52 4.931}
{0 CHEMBL1539860,1 1,7 1,17 1,31 1,52 5.215}
{0 CHEMBL1540525,1 1,24 1,52 4.974}
{0 CHEMBL1540827,1 1,2 1,39 1,52 5.396}
{0 CHEMBL1540952,1 1,52 5.869}
{0 CHEMBL1541088,1 1,39 1,52 5.919}
{0 CHEMBL1541425,1 1,52 4.554}
{0 CHEMBL1541536,1 1,24 1,35 1,52 5.559}
{0 CHEMBL1541539,1 1,35 1,52 6.021}
{0 CHEMBL1541582,1 1,35 1,52 6.052}
{0 CHEMBL1541834,1 1,2 1,34 1,52 5.315}
{0 CHEMBL1542349,1 1,31 1,35 1,52 5.131}
{0 CHEMBL1542527,1 1,7 1,26 1,52 4.625}
{0 CHEMBL1542594,1 1,52 5.726}
{0 CHEMBL1542648,1 1,2 1,18 1,39 1,52 6.191}
{0 CHEMBL1542804,1 1,52 5.495}
{0 CHEMBL1542861,1 1,35 1,41 1,52 5.18}
{0 CHEMBL1543255,1 1,2 1,6 1,52 5.928}
{0 CHEMBL1543939,1 1,52 4.851}
{0 CHEMBL1543967,1 1,7 1,26 1,52 4.639}
{0 CHEMBL1544114,1 1,52 4.868}
{0 CHEMBL1544131,1 1,7 1,52 6.068}
{0 CHEMBL1544199,1 1,35 1,52 5.034}
{0 CHEMBL1544328,1 1,7 1,26 1,52 6.395}
{0 CHEMBL1544423,1 1,24 1,35 1,52 5.763}
{0 CHEMBL1544679,1 1,52 5.701}
{0 CHEMBL1545105,1 1,35 1,52 5.995}
{0 CHEMBL1545223,1 1,35 1,52 4.72}
{0 CHEMBL1545396,1 1,35 1,52 5.252}
{0 CHEMBL1545499,1 1,52 4.963}
{0 CHEMBL1545677,1 1,10 1,21 1,52 4.709}
{0 CHEMBL1545702,34 1,52 4.784}
{0 CHEMBL1545971,1 1,2 1,35 1,52 6.921}
{0 CHEMBL1546039,1 1,35 1,39 1,52 6.004}
{0 CHEMBL1546228,1 1,3 1,35 1,52 6.054}
{0 CHEMBL1547347,1 1,35 1,52 4.613}
{0 CHEMBL1547450,1 1,4 1,52 5.011}
{0 CHEMBL1547468,1 1,30 1,52 4.082}
{0 CHEMBL1547746,1 1,35 1,52 4.627}
{0 CHEMBL1548257,1 1,15 1,24 1,49 1,52 5.166}
{0 CHEMBL1548429,1 1,35 1,52 5.922}
{0 CHEMBL1548492,1 1,33 1,52 6.203}
{0 CHEMBL1548613,26 1,38 1,52 6.017}
{0 CHEMBL1549060,1 1,7 1,52 4.789}
{0 CHEMBL1549103,1 1,26 1,52 5.11}
{0 CHEMBL1549128,1 1,52 5.039}
{0 CHEMBL1549308,1 1,5 1,35 1,52 5.673}
{0 CHEMBL1549472,1 1,21 1,26 1,52 5.256}
{0 CHEMBL1550278,1 1,35 1,52 6.218}
{0 CHEMBL1550442,1 1,42 1,52 5.778}
{0 CHEMBL1550523,1 1,7 1,35 1,52 5.142}
{0 CHEMBL1550584,1 1,4 1,50 1,52 5.609}
{0 CHEMBL1550951,1 1,39 1,52 4.448}
{0 CHEMBL1553408,1 1,52 6.224}
{0 CHEMBL1555211,1 1,37 1,52 5.185}
{0 CHEMBL1555271,1 1,33 1,52 4.766}
{0 CHEMBL1556805,1 1,4 1,36 1,52 4.678}
{0 CHEMBL1556838,1 1,11 1,31 1,52 5.576}
{0 CHEMBL1557142,1 1,3 1,52 4.712}
{0 CHEMBL1557243,1 1,52 5.51}
{0 CHEMBL1558065,1 1,2 1,52 5.348}
{0 CHEMBL1558160,1 1,7 1,52 5.133}
{0 CHEMBL1558285,1 1,25 1,52 6.075}
{0 CHEMBL1558361,1 1,52 4.902}
{0 CHEMBL1559276,1 1,24 1,39 1,52 6.072}
{0 CHEMBL1560221,1 1,35 1,52 6.321}
{0 CHEMBL1560928,1 1,35 1,52 5.82}
{0 CHEMBL1561050,1 1,35 1,51 1,52 6.492}
{0 CHEMBL1561540,1 1,52 5.483}
{0 CHEMBL1562664,1 1,52 6.116}
{0 CHEMBL1563219,1 1,52 5.51}
{0 CHEMBL1563323,1 1,2 1,34 1,52 5.507}
{0 CHEMBL1563623,1 1,27 1,52 5.925}
{0 CHEMBL1563714,1 1,26 1,52 6.181}
{0 CHEMBL1563766,1 1,2 1,6 1,34 1,52 5.719}
{0 CHEMBL1563898,1 1,52 5.818}
{0 CHEMBL1564030,1 1,35 1,52 4.995}
{0 CHEMBL1564413,1 1,3 1,26 1,35 1,39 1,52 4.645}
{0 CHEMBL1565012,1 1,52 6.123}
{0 CHEMBL1565403,1 1,2 1,34 1,52 5.582}
{0 CHEMBL1565454,1 1,31 1,35 1,38 1,52 5.567}
{0 CHEMBL1565976,1 1,26 1,39 1,52 5.03}
{0 CHEMBL1566084,1 1,35 1,52 5.421}
{0 CHEMBL1566205,1 1,39 1,52 5.599}
{0 CHEMBL1566224,1 1,36 1,52 5.047}
{0 CHEMBL1566358,1 1,35 1,52 6.358}
{0 CHEMBL1566967,1 1,2 1,17 1,52 4.635}
{0 CHEMBL1567502,1 1,39 1,52 5.054}
{0 CHEMBL1567688,1 1,27 1,31 1,35 1,52 5.904}
{0 CHEMBL1567865,1 1,52 6.079}
{0 CHEMBL1568337,1 1,35 1,52 6.085}
{0 CHEMBL1568773,1 1,28 1,39 1,43 1,52 5.22}
{0 CHEMBL1568848,1 1,52 4.514}
{0 CHEMBL1569124,1 1,41 1,52 4.933}
{0 CHEMBL1569309,1 1,35 1,52 5.657}
{0 CHEMBL1569989,1 1,2 1,24 1,52 6.016}
{0 CHEMBL1570176,1 1,4 1,50 1,52 5.949}
{0 CHEMBL1570632,1 1,52 6.02}
{0 CHEMBL1570820,1 1,2 1,52 5.546}
{0 CHEMBL1571370,1 1,35 1,52 5.495}
{0 CHEMBL1571603,1 1,52 5.049}
{0 CHEMBL1571650,1 1,35 1,39 1,52 5.861}
{0 CHEMBL1572031,1 1,52 5.576}
{0 CHEMBL1572360,1 1,25 1,31 1,39 1,52 6.207}
{0 CHEMBL1573697,1 1,2 1,18 1,52 5.531}
{0 CHEMBL1573870,1 1,52 5.686}
{0 CHEMBL1574132,1 1,6 1,35 1,52 5.171}
{0 CHEMBL1574748,1 1,6 1,14 1,27 1,49 1,52 5.921}
{0 CHEMBL1575594,1 1,52 6.66}
{0 CHEMBL1576118,1 1,2 1,52 6.048}
{0 CHEMBL1576754,1 1,52 5.237}
{0 CHEMBL1576945,1 1,52 5.398}
{0 CHEMBL1576976,1 1,52 5.5}
{0 CHEMBL1577590,1 1,2 1,34 1,52 5.725}
{0 CHEMBL1578088,1 1,39 1,52 6.103}
{0 CHEMBL1578127,1 1,35 1,52 4.639}
{0 CHEMBL1578164,1 1,35 1,52 5.23}
{0 CHEMBL1578267,1 1,35 1,39 1,52 5.892}
{0 CHEMBL1578482,1 1,22 1,52 6.275}
{0 CHEMBL1578484,1 1,52 5.674}
{0 CHEMBL1578716,1 1,18 1,52 5.213}
{0 CHEMBL1579999,1 1,52 6.186}
{0 CHEMBL1580272,1 1,34 1,52 6.353}
{0 CHEMBL1580434,1 1,2 1,25 1,52 5.378}
{0 CHEMBL1580472,1 1,27 1,47 1,52 6.921}
{0 CHEMBL1580695,1 1,36 1,52 5.597}
{0 CHEMBL1581042,1 1,52 5.851}
{0 CHEMBL1581275,1 1,26 1,32 1,38 1,39 1,52 5.209}
{0 CHEMBL1581627,1 1,52 5.977}
{0 CHEMBL1582044,1 1,52 5.012}
{0 CHEMBL1582088,1 1,15 1,52 5.066}
{0 CHEMBL1582111,1 1,52 5.195}
{0 CHEMBL1582221,1 1,35 1,52 6.025}
{0 CHEMBL1582488,1 1,26 1,50 1,52 5.588}
{0 CHEMBL1582831,1 1,2 1,34 1,52 4.647}
{0 CHEMBL1583101,1 1,4 1,50 1,52 5.403}
{0 CHEMBL1583292,1 1,35 1,39 1,43 1,52 5.508}
{0 CHEMBL1583585,1 1,52 5.781}
{0 CHEMBL1583704,1 1,27 1,47 1,52 5.509}
{0 CHEMBL1583801,1 1,35 1,52 6.193}
{0 CHEMBL1584387,1 1,27 1,35 1,38 1,52 5.555}
{0 CHEMBL1584449,1 1,33 1,39 1,52 6.021}
{0 CHEMBL1584524,1 1,52 5.666}
{0 CHEMBL1585075,1 1,52 5.764}
{0 CHEMBL1585127,1 1,40 1,52 6.075}
{0 CHEMBL1585527,1 1,2 1,52 4.844}
{0 CHEMBL1585592,1 1,36 1,52 6.721}
{0 CHEMBL1585777,1 1,36 1,46 1,52 6.079}
{0 CHEMBL1586201,1 1,2 1,31 1,52 5.826}
{0 CHEMBL1586668,1 1,39 1,52 4.703}
{0 CHEMBL1587027,1 1,41 1,52 5.327}
{0 CHEMBL1587031,1 1,52 4.942}
{0 CHEMBL1587075,1 1,23 1,24 1,26 1,31 1,39 1,52 5.95}
{0 CHEMBL1587133,1 1,14 1,50 1,52 4.685}
{0 CHEMBL1587453,1 1,2 1,31 1,37 1,52 6.17}
{0 CHEMBL1587683,1 1,52 4.666}
{0 CHEMBL1587766,1 1,2 1,52 6.066}
{0 CHEMBL1587806,1 1,31 1,35 1,52 6.595}
{0 CHEMBL1588483,1 1,2 1,52 5.889}
{0 CHEMBL1588513,1 1,35 1,52 5.516}
{0 CHEMBL1588660,1 1,24 1,36 1,46 1,52 4.838}
{0 CHEMBL1588832,1 1,2 1,34 1,52 5.385}
{0 CHEMBL1589335,1 1,52 6.017}
{0 CHEMBL1591171,1 1,2 1,24 1,26 1,52 5.144}
{0 CHEMBL1593571,1 1,52 5.744}
{0 CHEMBL1594071,1 1,28 1,52 5.898}
{0 CHEMBL1594475,1 1,42 1,52 5.763}
{0 CHEMBL1594561,1 1,24 1,39 1,52 4.743}
{0 CHEMBL1594846,1 1,35 1,52 6.139}
{0 CHEMBL1594897,1 1,24 1,52 4.98}
{0 CHEMBL1595053,1 1,35 1,39 1,52 4.903}
{0 CHEMBL1595088,1 1,17 1,52 4.833}
{0 CHEMBL1595108,1 1,49 1,52 5.297}
{0 CHEMBL1595820,1 1,35 1,52 4.876}
{0 CHEMBL1595934,1 1,24 1,34 1,52 5.536}
{0 CHEMBL1596066,1 1,52 4.784}
{0 CHEMBL1597174,1 1,35 1,52 5.506}
{0 CHEMBL1598009,1 1,35 1,52 6.611}
{0 CHEMBL1598222,1 1,19 1,52 5.453}
{0 CHEMBL1598347,1 1,2 1,11 1,35 1,52 5.965}
{0 CHEMBL1598581,1 1,35 1,38 1,52 5.645}
{0 CHEMBL1598643,1 1,15 1,35 1,36 1,52 4.866}
{0 CHEMBL1598785,1 1,33 1,52 6.106}
{0 CHEMBL1599520,1 1,2 1,34 1,52 5.709}
{0 CHEMBL1599610,1 1,31 1,36 1,52 5.589}
{0 CHEMBL1599674,1 1,21 1,25 1,50 1,52 5.908}
{0 CHEMBL1600203,1 1,35 1,52 4.828}
{0 CHEMBL1600678,1 1,10 1,52 5.516}
{0 CHEMBL1600749,1 1,52 6.339}
{0 CHEMBL1601133,1 1,52 5.713}
{0 CHEMBL1601830,1 1,3 1,21 1,35 1,52 5.755}
{0 CHEMBL1602088,1 1,35 1,52 4.744}
{0 CHEMBL1602169,1 1,52 6.018}
{0 CHEMBL1602503,1 1,2 1,18 1,35 1,52 4.979}
{0 CHEMBL1602841,1 1,35 1,38 1,52 5.82}
{0 CHEMBL1602947,1 1,35 1,52 5.738}
{0 CHEMBL1603001,1 1,21 1,35 1,52 5.794}
{0 CHEMBL1603092,1 1,35 1,52 4.978}
{0 CHEMBL1603456,1 1,3 1,34 1,52 5.206}
{0 CHEMBL1603689,1 1,7 1,24 1,26 1,35 1,52 5.516}
{0 CHEMBL1603982,1 1,6 1,52 5.645}
{0 CHEMBL1604425,1 1,36 1,47 1,52 6.097}
{0 CHEMBL1604650,1 1,52 6.014}
{0 CHEMBL1604661,1 1,52 5.804}
{0 CHEMBL1605026,52 5.177}
{0 CHEMBL1605956,1 1,7 1,35 1,52 6.049}
{0 CHEMBL1605988,1 1,52 5.724}
{0 CHEMBL1606097,1 1,52 6.444}
{0 CHEMBL1606414,1 1,39 1,52 4.762}
{0 CHEMBL1606685,1 1,34 1,52 4.797}
{0 CHEMBL1606978,1 1,52 5.596}
{0 CHEMBL1607272,1 1,26 1,52 5.608}
{0 CHEMBL1607404,1 1,2 1,18 1,31 1,35 1,52 4.844}
{0 CHEMBL1608579,1 1,35 1,45 1,52 5.11}
{0 CHEMBL1608990,1 1,35 1,52 5.002}
{0 CHEMBL1609004,1 1,2 1,24 1,52 4.795}
{0 CHEMBL1609038,1 1,35 1,49 1,52 4.717}
{0 CHEMBL1609255,1 1,24 1,25 1,31 1,39 1,52 6.06}
{0 CHEMBL1609315,1 1,7 1,35 1,52 5.428}
{0 CHEMBL1609663,1 1,23 1,52 6.382}
{0 CHEMBL1609759,1 1,2 1,36 1,52 6.921}
{0 CHEMBL1610563,1 1,24 1,35 1,36 1,49 1,52 6.13}
{0 CHEMBL1610676,1 1,35 1,52 6.159}
{0 CHEMBL1611301,1 1,35 1,38 1,52 6.487}
{0 CHEMBL1611315,1 1,35 1,52 4.723}
{0 CHEMBL1611574,1 1,2 1,52 4.307}
{0 CHEMBL1611851,1 1,24 1,35 1,39 1,52 4.037}
{0 CHEMBL1612118,1 1,7 1,52 5.935}
{0 CHEMBL1612201,1 1,52 5.22}
{0 CHEMBL1612493,1 1,11 1,52 5.568}
{0 CHEMBL1612660,1 1,2 1,26 1,39 1,52 5.739}
{0 CHEMBL1613503,1 1,33 1,39 1,52 5.269}
{0 CHEMBL187263,1 1,35 1,52 5.873}
{0 CHEMBL1874620,1 1,35 1,39 1,52 5.729}
{0 CHEMBL1964614,1 1,4 1,39 1,50 1,52 6.067}
{0 CHEMBL1966798,1 1,35 1,39 1,52 5.725}
{0 CHEMBL1967081,1 1,39 1,52 6.179}
{0 CHEMBL1969300,1 1,35 1,39 1,52 4.975}
{0 CHEMBL1969712,1 1,50 1,52 5.404}
{0 CHEMBL1970872,1 1,39 1,52 4.757}
{0 CHEMBL1971033,1 1,39 1,52 5.812}
{0 CHEMBL1976839,1 1,25 1,52 4.955}
{0 CHEMBL1977301,1 1,39 1,50 1,52 6.039}
{0 CHEMBL1977678,1 1,2 1,31 1,39 1,52 5.272}
{0 CHEMBL1978354,1 1,16 1,39 1,52 5.203}
{0 CHEMBL1979102,1 1,39 1,52 5.181}
{0 CHEMBL1979455,1 1,24 1,39 1,49 1,52 5.735}
{0 CHEMBL1979784,1 1,2 1,18 1,24 1,25 1,39 1,52 6.29}
{0 CHEMBL1981150,1 1,35 1,39 1,52 5.507}
{0 CHEMBL1983360,1 1,39 1,52 5.486}
{0 CHEMBL1985582,1 1,35 1,39 1,52 5.631}
{0 CHEMBL1985664,1 1,24 1,39 1,52 5.843}
{0 CHEMBL1985667,1 1,39 1,52 5.561}
{0 CHEMBL1986418,1 1,39 1,52 5.491}
{0 CHEMBL1987461,1 1,25 1,31 1,39 1,52 5.937}
{0 CHEMBL1987472,1 1,4 1,23 1,39 1,50 1,52 5.732}
{0 CHEMBL1987579,1 1,52 5.364}
{0 CHEMBL1987742,1 1,39 1,52 4.925}
{0 CHEMBL1988042,1 1,24 1,39 1,49 1,52 5.439}
{0 CHEMBL1989897,1 1,24 1,27 1,39 1,47 1,52 5.479}
{0 CHEMBL1990091,1 1,26 1,52 4.808}
{0 CHEMBL1990174,1 1,52 5.389}
{0 CHEMBL1991779,1 1,39 1,52 5.744}
{0 CHEMBL1993194,1 1,2 1,18 1,39 1,52 6.554}
{0 CHEMBL1993613,1 1,24 1,52 4.864}
{0 CHEMBL1994094,1 1,52 5.318}
{0 CHEMBL1994123,1 1,38 1,39 1,52 5.574}
{0 CHEMBL1994179,1 1,39 1,50 1,52 5.908}
{0 CHEMBL1994623,1 1,39 1,52 4.614}
{0 CHEMBL1994877,1 1,2 1,18 1,24 1,52 5.665}
{0 CHEMBL1994988,1 1,2 1,18 1,35 1,39 1,52 6.001}
{0 CHEMBL19954,1 1,52 5.842}
{0 CHEMBL1995503,1 1,39 1,52 5.783}
{0 CHEMBL1995550,1 1,7 1,52 5.432}
{0 CHEMBL1995715,1 1,2 1,35 1,39 1,52 5.416}
{0 CHEMBL1997747,1 1,27 1,52 5.914}
{0 CHEMBL1997827,1 1,26 1,39 1,52 4.707}
{0 CHEMBL1998184,1 1,2 1,52 5.255}
{0 CHEMBL199868,1 1,25 1,39 1,52 5.616}
{0 CHEMBL2000750,1 1,26 1,52 5.421}
{0 CHEMBL2004417,1 1,31 1,39 1,52 5.206}
{0 CHEMBL2004978,1 1,39 1,52 4.656}
{0 CHEMBL2005246,1 1,39 1,52 4.412}
{0 CHEMBL2006418,1 1,2 1,18 1,39 1,52 5.083}
{0 CHEMBL2006840,1 1,39 1,52 6.921}
{0 CHEMBL2006909,1 1,7 1,24 1,52 5.789}
{0 CHEMBL2028186,1 1,52 5.124}
{0 CHEMBL22062,1 1,35 1,52 5.223}
{0 CHEMBL221190,1 1,46 1,52 5.655}
{0 CHEMBL225963,1 1,3 1,7 1,52 6.489}
{0 CHEMBL240329,1 1,52 5.025}
{0 CHEMBL254576,52 5.755}
{0 CHEMBL258805,1 1,35 1,52 5.903}
{0 CHEMBL272195,1 1,52 5.248}
{0 CHEMBL300389,1 1,16 1,35 1,52 6.027}
{0 CHEMBL313163,1 1,2 1,52 5.547}
{0 CHEMBL325841,1 1,52 5.452}
{0 CHEMBL334707,34 1,52 4.622}
{0 CHEMBL375781,1 1,52 6}
{0 CHEMBL380184,1 1,35 1,52 5.462}
{0 CHEMBL389162,1 1,35 1,52 6.106}
{0 CHEMBL391877,1 1,52 4.818}
{0 CHEMBL393287,1 1,11 1,39 1,52 5.932}
{0 CHEMBL405927,1 1,2 1,11 1,52 5.92}
{0 CHEMBL415879,52 4.98}
{0 CHEMBL423192,1 1,11 1,52 5.829}
{0 CHEMBL453974,1 1,52 6.631}
{0 CHEMBL459022,1 1,52 4.84}
{0 CHEMBL461579,1 1,18 1,38 1,39 1,52 5.521}
{0 CHEMBL461820,1 1,36 1,47 1,52 4.886}
{0 CHEMBL466853,1 1,25 1,50 1,52 4.737}
{0 CHEMBL478791,1 1,52 5.468}
{0 CHEMBL479107,1 1,24 1,52 5.196}
{0 CHEMBL483768,1 1,8 1,52 6.192}
{0 CHEMBL492115,1 1,33 1,39 1,52 4.756}
{0 CHEMBL496,1 1,52 5.763}
{0 CHEMBL512366,1 1,31 1,35 1,39 1,52 6.017}
{0 CHEMBL518252,1 1,52 6.879}
{0 CHEMBL527584,1 1,35 1,52 4.724}
{0 CHEMBL528181,1 1,20 1,35 1,52 5.287}
{0 CHEMBL530049,52 5.628}
{0 CHEMBL530499,1 1,33 1,34 1,52 4.921}
{0 CHEMBL547285,1 1,33 1,52 6.146}
{0 CHEMBL548615,1 1,35 1,52 5.682}
{0 CHEMBL560919,1 1,52 5.561}
{0 CHEMBL580727,1 1,33 1,34 1,52 4.719}
{0 CHEMBL580955,1 1,33 1,52 4.957}
{0 CHEMBL581872,1 1,52 6.438}
{0 CHEMBL582073,1 1,52 4.987}
{0 CHEMBL582652,1 1,24 1,49 1,52 4.553}
{0 CHEMBL584442,1 1,52 4.253}
{0 CHEMBL584458,1 1,25 1,36 1,52 4.429}
{0 CHEMBL584635,1 1,25 1,52 4.97}
{0 CHEMBL585502,1 1,25 1,52 6.827}
{0 CHEMBL585656,1 1,52 6.481}
{0 CHEMBL585827,1 1,33 1,52 4.615}
{0 CHEMBL586135,1 1,22 1,52 6.921}
{0 CHEMBL588804,1 1,35 1,52 4.684}
{0 CHEMBL590665,1 1,33 1,52 4.691}
{0 CHEMBL590927,1 1,33 1,52 6.049}
{0 CHEMBL590947,1 1,3 1,34 1,52 5.321}
{0 CHEMBL591361,1 1,34 1,42 1,52 6.117}
{0 CHEMBL591412,1 1,33 1,52 4.586}
{0 CHEMBL591834,1 1,24 1,26 1,52 4.85}
{0 CHEMBL595700,1 1,20 1,35 1,52 5.475}
{0 CHEMBL599255,1 1,34 1,35 1,52 6.032}
{0 CHEMBL599924,1 1,7 1,36 1,47 1,52 6.491}
{0 CHEMBL600306,1 1,52 5.85}
{0 CHEMBL600315,1 1,2 1,24 1,26 1,52 4.626}
{0 CHEMBL600360,1 1,50 1,52 5.144}
{0 CHEMBL600734,1 1,52 6.225}
{0 CHEMBL600862,1 1,25 1,33 1,52 5.066}
{0 CHEMBL601543,1 1,4 1,18 1,25 1,52 4.626}
{0 CHEMBL601768,1 1,33 1,52 4.792}
{0 CHEMBL602218,1 1,39 1,52 5.844}
{0 CHEMBL602363,1 1,12 1,49 1,52 4.97}
{0 CHEMBL602718,1 1,33 1,52 6}
{0 CHEMBL609027,1 1,52 5.405}
{0 CHEMBL790,1 1,35 1,52 5.672}
{0 CHEMBL89445,52 6.283}
