{
  "data_features": {
    "feature": [
      {
        "data_type": "nominal",
        "index": "0",
        "is_ignore": "false",
        "is_row_identifier": "true",
        "is_target": "false",
        "name": "molecule_id",
        "nominal_value": [
          "CHEMBL1667",
          "CHEMBL2046465",
          "CHEMBL2048560",
          "CHEMBL2048561",
          "CHEMBL2048562",
          "CHEMBL2048563",
          "CHEMBL2048564",
          "CHEMBL2048565",
          "CHEMBL2048566",
          "CHEMBL2048567",
          "CHEMBL2048568",
          "CHEMBL2048569",
          "CHEMBL2048570",
          "CHEMBL2048571",
          "CHEMBL2048572",
          "CHEMBL2048573",
          "CHEMBL2048574",
          "CHEMBL2048575",
          "CHEMBL2048576",
          "CHEMBL2048577",
          "CHEMBL2048578",
          "CHEMBL2048579",
          "CHEMBL2048580",
          "CHEMBL2048701",
          "CHEMBL2048702",
          "CHEMBL2048703",
          "CHEMBL2048704",
          "CHEMBL2048705",
          "CHEMBL2048706",
          "CHEMBL2048707",
          "CHEMBL2152353",
          "CHEMBL2204017",
          "CHEMBL2204018",
          "CHEMBL2204732",
          "CHEMBL2204733",
          "CHEMBL2204734",
          "CHEMBL2204735",
          "CHEMBL2204736",
          "CHEMBL2204737",
          "CHEMBL2204738",
          "CHEMBL2204739",
          "CHEMBL2204740",
          "CHEMBL2204741"
        ],
        "number_of_missing_values": "0"
      },
      {
        "data_type": "numeric",
        "index": "1",
        "is_ignore": "false",
        "is_row_identifier": "false",
        "is_target": "false",
        "name": "AMW",
        "number_of_missing_values": "0"
      },
      {
        "data_type": "numeric",
        "index": "2",
        "is_ignore": "false",
        "is_row_identifier": "false",
        "is_target": "false",
        "name": "C.",
        "number_of_missing_values": "0"
      },
      {
        "data_type": "numeric",
        "index": "3",
        "is_ignore": "false",
        "is_row_identifier": "false",
        "is_target": "true",
        "name": "pXC50",
        "number_of_missing_values": "0"
      }
    ]
  }
}