"molecule_id","AMW","C.","H.","Me","Mi","Mp","Mv","MW","N.","nAB","nAT","nB","nBM","nBO","nBR","nBT","nC","nCL","nCsp","nCsp2","nCsp3","nDB","nF","nH","nHet","nHM","nI","nN","nO","nP","nS","nSK","nTB","nX","O.","RBF","RBN","SCBO","Se","Si","Sp","Sv","X.","pXC50"
{1 8.231,2 44.4,3 46.3,4 0.99,5 1.111,6 0.72,7 0.657,8 444.48,9 3.7,10 18,11 54,13 18,14 32,16 57,17 24,18 2,20 18,21 6,24 25,25 5,26 3,28 2,31 1,32 29,34 2,36 0.105,37 6,38 41,39 53.472,40 59.995,41 38.892,42 35.47,43 3.7,44 4.896}
{0 CHEMBL105785,1 8.231,2 44.4,3 46.3,4 0.99,5 1.111,6 0.72,7 0.657,8 444.48,9 3.7,10 18,11 54,13 18,14 32,16 57,17 24,18 2,20 18,21 6,24 25,25 5,26 3,28 2,31 1,32 29,34 2,36 0.105,37 6,38 41,39 53.472,40 59.995,41 38.892,42 35.47,43 3.7,44 5.4}
{0 CHEMBL106074,1 7.088,2 41.4,3 51.4,4 0.984,5 1.119,6 0.676,7 0.614,8 496.19,9 2.9,10 12,11 70,13 13,14 39,16 75,17 29,18 1,20 13,21 16,22 1,24 36,25 5,26 2,28 2,29 1,31 1,32 34,34 1,35 1.4,36 0.093,37 7,38 46,39 68.894,40 78.336,41 47.296,42 42.991,43 1.4,44 4.893}
{0 CHEMBL106108,1 6.935,2 40,3 53.3,4 0.98,5 1.122,6 0.672,7 0.604,8 416.1,9 3.3,10 12,11 60,13 12,14 31,16 63,17 24,18 1,20 12,21 12,24 32,25 4,26 2,28 2,31 1,32 28,34 1,36 0.095,37 6,38 37,39 58.8,40 67.296,41 40.319,42 36.223,43 1.7,44 4.979}
{0 CHEMBL106125,1 7.596,2 46.9,3 46.9,4 0.983,5 1.108,6 0.712,7 0.651,8 486.14,9 3.1,10 24,11 64,13 24,14 38,16 68,17 30,18 1,20 24,21 6,24 30,25 4,26 2,28 2,31 1,32 34,34 1,36 0.103,37 7,38 50,39 62.916,40 70.881,41 45.557,42 41.696,43 1.6,44 5.921}
{0 CHEMBL106127,1 8.869,2 44.4,3 44.4,4 0.996,5 1.11,6 0.736,7 0.672,8 478.92,9 3.7,10 18,11 54,13 18,14 33,16 57,17 24,18 3,20 18,21 6,24 24,25 6,26 4,28 2,31 1,32 30,34 3,36 0.105,37 6,38 42,39 53.796,40 59.939,41 39.75,42 36.297,43 5.6,44 6.515}
{0 CHEMBL106236,1 9.259,2 44.4,3 38.9,4 1.032,5 1.144,6 0.699,7 0.677,8 499.99,9 3.7,10 18,11 54,13 18,14 36,16 57,17 24,18 1,20 18,21 6,23 5,24 21,25 9,26 2,28 2,31 1,32 33,34 6,36 0.105,37 6,38 45,39 55.712,40 61.749,41 37.722,42 36.559,43 11.1,44 5.389}
{0 CHEMBL106415,1 9.054,2 44.4,3 46.3,4 0.988,5 1.109,6 0.729,7 0.661,8 488.93,9 3.7,10 18,11 54,13 18,14 32,15 1,16 57,17 24,18 1,20 18,21 6,24 25,25 5,26 3,28 2,31 1,32 29,34 2,36 0.105,37 6,38 41,39 53.378,40 59.892,41 39.387,42 35.668,43 3.7,44 4.924}
{0 CHEMBL106732,1 7.593,2 44.4,3 48.1,4 0.984,5 1.112,6 0.704,7 0.642,8 410.04,9 3.7,10 18,11 54,13 18,14 31,16 57,17 24,18 1,20 18,21 6,24 26,25 4,26 2,28 2,31 1,32 28,34 1,36 0.105,37 6,38 40,39 53.149,40 60.051,41 38.034,42 34.642,43 1.9,44 5.491}
{0 CHEMBL106769,1 8.065,2 44.4,3 44.4,4 1,5 1.113,6 0.701,7 0.656,8 508.1,9 3.2,10 18,11 63,13 20,14 39,16 67,17 28,18 1,20 21,21 7,22 2,24 28,25 7,26 2,28 2,29 3,31 1,32 35,34 1,35 4.8,36 0.104,37 7,38 50,39 63.014,40 70.094,41 44.159,42 41.314,43 1.6,44 5.53}
{0 CHEMBL106901,1 7.582,2 41.9,3 48.4,4 0.993,5 1.118,6 0.685,7 0.631,8 470.1,9 3.2,10 18,11 62,13 18,14 35,16 65,17 26,18 1,20 18,21 8,24 30,25 6,26 2,28 2,29 2,31 1,32 32,34 1,35 3.2,36 0.123,37 8,38 44,39 61.571,40 69.3,41 42.466,42 39.126,43 1.6,44 5.268}
{0 CHEMBL107852,1 7.063,2 42.4,3 51.5,4 0.98,5 1.117,6 0.683,7 0.617,8 466.16,9 3,10 18,11 66,13 18,14 35,16 69,17 28,18 1,20 18,21 10,24 34,25 4,26 2,28 2,31 1,32 32,34 1,36 0.101,37 7,38 44,39 64.683,40 73.711,41 45.08,42 40.75,43 1.5,44 5.387}
{0 CHEMBL1098695,1 7.394,2 43.8,3 47.9,4 0.991,5 1.119,6 0.681,7 0.633,8 354.91,9 4.2,10 12,11 48,13 13,14 28,16 51,17 21,18 1,20 13,21 8,22 1,24 23,25 4,26 1,28 2,29 1,32 25,34 1,35 2.1,36 0.078,37 4,38 35,39 47.574,40 53.717,41 32.699,42 30.38,43 2.1,44 4.469}
{0 CHEMBL1162311,1 6.62,2 39,3 51.2,4 0.99,5 1.133,6 0.642,7 0.598,8 271.4,9 7.3,10 11,11 41,13 12,14 21,16 42,17 16,20 11,21 5,22 1,24 21,25 4,28 3,29 1,32 20,35 2.4,36 0.143,37 6,38 27.5,39 40.585,40 46.441,41 26.324,42 24.52,44 4}
{0 CHEMBL118432,1 11.079,2 35.7,3 21.4,4 1.104,5 1.146,6 0.658,7 0.726,8 310.2,9 14.3,10 10,11 28,13 16,14 23,16 29,17 10,20 10,22 6,24 6,25 12,28 4,29 8,32 22,35 28.6,36 0.172,37 5,38 34,39 30.909,40 32.084,41 18.42,42 20.331,44 4.301}
{0 CHEMBL118441,1 8.477,2 31.3,3 40.6,4 1.053,5 1.151,6 0.611,7 0.625,8 271.26,9 9.4,10 5,11 32,13 9,14 19,16 32,17 10,20 6,21 4,22 4,24 13,25 9,28 3,29 6,32 19,35 18.8,36 0.156,37 5,38 25.5,39 33.687,40 36.827,41 19.551,42 19.987,44 4.301}
{0 CHEMBL120147,1 8.93,2 44.7,3 34.2,4 1.036,5 1.122,6 0.687,7 0.691,8 339.33,9 7.9,10 16,11 38,13 20,14 27,16 40,17 17,20 16,21 1,22 4,24 13,25 8,28 3,29 5,32 25,35 13.2,36 0.125,37 5,38 39,39 39.36,40 42.618,41 26.097,42 26.272,44 4.602}
{0 CHEMBL120665,1 10.066,2 29.4,3 29.4,4 1.088,5 1.162,6 0.623,7 0.674,8 171.13,9 17.6,10 5,11 17,13 8,14 12,16 17,17 5,20 5,22 3,24 5,25 7,28 3,29 4,32 12,35 23.5,36 0.118,37 2,38 17.5,39 18.498,40 19.748,41 10.597,42 11.45,44 4.301}
{0 CHEMBL122289,1 8.683,2 33.3,3 51.9,4 0.99,5 1.107,6 0.731,7 0.628,8 234.44,11 27,13 4,14 12,16 26,17 9,20 6,21 3,22 4,24 14,25 4,26 3,29 1,31 3,32 13,35 3.7,36 0.308,37 8,38 16,39 26.742,40 29.876,41 19.727,42 16.964,44 2.699}
{0 CHEMBL122890,1 8.683,2 33.3,3 51.9,4 0.99,5 1.107,6 0.731,7 0.628,8 234.44,11 27,13 4,14 12,16 26,17 9,20 6,21 3,22 4,24 14,25 4,26 3,29 1,31 3,32 13,35 3.7,36 0.308,37 8,38 16,39 26.742,40 29.876,41 19.727,42 16.964,44 2.699}
{0 CHEMBL134615,1 7.564,2 44.4,3 44.4,4 1.011,5 1.116,6 0.664,7 0.641,8 272.32,10 6,11 36,13 10,14 21,16 37,17 16,20 11,21 5,22 4,24 16,25 4,29 4,32 20,35 11.1,36 0.135,37 5,38 28,39 36.378,40 40.159,41 23.909,42 23.074,44 4.301}
{0 CHEMBL135287,1 7.342,2 43.6,3 46.2,4 1.007,5 1.117,6 0.658,7 0.631,8 286.35,10 6,11 39,13 10,14 22,16 40,17 17,20 11,21 6,22 4,24 18,25 4,29 4,32 21,35 10.3,36 0.15,37 6,38 29,39 39.262,40 43.574,41 25.671,42 24.6,44 4.301}
{0 CHEMBL135504,1 7.792,2 43.2,3 43.2,4 1.019,5 1.118,6 0.658,7 0.643,8 288.32,10 6,11 37,13 10,14 22,16 38,17 16,20 11,21 5,22 4,24 16,25 5,29 5,32 21,35 13.5,36 0.132,37 5,38 29,39 37.705,40 41.369,41 24.364,42 23.788,44 4.301}
{0 CHEMBL135536,1 7.559,2 42.5,3 45,4 1.015,5 1.12,6 0.653,7 0.633,8 302.35,10 6,11 40,13 10,14 23,16 41,17 17,20 11,21 6,22 4,24 18,25 5,29 5,32 22,35 12.5,36 0.146,37 6,38 30,39 40.589,40 44.784,41 26.125,42 25.315,44 4.301}
{0 CHEMBL1362166,1 8.839,2 43.5,3 39.1,4 1.001,5 1.116,6 0.737,7 0.688,8 203.29,9 13,10 12,11 23,13 12,14 15,16 24,17 10,20 9,21 1,24 9,25 4,26 1,28 3,31 1,32 14,36 0.083,37 2,38 21,39 23.033,40 25.661,41 16.949,42 15.832,44 4}
{0 CHEMBL146512,1 9.148,2 52,3 36,4 1.002,5 1.104,6 0.757,7 0.719,8 228.69,9 8,10 16,11 25,13 16,14 18,16 27,17 13,18 1,20 13,24 9,25 3,26 1,28 2,32 16,34 1,38 26,39 25.062,40 27.601,41 18.915,42 17.978,43 4,44 4.367}
{0 CHEMBL1471450,1 6.724,2 39.3,3 50,4 0.988,5 1.135,6 0.65,7 0.606,8 376.56,9 10.7,10 20,11 56,13 20,14 31,16 59,17 22,20 14,21 8,24 28,25 6,28 6,32 28,36 0.153,37 9,38 41,39 55.33,40 63.557,41 36.41,42 33.923,44 4.975}
{0 CHEMBL151228,1 6.788,2 39.3,3 52.5,4 0.987,5 1.129,6 0.652,7 0.598,8 414.04,9 4.9,10 16,11 61,13 16,14 31,16 63,17 24,18 1,20 13,21 11,24 32,25 5,26 1,28 3,29 1,32 29,34 1,35 1.6,36 0.159,37 10,38 39,39 60.21,40 68.876,41 39.75,42 36.508,43 1.6,44 5.26}
{0 CHEMBL151397,1 6.737,2 40.4,3 52.6,4 0.982,5 1.127,6 0.659,7 0.601,8 384.01,9 5.3,10 16,11 57,13 16,14 29,16 59,17 23,18 1,20 13,21 10,24 30,25 4,26 1,28 3,32 27,34 1,36 0.153,37 9,38 37,39 56,40 64.252,41 37.535,42 34.267,43 1.8,44 4.959}
{0 CHEMBL151680,1 7.196,2 39.6,3 47.9,4 1.01,5 1.127,6 0.639,7 0.612,8 345.43,9 2.1,10 6,11 48,13 10,14 26,16 49,17 19,20 11,21 8,22 4,24 23,25 6,28 1,29 5,32 25,35 10.4,36 0.122,37 6,38 33,39 48.458,40 54.113,41 30.654,42 29.39,44 4.602}
{0 CHEMBL151798,1 7.157,2 40.7,3 48.1,4 1.008,5 1.123,6 0.641,7 0.614,8 386.48,10 6,11 54,13 11,14 29,16 55,17 22,20 12,21 10,22 5,24 26,25 6,29 6,32 28,35 11.1,36 0.218,37 12,38 37,39 54.451,40 60.654,41 34.625,42 33.137,44 4.301}
{0 CHEMBL152023,1 6.303,2 39.7,3 53.4,4 0.983,5 1.13,6 0.64,7 0.589,8 365.57,9 5.2,10 16,11 58,13 16,14 29,16 60,17 23,20 13,21 10,24 31,25 4,28 3,29 1,32 27,35 1.7,36 0.15,37 9,38 37,39 57.003,40 65.517,41 37.131,42 34.154,44 4.569}
{0 CHEMBL152142,1 6.99,2 39.6,3 49.1,4 1.002,5 1.129,6 0.641,7 0.608,8 740.98,9 3.8,10 12,11 106,13 20,14 58,16 110,17 42,20 22,21 20,22 8,24 52,25 12,28 4,29 8,32 54,35 7.5,36 0.164,37 18,38 72,39 106.232,40 119.633,41 67.932,42 64.447,44 4.77}
{0 CHEMBL152150,1 7.369,2 43.8,3 45.3,4 1.002,5 1.121,6 0.668,7 0.637,8 471.6,9 4.7,10 12,11 64,13 18,14 38,16 67,17 28,20 20,21 8,22 6,24 29,25 7,28 3,29 4,32 35,35 6.3,36 0.149,37 10,38 50,39 64.101,40 71.73,41 42.733,42 40.772,44 5.046}
{0 CHEMBL152177,1 7.202,2 42.2,3 47,4 1.002,5 1.123,6 0.656,7 0.625,8 597.77,9 3.6,10 12,11 83,13 20,14 47,16 86,17 35,20 22,21 13,22 8,24 39,25 9,28 3,29 6,32 44,35 7.2,36 0.174,37 15,38 61,39 83.174,40 93.225,41 54.449,42 51.835,44 4.523}
{0 CHEMBL152178,1 6.559,2 35.2,3 52.7,4 0.998,5 1.14,6 0.619,7 0.58,8 596.86,9 6.6,10 6,11 91,13 11,14 46,16 94,17 32,20 12,21 20,22 5,24 48,25 11,28 6,29 5,32 43,35 5.5,36 0.149,37 14,38 54,39 90.803,40 103.756,41 56.296,42 52.765,44 4.301}
{0 CHEMBL152191,1 7.467,2 41.7,3 45.8,4 1.014,5 1.121,6 0.648,7 0.627,8 358.42,10 6,11 48,13 11,14 27,16 49,17 20,20 12,21 8,22 5,24 22,25 6,29 6,32 26,35 12.5,36 0.204,37 10,38 35,39 48.683,40 53.824,41 31.102,42 30.084,44 4.301}
{0 CHEMBL152234,1 7.229,2 40.7,3 47.3,4 1.007,5 1.126,6 0.647,7 0.619,8 657.83,9 3.3,10 12,11 91,13 20,14 51,16 94,17 37,20 22,21 15,22 8,24 43,25 11,28 3,29 8,32 48,35 8.8,36 0.181,37 17,38 65,39 91.596,40 102.474,41 58.881,42 56.319,44 4.032}
{0 CHEMBL152235,1 7.114,2 41.9,3 47.7,4 1.001,5 1.124,6 0.654,7 0.62,8 611.8,9 3.5,10 12,11 86,13 20,14 48,16 89,17 36,20 22,21 14,22 8,24 41,25 9,28 3,29 6,32 45,35 7,36 0.18,37 16,38 62,39 86.058,40 96.64,41 56.211,42 53.362,44 4.799}
{0 CHEMBL152263,1 8.395,2 45.2,3 38.7,4 1.03,5 1.114,6 0.672,7 0.669,8 260.26,10 6,11 31,13 10,14 20,16 32,17 14,20 11,21 3,22 4,24 12,25 5,29 5,32 19,35 16.1,36 0.094,37 3,38 27,39 31.938,40 34.538,41 20.841,42 20.735,44 4.301}
{0 CHEMBL152285,1 6.809,2 37.3,3 50.7,4 1.001,5 1.135,6 0.63,7 0.595,8 510.7,9 5.3,10 6,11 75,13 11,14 40,16 78,17 28,20 12,21 16,22 5,24 38,25 9,28 4,29 5,32 37,35 6.7,36 0.103,37 8,38 48,39 75.065,40 85.099,41 47.239,42 44.615,44 4.757}
{0 CHEMBL152308,1 6.958,2 41,3 48.7,4 0.997,5 1.127,6 0.651,7 0.614,8 542.74,9 5.1,10 12,11 78,13 18,14 43,16 81,17 32,20 20,21 12,22 6,24 38,25 8,28 4,29 4,32 40,35 5.1,36 0.185,37 15,38 55,39 77.738,40 87.889,41 50.785,42 47.9,44 5.187}
{0 CHEMBL152312,1 7.652,2 46.4,3 42.9,4 1.004,5 1.114,6 0.682,7 0.655,8 428.52,9 3.6,10 12,11 56,13 18,14 35,16 59,17 26,20 20,21 6,22 6,24 24,25 6,28 2,29 4,32 32,35 7.1,36 0.119,37 7,38 47,39 56.232,40 62.401,41 38.205,42 36.697,44 4.244}
{0 CHEMBL152313,1 6.154,2 34.9,3 55.4,4 0.987,5 1.141,6 0.617,7 0.567,8 510.81,9 7.2,10 6,11 83,13 9,14 40,16 86,17 29,20 10,21 19,22 3,24 46,25 8,28 6,29 2,32 37,35 2.4,36 0.128,37 11,38 46,39 81.937,40 94.713,41 51.171,42 47.094,44 4.244}
{0 CHEMBL152345,1 6.901,2 37,3 50,4 1.003,5 1.136,6 0.63,7 0.597,8 317.43,9 6.5,10 6,11 46,13 9,14 24,16 47,17 17,20 10,21 7,22 3,24 23,25 6,28 3,29 3,32 23,35 6.5,36 0.17,37 8,38 30,39 46.123,40 52.275,41 28.995,42 27.477,44 4.244}
{0 CHEMBL152353,1 7.286,2 40.4,3 46.8,4 1.007,5 1.127,6 0.648,7 0.621,8 342.43,9 4.3,10 6,11 47,13 10,14 27,16 49,17 19,20 11,21 8,22 4,24 22,25 6,28 2,29 4,32 25,35 8.5,36 0.061,37 3,38 34,39 47.349,40 52.986,41 30.443,42 29.17,44 4.301}
{0 CHEMBL152394,1 6.501,2 36.8,3 52.6,4 0.992,5 1.137,6 0.629,7 0.585,8 370.55,9 7,10 6,11 57,13 9,14 29,16 59,17 21,20 10,21 11,22 3,24 30,25 6,28 4,29 2,32 27,35 3.5,36 0.136,37 8,38 35,39 56.549,40 64.81,41 35.83,42 33.364,44 5.222}
{0 CHEMBL152395,1 6.982,2 40.5,3 48.6,4 0.998,5 1.128,6 0.649,7 0.613,8 258.35,9 5.4,10 6,11 37,13 9,14 20,16 38,17 15,20 10,21 5,22 3,24 18,25 4,28 2,29 2,32 19,35 5.4,36 0.132,37 5,38 26,39 36.927,40 41.737,41 24.012,42 22.687,44 4.244}
{0 CHEMBL152422,1 7.071,2 40.2,3 48.5,4 1.004,5 1.127,6 0.643,7 0.612,8 685.89,9 3.1,10 12,11 97,13 20,14 53,16 100,17 39,20 22,21 17,22 8,24 47,25 11,28 3,29 8,32 50,35 8.2,36 0.19,37 19,38 67,39 97.363,40 109.305,41 62.404,42 59.372,44 4.699}
{0 CHEMBL152532,1 6.916,2 38.9,3 50,4 1.004,5 1.129,6 0.633,7 0.601,8 373.49,9 1.9,10 6,11 54,13 10,14 28,16 55,17 21,20 11,21 10,22 4,24 27,25 6,28 1,29 5,32 27,35 9.3,36 0.145,37 8,38 35,39 54.225,40 60.943,41 34.176,42 32.444,44 4.602}
{0 CHEMBL152534,1 7.316,2 40.9,3 46.6,4 1.008,5 1.126,6 0.649,7 0.623,8 643.8,9 3.4,10 12,11 88,13 20,14 50,16 91,17 36,20 22,21 14,22 8,24 41,25 11,28 3,29 8,32 47,35 9.1,36 0.176,37 16,38 64,39 88.712,40 99.059,41 57.12,42 54.792,44 4.26}
{0 CHEMBL152558,1 6.683,2 38.8,3 51,4 0.993,5 1.132,6 0.639,7 0.598,8 327.47,9 6.1,10 6,11 49,13 9,14 26,16 51,17 19,20 10,21 9,22 3,24 25,25 5,28 3,29 2,32 24,35 4.1,36 0.098,37 5,38 32,39 48.68,40 55.481,41 31.302,42 29.289,44 4.244}
{0 CHEMBL152627,1 6.476,2 35,3 53.3,4 0.996,5 1.141,6 0.617,7 0.577,8 388.57,9 6.7,10 6,11 60,13 9,14 29,16 61,17 21,20 10,21 11,22 3,24 32,25 7,28 4,29 3,32 28,35 5,36 0.213,37 13,38 35,39 59.76,40 68.434,41 37.046,42 34.605,44 4.553}
{0 CHEMBL152629,1 6.932,2 39.8,3 49.5,4 1.001,5 1.128,6 0.64,7 0.606,8 713.95,9 2.9,10 12,11 103,13 20,14 55,16 106,17 41,20 22,21 19,22 8,24 51,25 11,28 3,29 8,32 52,35 7.8,36 0.198,37 21,38 69,39 103.13,40 116.135,41 65.927,42 62.426,44 4.432}
{0 CHEMBL152673,1 6.866,2 39.3,3 50,4 1,5 1.129,6 0.638,7 0.603,8 769.04,9 3.6,10 12,11 112,13 20,14 60,16 116,17 44,20 22,21 22,22 8,24 56,25 12,28 4,29 8,32 56,35 7.1,36 0.172,37 20,38 74,39 111.999,40 126.464,41 71.455,42 67.501,44 5.447}
{0 CHEMBL152700,1 8.067,2 44.1,3 41.2,4 1.024,5 1.116,6 0.665,7 0.655,8 274.29,10 6,11 34,13 10,14 21,16 35,17 15,20 11,21 4,22 4,24 14,25 5,29 5,32 20,35 14.7,36 0.114,37 4,38 28,39 34.822,40 37.953,41 22.602,42 22.262,44 4.301}
{0 CHEMBL152712,1 6.78,2 37.7,3 50.8,4 1,5 1.134,6 0.631,7 0.595,8 413.57,9 4.9,10 6,11 61,13 10,14 32,16 63,17 23,20 11,21 12,22 4,24 31,25 7,28 3,29 4,32 30,35 6.6,36 0.127,37 8,38 39,39 60.985,40 69.145,41 38.495,42 36.299,44 4.495}
{0 CHEMBL152753,1 7.048,2 39.2,3 49,4 1.007,5 1.128,6 0.636,7 0.606,8 359.46,9 2,10 6,11 51,13 10,14 27,16 52,17 20,20 11,21 9,22 4,24 25,25 6,28 1,29 5,32 26,35 9.8,36 0.135,37 7,38 34,39 51.342,40 57.528,41 32.415,42 30.917,44 4.602}
{0 CHEMBL152768,1 7.115,2 42.1,3 47.4,4 0.998,5 1.125,6 0.658,7 0.623,8 540.72,9 5.3,10 12,11 76,13 18,14 44,16 80,17 32,20 20,21 12,22 6,24 36,25 8,28 4,29 4,32 40,35 5.3,36 0.125,37 10,38 56,39 75.854,40 85.474,41 50.023,42 47.374,44 5}
{0 CHEMBL152787,1 6.248,2 34.9,3 55,4 0.992,5 1.14,6 0.613,7 0.568,8 681.04,9 5.5,10 6,11 109,13 11,14 52,16 112,17 38,20 12,21 26,22 5,24 60,25 11,28 6,29 5,32 49,35 4.6,36 0.179,37 20,38 60,39 108.105,40 124.247,41 66.864,42 61.926,44 6.097}
{0 CHEMBL152794,1 6.745,2 39.6,3 50.9,4 0.998,5 1.127,6 0.636,7 0.599,8 357.49,9 1.9,10 6,11 53,13 10,14 27,16 54,17 21,20 11,21 10,22 4,24 27,25 5,28 1,29 4,32 26,35 7.5,36 0.148,37 8,38 34,39 52.898,40 59.734,41 33.722,42 31.729,44 4.301}
{0 CHEMBL152807,1 6.883,2 41.1,3 49.5,4 0.997,5 1.125,6 0.647,7 0.61,8 653.89,9 3.2,10 12,11 95,13 20,14 51,16 98,17 39,20 22,21 17,22 8,24 47,25 9,28 3,29 6,32 48,35 6.3,36 0.194,37 19,38 65,39 94.708,40 106.886,41 61.495,42 57.943,44 4.796}
{0 CHEMBL152810,1 6.955,2 41.3,3 48.9,4 0.998,5 1.125,6 0.649,7 0.613,8 639.86,9 3.3,10 12,11 92,13 20,14 50,16 95,17 38,20 22,21 16,22 8,24 45,25 9,28 3,29 6,32 47,35 6.5,36 0.189,37 18,38 64,39 91.825,40 103.471,41 59.733,42 56.416,44 4.58}
{0 CHEMBL152822,1 7.866,2 42.9,3 42.9,4 1.022,5 1.119,6 0.657,7 0.644,8 330.36,10 6,11 42,13 11,14 25,16 43,17 18,20 12,21 6,22 5,24 18,25 6,29 6,32 24,35 14.3,36 0.186,37 8,38 33,39 42.916,40 46.993,41 27.58,42 27.03,44 4.301}
{0 CHEMBL152868,1 8.142,2 46.7,3 40,4 1.02,5 1.111,6 0.68,7 0.667,8 244.26,10 6,11 30,13 10,14 19,16 31,17 14,20 11,21 3,22 4,24 12,25 4,29 4,32 18,35 13.3,36 0.097,37 3,38 26,39 30.611,40 33.329,41 20.386,42 20.02,44 4.301}
{0 CHEMBL152874,1 6.729,2 38.6,3 50.9,4 0.996,5 1.132,6 0.636,7 0.597,8 383.54,9 5.3,10 6,11 57,13 10,14 30,16 59,17 22,20 11,21 11,22 4,24 29,25 6,28 3,29 3,32 28,35 5.3,36 0.119,37 7,38 37,39 56.774,40 64.521,41 36.279,42 34.057,44 4.42}
{0 CHEMBL152954,1 6.34,2 35,3 54.4,4 0.994,5 1.14,6 0.615,7 0.572,8 652.98,9 5.8,10 6,11 103,13 11,14 50,16 106,17 36,20 12,21 24,22 5,24 56,25 11,28 6,29 5,32 47,35 4.9,36 0.17,37 18,38 58,39 102.337,40 117.417,41 63.342,42 58.872,44 5.208}
{0 CHEMBL152955,1 6.442,2 35.1,3 53.6,4 0.996,5 1.14,6 0.617,7 0.575,8 624.92,9 6.2,10 6,11 97,13 11,14 48,16 100,17 34,20 12,21 22,22 5,24 52,25 11,28 6,29 5,32 45,35 5.2,36 0.16,37 16,38 56,39 96.57,40 110.586,41 59.819,42 55.819,44 4.959}
{0 CHEMBL153039,1 6.698,2 37.8,3 51.1,4 0.995,5 1.135,6 0.634,7 0.595,8 301.43,9 6.7,10 6,11 45,13 9,14 23,16 46,17 17,20 10,21 7,22 3,24 23,25 5,28 3,29 2,32 22,35 4.4,36 0.174,37 8,38 29,39 44.796,40 51.066,41 28.54,42 26.762,44 4.921}
{0 CHEMBL153191,1 7.168,2 40.9,3 47.7,4 1.006,5 1.125,6 0.646,7 0.617,8 315.4,9 2.3,10 6,11 44,13 10,14 24,16 45,17 18,20 11,21 7,22 4,24 21,25 5,28 1,29 4,32 23,35 9.1,36 0.111,37 5,38 31,39 44.247,40 49.488,41 28.438,42 27.149,44 4.301}
{0 CHEMBL153197,1 7.009,2 40.4,3 48.9,4 1.003,5 1.126,6 0.643,7 0.61,8 329.43,9 2.1,10 6,11 47,13 10,14 25,16 48,17 19,20 11,21 8,22 4,24 23,25 5,28 1,29 4,32 24,35 8.5,36 0.125,37 6,38 32,39 47.131,40 52.903,41 30.199,42 28.675,44 4.301}
{0 CHEMBL153287,1 6.869,2 40,3 50,4 1,5 1.126,6 0.639,7 0.604,8 343.46,9 2,10 6,11 50,13 10,14 26,16 51,17 20,20 11,21 9,22 4,24 25,25 5,28 1,29 4,32 25,35 8,36 0.137,37 7,38 33,39 50.014,40 56.318,41 31.961,42 30.202,44 4.602}
{0 CHEMBL153337,1 6.315,2 35.6,3 54.2,4 0.99,5 1.139,6 0.62,7 0.574,8 372.57,9 6.8,10 6,11 59,13 9,14 28,16 60,17 21,20 10,21 11,22 3,24 32,25 6,28 4,29 2,32 27,35 3.4,36 0.217,37 13,38 34,39 58.432,40 67.225,41 36.591,42 33.89,44 4.553}
{0 CHEMBL153356,1 7.129,2 40,3 48,4 1.005,5 1.128,6 0.644,7 0.614,8 356.46,9 4,10 6,11 50,13 10,14 28,16 52,17 20,20 11,21 9,22 4,24 24,25 6,28 2,29 4,32 26,35 8,36 0.077,37 4,38 35,39 50.232,40 56.401,41 32.205,42 30.697,44 4.377}
{0 CHEMBL153399,1 6.515,2 36.8,3 52.9,4 0.995,5 1.135,6 0.624,7 0.583,8 566.82,9 4.6,10 6,11 87,13 11,14 44,16 90,17 32,20 12,21 20,22 5,24 46,25 9,28 4,29 5,32 41,35 5.7,36 0.133,37 12,38 52,39 86.599,40 98.759,41 54.285,42 50.722,44 5.538}
{0 CHEMBL153447,1 8.397,2 44.4,3 38.9,4 1.032,5 1.116,6 0.668,7 0.666,8 302.3,10 6,11 36,13 11,14 23,16 37,17 16,20 12,21 4,22 5,24 14,25 6,29 6,32 22,35 16.7,36 0.162,37 6,38 31,39 37.149,40 40.163,41 24.057,42 23.976,44 4.301}
{0 CHEMBL153450,1 6.869,2 38,3 50,4 1,5 1.134,6 0.635,7 0.6,8 343.47,9 6,10 6,11 50,13 9,14 27,16 52,17 19,20 10,21 9,22 3,24 25,25 6,28 3,29 3,32 25,35 6,36 0.096,37 5,38 33,39 50.007,40 56.69,41 31.756,42 30.003,44 4.244}
{0 CHEMBL153514,1 7.509,2 41.5,3 45.1,4 1.012,5 1.125,6 0.654,7 0.631,8 615.74,9 3.7,10 12,11 82,13 20,14 48,16 85,17 34,20 22,21 12,22 8,24 37,25 11,28 3,29 8,32 45,35 9.8,36 0.165,37 14,38 62,39 82.945,40 92.229,41 53.597,42 51.738,44 3.638}
{0 CHEMBL153554,1 6.816,2 40.8,3 50,4 0.996,5 1.126,6 0.645,7 0.607,8 667.92,9 3.1,10 12,11 98,13 20,14 52,16 101,17 40,20 22,21 18,22 8,24 49,25 9,28 3,29 6,32 49,35 6.1,36 0.198,37 20,38 66,39 97.592,40 110.301,41 63.256,42 59.469,44 5.563}
{0 CHEMBL153574,1 7.129,2 40,3 48,4 1.005,5 1.128,6 0.644,7 0.614,8 712.92,9 4,10 12,11 100,13 20,14 56,16 104,17 40,20 22,21 18,22 8,24 48,25 12,28 4,29 8,32 52,35 8,36 0.154,37 16,38 70,39 100.465,40 112.803,41 64.41,42 61.394,44 4.284}
{0 CHEMBL153583,1 7.286,2 40.4,3 46.8,4 1.007,5 1.127,6 0.648,7 0.621,8 684.86,9 4.3,10 12,11 94,13 20,14 54,16 98,17 38,20 22,21 16,22 8,24 44,25 12,28 4,29 8,32 50,35 8.5,36 0.143,37 14,38 68,39 94.698,40 105.972,41 60.887,42 58.34,44 4.108}
{0 CHEMBL153789,1 6.567,2 38.5,3 51.9,4 0.992,5 1.133,6 0.636,7 0.593,8 341.5,9 5.8,10 6,11 52,13 9,14 27,16 54,17 20,20 10,21 10,22 3,24 27,25 5,28 3,29 2,32 25,35 3.8,36 0.093,37 5,38 33,39 51.563,40 58.896,41 33.063,42 30.815,44 4.244}
{0 CHEMBL153790,1 6.851,2 40.7,3 51.9,4 0.984,5 1.127,6 0.662,7 0.606,8 369.98,9 5.6,10 16,11 54,13 16,14 28,16 56,17 22,18 1,20 13,21 9,24 28,25 4,26 1,28 3,32 26,34 1,36 0.143,37 8,38 36,39 53.116,40 60.837,41 35.773,42 32.74,43 1.9,44 5}
{0 CHEMBL153804,1 7.032,2 41.6,3 48.3,4 0.999,5 1.124,6 0.651,7 0.617,8 625.83,9 3.4,10 12,11 89,13 20,14 49,16 92,17 37,20 22,21 15,22 8,24 43,25 9,28 3,29 6,32 46,35 6.7,36 0.185,37 17,38 63,39 88.941,40 100.055,41 57.972,42 54.889,44 4.131}
{0 CHEMBL154224,1 7.364,2 40,3 46.7,4 1.013,5 1.127,6 0.642,7 0.619,8 331.4,9 2.2,10 6,11 45,13 10,14 25,16 46,17 18,20 11,21 7,22 4,24 21,25 6,28 1,29 5,32 24,35 11.1,36 0.109,37 5,38 32,39 45.574,40 50.697,41 28.892,42 27.863,44 4.602}
{0 CHEMBL155143,1 7.297,2 42.5,3 46.3,4 1.004,5 1.123,6 0.659,7 0.629,8 583.74,9 3.8,10 12,11 80,13 20,14 46,16 83,17 34,20 22,21 12,22 8,24 37,25 9,28 3,29 6,32 43,35 7.5,36 0.169,37 14,38 60,39 80.29,40 89.81,41 52.688,42 50.309,44 4.328}
{0 CHEMBL155515,1 6.999,2 40,3 49,4 1.002,5 1.127,6 0.642,7 0.609,8 699.92,9 3,10 12,11 100,13 20,14 54,16 103,17 40,20 22,21 18,22 8,24 49,25 11,28 3,29 8,32 51,35 8,36 0.194,37 20,38 68,39 100.247,40 112.72,41 64.165,42 60.899,44 4.553}
{0 CHEMBL155801,1 6.121,2 37.5,3 55.6,4 0.986,5 1.132,6 0.623,7 0.572,8 440.69,9 2.8,10 6,11 72,13 10,14 33,16 73,17 27,20 11,21 16,22 4,24 40,25 5,28 2,29 3,32 32,35 4.2,36 0.205,37 15,38 40,39 70.974,40 81.514,41 44.841,42 41.196,44 5.959}
{0 CHEMBL1566180,1 7.077,2 41.3,3 50,4 0.983,5 1.121,6 0.68,7 0.62,8 325.52,9 6.5,10 12,11 46,13 13,14 25,16 48,17 19,20 13,21 6,22 1,24 23,25 4,26 1,28 3,31 1,32 23,36 0.083,37 4,38 32,39 45.218,40 51.567,41 31.279,42 28.519,44 4.481}
{0 CHEMBL159006,1 5.877,2 34.7,3 57.9,4 0.985,5 1.138,6 0.607,7 0.554,8 711.16,9 3.3,10 6,11 121,13 11,14 52,16 122,17 42,20 12,21 30,22 5,24 70,25 9,28 4,29 5,32 51,35 4.1,36 0.246,37 30,38 60,39 119.203,40 137.742,41 73.422,42 67.044,44 6.222}
{0 CHEMBL160637,1 6.256,2 37,3 54.8,4 0.99,5 1.133,6 0.62,7 0.574,8 456.69,9 2.7,10 6,11 73,13 10,14 34,16 74,17 27,20 11,21 16,22 4,24 40,25 6,28 2,29 4,32 33,35 5.5,36 0.203,37 15,38 41,39 72.301,40 82.723,41 45.296,42 41.911,44 6.523}
{0 CHEMBL1652415,1 7.256,2 40,3 48.9,4 0.987,5 1.126,6 0.678,7 0.623,8 326.51,9 8.9,10 12,11 45,13 13,14 25,16 47,17 18,20 12,21 6,22 1,24 22,25 5,26 1,28 4,31 1,32 23,36 0.085,37 4,38 32,39 44.436,40 50.65,41 30.523,42 28.014,44 5.611}
{0 CHEMBL1652416,1 6.938,2 35.7,3 50,4 1.006,5 1.14,6 0.625,7 0.594,8 194.26,9 7.1,11 28,13 2,14 15,16 29,17 10,19 1,20 1,21 8,22 1,24 14,25 4,28 2,29 2,32 14,33 1,35 7.1,36 0.069,37 2,38 18,39 28.16,40 31.907,41 17.489,42 16.633,44 4.284}
{0 CHEMBL1652417,1 7.484,2 52.6,3 42.1,4 0.984,5 1.103,6 0.72,7 0.677,8 284.38,9 5.3,10 12,11 38,13 16,14 25,16 41,17 20,20 19,21 1,22 4,24 16,25 2,28 2,32 22,36 0.024,37 1,38 35,39 37.389,40 41.903,41 27.341,42 25.73,44 4.638}
{0 CHEMBL1652418,1 6.478,2 35.6,3 55.6,4 0.98,5 1.133,6 0.645,7 0.579,8 291.51,9 6.7,10 6,11 45,13 7,14 21,16 46,17 16,20 7,21 9,22 1,24 25,25 4,26 1,28 3,31 1,32 20,36 0.109,37 5,38 25,39 44.101,40 50.982,41 29.04,42 26.046,44 4}
{0 CHEMBL1652419,1 6.899,2 40,3 48.9,4 0.993,5 1.132,6 0.652,7 0.612,8 310.44,9 8.9,10 12,11 45,13 13,14 25,16 47,17 18,20 12,21 6,22 1,24 22,25 5,28 4,29 1,32 23,35 2.2,36 0.085,37 4,38 32,39 44.687,40 50.939,41 29.33,42 27.542,44 4}
{0 CHEMBL1652420,1 6.959,2 34.2,3 52.6,4 0.988,5 1.138,6 0.652,7 0.592,8 264.44,9 10.5,10 6,11 38,13 7,14 19,16 39,17 13,20 6,21 7,22 1,24 20,25 5,26 1,28 4,31 1,32 18,36 0.077,37 3,38 23,39 37.552,40 43.235,41 24.762,42 22.487,44 4}
{0 CHEMBL1652421,1 8.458,2 38.9,3 44.4,4 0.996,5 1.12,6 0.719,7 0.656,8 304.48,9 11.1,10 12,11 36,13 12,14 22,16 38,17 14,20 8,21 6,24 16,25 6,26 2,28 4,31 2,32 20,36 0.079,37 3,38 28,39 35.862,40 40.324,41 25.887,42 23.621,44 4}
{0 CHEMBL1652422,1 6.727,2 39.1,3 50,4 0.988,5 1.135,6 0.65,7 0.605,8 309.46,9 10.9,10 11,11 46,13 13,14 25,16 48,17 18,20 10,21 8,22 2,24 23,25 5,28 5,32 23,36 0.063,37 3,38 32.5,39 45.461,40 52.228,41 29.881,42 27.848,44 4.495}
{0 CHEMBL1652423,1 6.925,2 38.3,3 48.9,4 0.996,5 1.137,6 0.645,7 0.608,8 325.46,9 10.6,10 11,11 47,13 13,14 26,16 49,17 18,20 10,21 8,22 2,24 23,25 6,28 5,29 1,32 24,35 2.1,36 0.082,37 4,38 33.5,39 46.789,40 53.438,41 30.336,42 28.563,44 4.553}
{0 CHEMBL1652424,1 7.367,2 40.5,3 45.2,4 1.001,5 1.134,6 0.662,7 0.631,8 309.41,9 11.9,10 17,11 42,13 17,14 25,16 44,17 17,20 12,21 5,24 19,25 6,28 5,29 1,32 23,35 2.4,36 0.045,37 2,38 33.5,39 42.022,40 47.607,41 27.813,42 26.509,44 4}
{0 CHEMBL1652425,1 7.156,2 41.5,3 46.3,4 0.993,5 1.132,6 0.667,7 0.629,8 293.41,9 12.2,10 17,11 41,13 17,14 24,16 43,17 17,20 12,21 5,24 19,25 5,28 5,32 22,36 0.047,37 2,38 32.5,39 40.694,40 46.398,41 27.358,42 25.795,44 4}
{0 CHEMBL1652426,1 7.352,2 42.1,3 44.7,4 0.995,5 1.131,6 0.674,7 0.639,8 279.38,9 13.2,10 17,11 38,13 17,14 23,16 40,17 16,20 12,21 4,24 17,25 5,28 5,32 21,36 0.05,37 2,38 31.5,39 37.811,40 42.983,41 25.597,42 24.268,44 4}
{0 CHEMBL1652427,1 7.166,2 37.5,3 46.9,4 0.998,5 1.143,6 0.651,7 0.617,8 229.32,9 15.6,10 11,11 32,13 12,14 18,16 33,17 12,20 9,21 3,22 1,24 15,25 5,28 5,32 17,36 0.03,37 1,38 24.5,39 31.927,40 36.568,41 20.836,42 19.741,44 4}
{0 CHEMBL17182,1 7.984,2 37,3 49.4,4 1,5 1.13,6 0.661,7 0.613,8 646.72,9 6.2,10 12,11 81,13 15,14 44,15 1,16 84,17 30,20 15,21 15,22 3,24 40,25 11,26 2,28 5,29 4,31 1,32 41,34 1,35 4.9,36 0.155,37 13,38 53,39 81.029,40 91.564,41 53.552,42 49.661,43 1.2,44 4.222}
{0 CHEMBL17190,1 8.229,2 40.6,3 46.9,4 0.996,5 1.121,6 0.69,7 0.638,8 789.94,9 6.3,10 24,11 96,13 27,14 55,15 1,16 100,17 39,20 27,21 12,22 3,24 45,25 12,26 3,28 6,29 3,31 2,32 51,34 1,35 3.1,36 0.16,37 16,38 70,39 95.647,40 107.604,41 66.273,42 61.208,43 1,44 4.796}
{0 CHEMBL17208,1 8.541,2 40.6,3 44.8,4 1.004,5 1.121,6 0.692,7 0.647,8 819.92,9 6.3,10 24,11 96,13 29,14 57,15 1,16 100,17 39,20 27,21 12,22 5,24 43,25 14,26 3,28 6,29 5,31 2,32 53,34 1,35 5.2,36 0.17,37 17,38 74,39 96.418,40 107.607,41 66.421,42 62.111,43 1,44 4.222}
{0 CHEMBL1727832,1 7.172,2 44.2,3 46.5,4 0.996,5 1.12,6 0.669,7 0.633,8 308.41,9 4.7,10 12,11 43,13 14,14 25,16 45,17 19,20 14,21 5,22 2,24 20,25 4,28 2,29 2,32 23,35 4.7,36 0.089,37 4,38 33,39 42.811,40 48.152,41 28.773,42 27.214,44 4.42}
{0 CHEMBL17312,1 7.562,2 38.3,3 51.1,4 0.992,5 1.128,6 0.661,7 0.607,8 710.86,9 5.3,10 12,11 94,13 15,14 51,15 1,16 99,17 36,20 15,21 21,22 3,24 48,25 10,26 2,28 5,29 3,31 1,32 46,34 1,35 3.2,36 0.131,37 13,38 60,39 93.236,40 106.016,41 62.143,42 57.053,43 1.1,44 4.222}
{0 CHEMBL17546,1 6.844,2 35.7,3 55.7,4 0.985,5 1.133,6 0.637,7 0.576,8 787.07,9 4.3,10 12,11 115,13 15,14 53,15 1,16 117,17 41,20 15,21 26,22 3,24 64,25 10,26 2,28 5,29 3,31 1,32 51,34 1,35 2.6,36 0.222,37 26,38 62,39 113.304,40 130.337,41 73.234,42 66.268,43 0.9,44 4.222}
{0 CHEMBL17620,1 9.238,2 41.8,3 44,4 1.008,5 1.118,6 0.699,7 0.655,8 840.69,9 4.4,10 18,11 91,13 24,14 55,15 2,16 95,17 38,20 25,21 13,22 6,24 40,25 13,26 3,28 4,29 6,31 1,32 51,34 2,35 6.6,36 0.168,37 16,38 70,39 91.694,40 101.742,41 63.569,42 59.621,43 2.2,44 4.387}
{0 CHEMBL17665,1 7.407,2 40.6,3 47.9,4 0.994,5 1.123,6 0.676,7 0.627,8 711.05,9 6.3,10 24,11 96,13 27,14 54,16 100,17 39,20 27,21 12,22 3,24 46,25 11,26 2,28 6,29 3,31 2,32 50,35 3.1,36 0.16,37 16,38 69,39 95.418,40 107.762,41 64.921,42 60.183,44 5.745}
{0 CHEMBL17706,1 8.159,2 40,3 47.5,4 0.998,5 1.124,6 0.679,7 0.63,8 652.72,9 6.3,10 18,11 80,13 21,14 45,15 1,16 83,17 32,20 21,21 11,22 3,24 38,25 10,26 2,28 5,29 3,31 1,32 42,34 1,35 3.8,36 0.157,37 13,38 57,39 79.818,40 89.94,41 54.336,42 50.419,43 1.3,44 4.456}
{0 CHEMBL17800,1 8.033,2 39.8,3 48.2,4 0.996,5 1.125,6 0.676,7 0.626,8 666.75,9 6,10 18,11 83,13 21,14 46,15 1,16 86,17 33,20 21,21 12,22 3,24 40,25 10,26 2,28 5,29 3,31 1,32 43,34 1,35 3.6,36 0.163,37 14,38 58,39 82.701,40 93.355,41 56.097,42 51.946,43 1.2,44 4.699}
{0 CHEMBL1794917,1 6.55,2 42.9,3 50.8,4 0.981,5 1.124,6 0.662,7 0.61,8 412.63,9 6.3,10 12,11 63,13 16,14 32,16 64,17 27,19 4,20 14,21 9,22 2,24 32,25 4,28 4,32 31,33 2,36 0.188,37 12,38 44,39 61.778,40 70.806,41 41.682,42 38.461,44 5.222}
{0 CHEMBL17968,1 7.509,2 36.4,3 52.3,4 0.993,5 1.132,6 0.652,7 0.597,8 660.8,9 5.7,10 12,11 88,13 15,14 44,15 1,16 90,17 32,20 15,21 17,22 3,24 46,25 10,26 2,28 5,29 3,31 1,32 42,34 1,35 3.4,36 0.189,37 17,38 53,39 87.352,40 99.601,41 57.381,42 52.526,43 1.1,44 4.638}
{0 CHEMBL179743,1 7.956,2 42.9,3 41.1,4 1.014,5 1.126,6 0.673,7 0.655,8 445.52,9 8.9,10 17,11 56,13 20,14 37,16 60,17 24,20 18,21 6,22 3,24 23,25 9,28 5,29 4,32 33,35 7.1,36 0.067,37 4,38 48.5,39 56.771,40 63.066,41 37.699,42 36.707,44 4.658}
{0 CHEMBL18070,1 8.275,2 39.2,3 46.8,4 1,5 1.127,6 0.678,7 0.632,8 653.71,9 7.6,10 18,11 79,13 21,14 45,15 1,16 82,17 31,20 20,21 11,22 3,24 37,25 11,26 2,28 6,29 3,31 1,32 42,34 1,35 3.8,36 0.159,37 13,38 57,39 79.036,40 89.023,41 53.58,42 49.914,43 1.3,44 4.222}
{0 CHEMBL1824847,1 7.584,2 46.3,3 42.6,4 0.996,5 1.119,6 0.691,7 0.659,8 409.53,9 9.3,10 26,11 54,13 27,14 35,16 58,17 25,20 21,21 4,22 1,24 23,25 6,28 5,29 1,32 31,35 1.9,36 0.103,37 6,38 49,39 53.789,40 60.438,41 37.336,42 35.563,44 4.883}
{0 CHEMBL1824848,1 7.113,2 42.4,3 49.2,4 0.986,5 1.119,6 0.678,7 0.624,8 419.64,9 5.1,10 17,11 59,13 18,14 33,16 62,17 25,20 16,21 9,22 1,24 29,25 5,26 1,28 3,29 1,31 1,32 30,35 1.7,36 0.113,37 7,38 42.5,39 58.196,40 66.022,41 40.017,42 36.814,44 5.244}
{0 CHEMBL1824849,1 8.287,2 43.1,3 43.1,4 0.997,5 1.113,6 0.718,7 0.665,8 422.62,9 7.8,10 16,11 51,13 18,14 32,16 54,17 22,19 1,20 14,21 7,22 1,24 22,25 7,26 2,28 4,29 1,31 2,32 29,33 1,35 2,36 0.111,37 6,38 43,39 50.84,40 56.779,41 36.625,42 33.916,44 4.883}
{0 CHEMBL1824850,1 9.533,2 44.4,3 37.8,4 1.009,5 1.109,6 0.755,7 0.704,8 429,9 8.9,10 16,11 45,13 18,14 31,16 48,17 20,18 1,19 1,20 14,21 5,22 1,24 17,25 8,26 3,28 4,29 1,31 2,32 28,33 1,34 1,35 2.2,36 0.104,37 5,38 42,39 45.396,40 49.893,41 33.96,42 31.69,43 2.2,44 5.032}
{0 CHEMBL1824851,1 7.413,2 46.2,3 44.2,4 0.996,5 1.117,6 0.683,7 0.649,8 385.5,9 5.8,10 22,11 52,13 23,14 32,16 55,17 24,20 20,21 4,22 1,24 23,25 5,28 3,29 2,32 29,35 3.8,36 0.109,37 6,38 44,39 51.796,40 58.066,41 35.54,42 33.762,44 4.57}
{0 CHEMBL1824852,1 9.472,2 41.7,3 37.5,4 1.01,5 1.114,6 0.75,7 0.699,8 454.65,9 12.5,10 19,11 48,13 21,14 34,16 52,17 20,19 1,20 12,21 7,22 1,24 18,25 10,26 3,28 6,29 1,31 3,32 30,33 1,35 2.1,36 0.077,37 4,38 46.5,39 48.469,40 53.45,41 36,42 33.565,44 4.928}
{0 CHEMBL1824853,1 7.776,2 38.2,3 47.1,4 1.004,5 1.125,6 0.673,7 0.628,8 528.76,9 5.9,10 17,11 68,13 20,14 39,16 71,17 26,20 16,21 10,22 3,24 32,25 10,26 2,28 4,29 4,31 2,32 36,35 5.9,36 0.169,37 12,38 50.5,39 68.24,40 76.484,41 45.796,42 42.694,44 4.955}
{0 CHEMBL1824854,1 8.547,2 42.6,3 42.6,4 1.005,5 1.115,6 0.712,7 0.666,8 581.21,9 5.9,10 23,11 68,13 26,14 43,16 72,17 29,18 1,20 22,21 7,22 3,24 29,25 10,26 3,28 4,29 3,31 2,32 39,34 1,35 4.4,36 0.139,37 10,38 57.5,39 68.352,40 75.803,41 48.438,42 45.28,43 1.5,44 4.652}
{0 CHEMBL1836554,1 9.332,2 45,3 42.5,4 1.004,5 1.114,6 0.709,7 0.668,8 373.27,9 5,10 12,11 40,13 14,14 25,15 1,16 42,17 18,20 14,21 4,22 2,24 17,25 5,26 1,28 2,29 2,32 23,34 1,35 5,36 0.095,37 4,38 33,39 40.156,40 44.579,41 28.364,42 26.712,43 2.5,44 4.721}
{0 CHEMBL188765,1 6.689,2 41.7,3 50.5,4 0.99,5 1.124,6 0.652,7 0.608,8 688.99,9 3.9,10 24,11 103,13 26,14 56,16 108,17 43,20 26,21 17,22 2,24 52,25 8,28 4,29 4,32 51,35 3.9,36 0.139,37 15,38 70,39 101.923,40 115.796,41 67.114,42 62.588,44 4.796}
{0 CHEMBL189096,1 6.77,2 41.3,3 50,4 0.992,5 1.126,6 0.65,7 0.609,8 622.88,9 4.3,10 24,11 92,13 26,14 49,16 95,17 38,20 26,21 12,22 2,24 46,25 8,28 4,29 4,32 46,35 4.3,36 0.211,37 20,38 63,39 91.272,40 103.55,41 59.83,42 56.008,44 5.301}
{0 CHEMBL1908311,1 7.167,2 44.4,3 48.9,4 0.98,5 1.113,6 0.695,7 0.633,8 322.51,9 4.4,10 12,11 45,13 12,14 27,16 49,17 20,20 12,21 8,24 22,25 3,26 1,28 2,31 1,32 23,36 0.041,37 2,38 33,39 44.116,40 50.069,41 31.273,42 28.498,44 4.662}
{0 CHEMBL197131,1 8.847,2 50,3 40,4 0.997,5 1.097,6 0.751,7 0.699,8 353.89,9 2.5,10 18,11 40,13 19,14 26,16 42,17 20,18 1,20 19,21 1,22 1,24 16,25 4,26 2,28 1,29 1,31 1,32 24,34 1,35 2.5,36 0.119,37 5,38 36,39 39.898,40 43.893,41 30.057,42 27.965,43 2.5,44 4.522}
{0 CHEMBL197230,1 9.115,2 45.1,3 43.1,4 0.998,5 1.108,6 0.745,7 0.682,8 464.89,9 3.9,10 18,11 51,13 18,14 32,16 54,17 23,18 3,20 18,21 5,24 22,25 6,26 4,28 2,31 1,32 29,34 3,36 0.093,37 5,38 41,39 50.913,40 56.523,41 37.989,42 34.771,43 5.9,44 6.551}
{0 CHEMBL198590,1 9.185,2 51.4,3 37.8,4 1,5 1.094,6 0.765,7 0.715,8 339.86,9 2.7,10 18,11 37,13 19,14 25,16 39,17 19,18 1,20 19,22 1,24 14,25 4,26 2,28 1,29 1,31 1,32 23,34 1,35 2.7,36 0.103,37 4,38 35,39 37.014,40 40.478,41 28.296,42 26.438,43 2.7,44 4.458}
{0 CHEMBL199020,1 5.351,2 34.1,3 61.4,4 0.972,5 1.141,6 0.603,7 0.537,8 235.44,9 4.5,10 6,11 44,13 6,14 17,16 44,17 15,20 6,21 9,24 27,25 2,28 2,32 17,36 0.114,37 5,38 20,39 42.749,40 50.187,41 26.529,42 23.628,44 6.523}
{0 CHEMBL199067,1 7.51,2 43.4,3 49.1,4 0.984,5 1.114,6 0.699,7 0.635,8 398.03,9 3.8,10 18,11 53,13 18,14 29,16 55,17 23,18 1,20 18,21 5,24 26,25 4,26 2,28 2,31 1,32 27,34 1,36 0.145,37 8,38 38,39 52.149,40 59.051,41 37.034,42 33.642,43 1.9,44 4.848}
{0 CHEMBL2029013,1 7.644,2 38.6,3 54.5,4 0.979,5 1.128,6 0.662,7 0.594,8 336.33,9 4.5,10 6,11 44,13 6,14 23,15 1,16 47,17 17,20 6,21 11,24 24,25 3,26 1,28 2,32 20,34 1,36 0.043,37 2,38 26,39 43.094,40 49.613,41 29.12,42 26.126,43 2.3,44 4}
{0 CHEMBL206916,1 5.371,2 29.9,3 61.9,4 0.977,5 1.152,6 0.586,7 0.524,8 520.97,9 8.2,11 97,13 2,14 38,16 98,17 29,20 2,21 27,22 2,24 60,25 8,28 8,32 37,36 0.224,37 22,38 40,39 94.788,40 111.782,41 56.842,42 50.868,44 4.753}
{0 CHEMBL207163,1 6.394,2 39.4,3 52.5,4 0.982,5 1.133,6 0.644,7 0.594,8 632.99,9 8.1,10 24,11 99,13 26,14 50,16 102,17 39,20 26,21 13,22 2,24 52,25 8,28 8,32 47,36 0.235,37 24,38 64,39 97.254,40 112.121,41 63.796,42 58.761,44 5.444}
{0 CHEMBL207396,1 6.48,2 37.4,3 52.2,4 0.986,5 1.139,6 0.638,7 0.59,8 745.15,9 10.4,10 24,11 115,13 28,14 58,16 118,17 43,20 28,21 15,22 4,24 60,25 12,28 12,32 55,36 0.254,37 30,38 74,39 113.428,40 130.944,41 73.342,42 67.9,44 5.434}
{0 CHEMBL208290,1 6.208,2 38.7,3 54.1,4 0.98,5 1.133,6 0.638,7 0.584,8 689.11,9 7.2,10 24,11 111,13 26,14 54,16 114,17 43,20 26,21 17,22 2,24 60,25 8,28 8,32 51,36 0.246,37 28,38 68,39 108.788,40 125.782,41 70.842,42 64.868,44 5.326}
{0 CHEMBL209039,1 6.39,2 37.2,3 52.9,4 0.985,5 1.139,6 0.635,7 0.586,8 773.21,9 9.9,10 24,11 121,13 28,14 60,16 124,17 45,20 28,21 17,22 4,24 64,25 12,28 12,32 57,36 0.258,37 32,38 76,39 119.195,40 137.775,41 76.865,42 70.954,44 5.78}
{0 CHEMBL209834,1 6.579,2 37.6,3 51.4,4 0.988,5 1.139,6 0.641,7 0.595,8 717.09,9 11,10 24,11 109,13 28,14 56,16 112,17 41,20 28,21 13,22 4,24 56,25 12,28 12,32 53,36 0.25,37 28,38 72,39 107.661,40 124.114,41 69.819,42 64.846,44 5.381}
{0 CHEMBL210370,1 6.343,2 39.2,3 52.9,4 0.982,5 1.133,6 0.643,7 0.591,8 647.02,9 7.8,10 24,11 102,13 26,14 51,16 105,17 40,20 26,21 14,22 2,24 54,25 8,28 8,32 48,36 0.238,37 25,38 65,39 100.137,40 115.536,41 65.558,42 60.288,44 5.341}
{0 CHEMBL210371,1 6.528,2 37.5,3 51.8,4 0.987,5 1.139,6 0.639,7 0.593,8 731.12,9 10.7,10 24,11 112,13 28,14 57,16 115,17 42,20 28,21 14,22 4,24 58,25 12,28 12,32 54,36 0.252,37 29,38 73,39 110.544,40 127.529,41 71.581,42 66.373,44 5.562}
{0 CHEMBL224976,1 8.757,2 50,3 40.9,4 1.003,5 1.101,6 0.733,7 0.69,8 192.65,10 6,11 22,13 9,14 13,16 22,17 11,18 1,20 11,22 3,24 9,25 2,26 1,29 1,32 13,34 1,35 4.5,36 0.136,37 3,38 19,39 22.069,40 24.229,41 16.119,42 15.176,43 4.5,44 5.398}
{0 CHEMBL239370,1 8.126,2 42.9,3 44.6,4 1,5 1.117,6 0.7,7 0.653,8 455.04,9 5.4,10 18,11 56,13 20,14 34,16 59,17 24,18 1,20 18,21 6,22 2,24 25,25 7,26 2,28 3,29 2,31 1,32 31,34 1,35 3.6,36 0.119,37 7,38 45,39 56.022,40 62.553,41 39.188,42 36.567,43 1.8,44 4.747}
{0 CHEMBL247772,1 6.628,2 40,3 50.9,4 0.988,5 1.131,6 0.648,7 0.602,8 364.54,9 7.3,10 12,11 55,13 13,14 30,16 58,17 22,20 13,21 9,22 1,24 28,25 5,28 4,29 1,32 27,35 1.8,36 0.121,37 7,38 37,39 54.338,40 62.185,41 35.614,42 33.122,44 5.046}
{0 CHEMBL273318,1 8.37,2 42.3,3 44.3,4 1.004,5 1.12,6 0.688,7 0.649,8 811.87,9 6.2,10 24,11 97,13 29,14 59,15 1,16 102,17 41,20 29,21 12,22 5,24 43,25 13,26 2,28 6,29 5,31 1,32 54,34 1,35 5.2,36 0.137,37 14,38 76,39 97.341,40 108.687,41 66.773,42 62.924,43 1,44 4.222}
{0 CHEMBL276829,1 8.009,2 42.4,3 45.8,4 0.999,5 1.121,6 0.683,7 0.641,8 945.08,9 5.9,10 30,11 118,13 35,14 70,15 1,16 124,17 50,20 35,21 15,22 5,24 54,25 14,26 2,28 7,29 5,31 1,32 64,34 1,35 4.2,36 0.145,37 18,38 90,39 117.861,40 132.262,41 80.586,42 75.579,43 0.8,44 5.481}
{0 CHEMBL277840,1 8.055,2 44.4,3 42.6,4 1.004,5 1.121,6 0.693,7 0.659,8 434.96,9 7.4,10 22,11 54,13 23,14 34,16 57,17 24,18 1,20 20,21 4,22 1,24 23,25 7,26 1,28 4,29 2,32 31,34 1,35 3.7,36 0.123,37 7,38 46,39 54.222,40 60.508,41 37.404,42 35.611,43 1.9,44 4.714}
{0 CHEMBL278029,1 7.832,2 36.7,3 50.6,4 0.996,5 1.131,6 0.659,7 0.607,8 618.71,9 6.3,10 12,11 79,13 15,14 41,15 1,16 81,17 29,20 15,21 14,22 3,24 40,25 10,26 2,28 5,29 3,31 1,32 39,34 1,35 3.8,36 0.16,37 13,38 50,39 78.701,40 89.355,41 52.097,42 47.946,43 1.3,44 4.222}
{0 CHEMBL278203,1 8.394,2 39.8,3 45.8,4 1.006,5 1.125,6 0.678,7 0.637,8 696.73,9 6,10 18,11 83,13 21,14 49,15 1,16 87,17 33,20 21,21 12,22 3,24 38,25 12,26 2,28 5,29 5,31 1,32 45,34 1,35 6,36 0.149,37 13,38 61,39 83.472,40 93.359,41 56.245,42 52.849,43 1.2,44 4.481}
{0 CHEMBL279108,1 8.033,2 39.8,3 48.2,4 0.996,5 1.125,6 0.676,7 0.626,8 666.75,9 6,10 18,11 83,13 21,14 46,15 1,16 86,17 33,20 21,21 12,22 3,24 40,25 10,26 2,28 5,29 3,31 1,32 43,34 1,35 3.6,36 0.163,37 14,38 58,39 82.701,40 93.355,41 56.097,42 51.946,43 1.2,44 4.854}
{0 CHEMBL279374,1 8.652,2 39.1,3 47,4 0.999,5 1.124,6 0.688,7 0.636,8 995.01,9 7,10 24,11 115,13 28,14 66,15 2,16 120,17 45,20 28,21 17,22 4,24 54,25 16,26 4,28 8,29 4,31 2,32 61,34 2,35 3.5,36 0.15,37 18,38 82,39 114.941,40 129.312,41 79.137,42 73.098,43 1.7,44 6.26}
{0 CHEMBL279832,1 8.098,2 42.2,3 46.7,4 0.995,5 1.12,6 0.687,7 0.639,8 728.82,9 5.6,10 24,11 90,13 27,14 52,15 1,16 94,17 38,20 27,21 11,22 3,24 42,25 10,26 2,28 5,29 3,31 1,32 48,34 1,35 3.3,36 0.149,37 14,38 67,39 89.585,40 100.77,41 61.859,42 57.473,43 1.1,44 4.553}
{0 CHEMBL279833,1 7.66,2 37.2,3 51.2,4 0.994,5 1.13,6 0.658,7 0.605,8 658.78,9 5.8,10 12,11 86,13 15,14 45,15 1,16 89,17 32,20 15,21 17,22 3,24 44,25 10,26 2,28 5,29 3,31 1,32 42,34 1,35 3.5,36 0.146,37 13,38 54,39 85.468,40 97.185,41 56.62,42 52,43 1.2,44 4.328}
{0 CHEMBL279905,1 7.59,2 40.9,3 50,4 0.986,5 1.119,6 0.693,7 0.627,8 333.94,9 4.5,10 12,11 44,13 12,14 24,16 46,17 18,18 1,20 12,21 6,24 22,25 4,26 2,28 2,31 1,32 22,34 1,36 0.087,37 4,38 30,39 43.382,40 49.22,41 30.512,42 27.589,43 2.3,44 4.553}
{0 CHEMBL280230,1 8.172,2 41.9,3 46.5,4 0.997,5 1.12,6 0.687,7 0.639,8 702.78,9 5.8,10 23,11 86,13 26,14 50,15 1,16 90,17 36,20 25,21 11,22 3,24 40,25 10,26 2,28 5,29 3,31 1,32 46,34 1,35 3.5,36 0.144,37 13,38 64.5,39 85.701,40 96.355,41 59.097,42 54.946,43 1.2,44 4.602}
{0 CHEMBL288428,1 7.743,2 41.9,3 48.8,4 0.987,5 1.117,6 0.701,7 0.635,8 332.93,9 4.7,10 12,11 43,13 12,14 24,16 45,17 18,18 1,20 12,21 6,24 21,25 4,26 2,28 2,31 1,32 22,34 1,36 0.111,37 5,38 30,39 42.44,40 48.013,41 30.131,42 27.325,43 2.3,44 4.09}
{0 CHEMBL288636,1 8.936,2 47.1,3 41.2,4 1,5 1.102,6 0.744,7 0.689,8 303.83,9 2.9,10 12,11 34,13 13,14 22,16 36,17 16,18 1,20 13,21 3,22 1,24 14,25 4,26 2,28 1,29 1,31 1,32 20,34 1,35 2.9,36 0.056,37 2,38 29,39 34.014,40 37.478,41 25.296,42 23.438,43 2.9,44 4.022}
{0 CHEMBL291997,1 7.254,2 33.3,3 50.5,4 1.007,5 1.139,6 0.633,7 0.594,8 805.15,9 7.2,10 12,11 111,13 18,14 56,16 112,17 37,20 18,21 19,22 6,24 56,25 18,26 2,28 8,29 8,31 2,32 55,35 7.2,36 0.25,37 28,38 68,39 111.792,40 126.466,41 70.251,42 65.907,44 4.509}
{0 CHEMBL292314,1 8.025,2 44.8,3 44.8,4 0.994,5 1.118,6 0.705,7 0.656,8 232.73,9 6.9,10 11,11 29,13 11,14 18,16 31,17 13,18 1,20 9,21 4,24 13,25 3,26 1,28 2,32 16,34 1,38 23.5,39 28.829,40 32.432,41 20.438,42 19.031,43 3.4,44 4.097}
{0 CHEMBL295316,1 8.554,2 50,3 36.4,4 1.023,5 1.104,6 0.7,7 0.693,8 188.19,10 6,11 22,13 9,14 15,16 23,17 11,20 10,21 1,22 3,24 8,25 3,29 3,32 14,35 13.6,38 21,39 22.516,40 24.289,41 15.409,42 15.252,44 4.689}
{0 CHEMBL302322,1 7.094,2 33.6,3 50.5,4 1.008,5 1.141,6 0.625,7 0.591,8 759.05,9 7.5,10 12,11 107,13 18,14 54,16 108,17 36,20 18,21 18,22 6,24 54,25 17,26 1,28 8,29 8,31 1,32 53,35 7.5,36 0.241,37 26,38 66,39 107.832,40 122.131,41 66.841,42 63.193,44 4.036}
{0 CHEMBL305575,1 6.353,2 43.3,3 52.2,4 0.977,5 1.121,6 0.66,7 0.604,8 425.67,9 4.5,10 22,11 67,13 22,14 35,16 70,17 29,20 20,21 9,24 35,25 3,28 3,32 32,36 0.186,37 13,38 46,39 65.443,40 75.138,41 44.199,42 40.493,44 5.022}
{0 CHEMBL307650,1 6.707,2 37.2,3 51.2,4 0.997,5 1.136,6 0.632,7 0.593,8 576.82,9 7,10 20,11 86,13 22,14 45,16 89,17 32,20 18,21 14,22 2,24 44,25 10,28 6,29 4,32 42,35 4.7,36 0.213,37 19,38 57,39 85.708,40 97.716,41 54.319,42 50.997,44 6.553}
{0 CHEMBL308396,1 8.783,2 40.8,3 38,4 1.046,5 1.157,6 0.65,7 0.657,8 623.61,9 7,10 22,11 71,13 24,14 47,16 74,17 29,20 20,21 9,22 2,23 6,24 27,25 15,28 5,29 4,32 44,34 6,35 5.6,36 0.149,37 11,38 60,39 74.265,40 82.18,41 46.131,42 46.641,43 8.5,44 6.071}
{0 CHEMBL309562,1 7.172,2 44.2,3 46.5,4 0.996,5 1.12,6 0.669,7 0.633,8 308.41,9 4.7,10 16,11 43,13 16,14 26,16 46,17 19,20 14,21 5,24 20,25 4,28 2,29 2,32 23,35 4.7,36 0.065,37 3,38 34,39 42.811,40 48.152,41 28.773,42 27.214,44 5.155}
{0 CHEMBL310207,1 5.919,2 41.6,3 55.8,4 0.972,5 1.123,6 0.644,7 0.582,8 911.54,9 2.6,10 36,11 154,13 36,14 73,16 159,17 64,20 36,21 28,24 86,25 4,28 4,32 68,36 0.233,37 37,38 91,39 149.635,40 173.016,41 99.24,42 89.684,44 4.987}
{0 CHEMBL315583,1 7.877,2 43.9,3 43.9,4 1.002,5 1.121,6 0.687,7 0.652,8 448.99,9 7,10 22,11 57,13 23,14 35,16 60,17 25,18 1,20 20,21 5,22 1,24 25,25 7,26 1,28 4,29 2,32 32,34 1,35 3.5,36 0.133,37 8,38 47,39 57.105,40 63.923,41 39.165,42 37.137,43 1.8,44 4.883}
{0 CHEMBL322826,1 7.302,2 43.3,3 50,4 0.982,5 1.115,6 0.693,7 0.628,8 438.1,9 3.3,10 18,11 60,13 18,14 33,16 63,17 26,18 1,20 18,21 8,24 30,25 4,26 2,28 2,31 1,32 30,34 1,36 0.095,37 6,38 42,39 58.916,40 66.881,41 41.557,42 37.696,43 1.7,44 5.409}
{0 CHEMBL323210,1 7.591,2 45.6,3 47.1,4 0.987,5 1.11,6 0.703,7 0.646,8 516.17,9 2.9,10 24,11 68,13 24,14 40,16 72,17 31,18 1,20 24,21 7,24 32,25 5,26 2,28 2,29 1,31 1,32 36,34 1,35 1.5,36 0.125,37 9,38 52,39 67.127,40 75.506,41 47.773,42 43.938,43 1.5,44 4.983}
{0 CHEMBL323271,1 7.826,2 47.4,3 45.6,4 0.985,5 1.106,6 0.72,7 0.66,8 446.07,9 3.5,10 23,11 57,13 23,14 35,16 61,17 27,18 1,20 22,21 5,24 26,25 4,26 2,28 2,31 1,32 31,34 1,36 0.082,37 5,38 46.5,39 56.149,40 63.051,41 41.034,42 37.642,43 1.8,44 5.421}
{0 CHEMBL323540,1 7.44,2 43.9,3 49.1,4 0.983,5 1.113,6 0.698,7 0.635,8 424.07,9 3.5,10 18,11 57,13 18,14 32,16 60,17 25,18 1,20 18,21 7,24 28,25 4,26 2,28 2,31 1,32 29,34 1,36 0.1,37 6,38 41,39 56.032,40 63.466,41 39.796,42 36.169,43 1.8,44 4.967}
{0 CHEMBL326458,1 8.246,2 44.1,3 45.8,4 0.995,5 1.112,6 0.714,7 0.656,8 486.52,9 3.4,10 18,11 59,13 19,14 35,16 62,17 26,18 2,20 19,21 7,22 1,24 27,25 6,26 3,28 2,29 1,31 1,32 32,34 2,35 1.7,36 0.113,37 7,38 45,39 58.683,40 65.619,41 42.108,42 38.711,43 3.4,44 5.456}
{0 CHEMBL345281,1 7.409,2 41.2,3 45.9,4 1.01,5 1.125,6 0.651,7 0.627,8 629.77,9 3.5,10 12,11 85,13 20,14 49,16 88,17 35,20 22,21 13,22 8,24 39,25 11,28 3,29 8,32 46,35 9.4,36 0.17,37 15,38 63,39 85.829,40 95.644,41 55.358,42 53.265,44 4.319}
{0 CHEMBL345932,1 7.827,2 45.5,3 42.4,4 1.015,5 1.113,6 0.671,7 0.653,8 258.29,10 6,11 33,13 10,14 20,16 34,17 15,20 11,21 4,22 4,24 14,25 4,29 4,32 19,35 12.1,36 0.118,37 4,38 27,39 33.494,40 36.744,41 22.148,42 21.547,44 4.301}
{0 CHEMBL346422,1 6.7,2 40,3 50.9,4 0.994,5 1.128,6 0.641,7 0.601,8 737.04,9 3.6,10 12,11 110,13 20,14 58,16 114,17 44,20 22,21 22,22 8,24 56,25 10,28 4,29 6,32 54,35 5.5,36 0.175,37 20,38 72,39 109.345,40 124.045,41 70.546,42 66.071,44 4.921}
{0 CHEMBL348029,1 6.995,2 37.7,3 49.3,4 1.004,5 1.134,6 0.634,7 0.602,8 482.64,9 5.8,10 6,11 69,13 11,14 38,16 72,17 26,20 12,21 14,22 5,24 34,25 9,28 4,29 5,32 35,35 7.2,36 0.083,37 6,38 46,39 69.298,40 78.268,41 43.716,42 41.562,44 4.301}
{0 CHEMBL348457,1 6.752,2 40.6,3 50.5,4 0.995,5 1.126,6 0.644,7 0.604,8 681.95,9 3,10 12,11 101,13 20,14 53,16 104,17 41,20 22,21 19,22 8,24 51,25 9,28 3,29 6,32 50,35 5.9,36 0.202,37 21,38 67,39 100.476,40 113.716,41 65.018,42 60.996,44 4.678}
{0 CHEMBL348714,1 6.665,2 36.2,3 51.7,4 0.998,5 1.138,6 0.626,7 0.588,8 386.55,9 6.9,10 6,11 58,13 9,14 30,16 60,17 21,20 10,21 11,22 3,24 30,25 7,28 4,29 3,32 28,35 5.2,36 0.133,37 8,38 36,39 57.876,40 66.019,41 36.285,42 34.078,44 4.409}
{0 CHEMBL351108,1 6.948,2 40.8,3 49,4 0.998,5 1.126,6 0.648,7 0.612,8 680.92,9 4.1,10 12,11 98,13 20,14 54,16 102,17 40,20 22,21 18,22 8,24 48,25 10,28 4,29 6,32 50,35 6.1,36 0.157,37 16,38 68,39 97.81,40 110.384,41 63.501,42 59.964,44 4.921}
{0 CHEMBL355938,1 6.817,2 40.4,3 50,4 0.996,5 1.127,6 0.644,7 0.606,8 708.98,9 3.8,10 12,11 104,13 20,14 56,16 108,17 42,20 22,21 20,22 8,24 52,25 10,28 4,29 6,32 52,35 5.8,36 0.167,37 18,38 70,39 103.577,40 117.214,41 67.023,42 63.018,44 4.796}
{0 CHEMBL356201,1 7.096,2 41.3,3 47.8,4 1,5 1.126,6 0.652,7 0.619,8 652.86,9 4.3,10 12,11 92,13 20,14 52,16 96,17 38,20 22,21 16,22 8,24 44,25 10,28 4,29 6,32 48,35 6.5,36 0.146,37 14,38 66,39 92.043,40 103.554,41 59.978,42 56.91,44 4.854}
{0 CHEMBL356232,1 6.651,2 37,3 51.9,4 0.998,5 1.135,6 0.627,7 0.589,8 538.76,9 4.9,10 6,11 81,13 11,14 42,16 84,17 30,20 12,21 18,22 5,24 42,25 9,28 4,29 5,32 39,35 6.2,36 0.119,37 10,38 50,39 80.832,40 91.929,41 50.762,42 47.669,44 5.229}
{0 CHEMBL356839,1 7.464,2 40.7,3 50,4 0.989,5 1.12,6 0.683,7 0.623,8 403.03,9 3.7,10 16,11 54,13 16,14 29,16 56,17 22,18 1,20 13,21 9,24 27,25 5,26 2,28 2,29 1,31 1,32 27,34 1,35 1.9,36 0.161,37 9,38 37,39 53.418,40 60.468,41 36.87,42 33.621,43 1.9,44 4.426}
{0 CHEMBL357338,1 7.096,2 41.3,3 47.8,4 1,5 1.126,6 0.652,7 0.619,8 326.43,9 4.3,10 6,11 46,13 10,14 26,16 48,17 19,20 11,21 8,22 4,24 22,25 5,28 2,29 3,32 24,35 6.5,36 0.063,37 3,38 33,39 46.022,40 51.777,41 29.989,42 28.455,44 4.301}
{0 CHEMBL358221,1 7.812,2 41.7,3 47.9,4 0.993,5 1.117,6 0.695,7 0.637,8 374.97,9 4.2,10 16,11 48,13 16,14 27,16 50,17 20,18 1,20 13,21 7,24 23,25 5,26 2,28 2,29 1,31 1,32 25,34 1,35 2.1,36 0.14,37 7,38 35,39 47.651,40 53.637,41 33.347,42 30.567,43 2.1,44 4.257}
{0 CHEMBL358636,1 7.147,2 40.4,3 47.9,4 1.005,5 1.126,6 0.645,7 0.615,8 671.86,9 3.2,10 12,11 94,13 20,14 52,16 97,17 38,20 22,21 16,22 8,24 45,25 11,28 3,29 8,32 49,35 8.5,36 0.186,37 18,38 66,39 94.479,40 105.889,41 60.642,42 57.845,44 6.324}
{0 CHEMBL358688,1 7.22,2 39.5,3 47.4,4 1.007,5 1.13,6 0.644,7 0.616,8 274.35,9 5.3,10 6,11 38,13 9,14 21,16 39,17 15,20 10,21 5,22 3,24 18,25 5,28 2,29 3,32 20,35 7.9,36 0.128,37 5,38 27,39 38.254,40 42.946,41 24.466,42 23.402,44 4.244}
{0 CHEMBL370195,1 9.868,2 48.7,3 33.3,4 1.023,5 1.102,6 0.755,7 0.727,8 384.86,9 5.1,10 18,11 39,13 21,14 28,16 41,17 19,18 1,20 19,22 3,24 13,25 7,26 2,28 2,29 3,31 1,32 26,34 1,35 7.7,36 0.122,37 5,38 40,39 39.887,40 42.98,41 29.449,42 28.363,43 2.6,44 4.361}
{0 CHEMBL371088,1 8.496,2 44.4,3 44.4,4 0.997,5 1.108,6 0.724,7 0.666,8 305.85,9 2.8,10 12,11 36,13 13,14 21,16 37,17 16,18 1,20 13,21 3,22 1,24 16,25 4,26 2,28 1,29 1,31 1,32 20,34 1,35 2.8,36 0.135,37 5,38 28,39 35.898,40 39.893,41 26.057,42 23.965,43 2.8,44 4.732}
{0 CHEMBL371878,1 6.987,2 41.5,3 52.3,4 0.98,5 1.119,6 0.678,7 0.612,8 454.15,9 3.1,10 18,11 65,13 18,14 33,16 67,17 27,18 1,20 18,21 9,24 34,25 4,26 2,28 2,31 1,32 31,34 1,36 0.134,37 9,38 42,39 63.683,40 72.711,41 44.08,42 39.75,43 1.5,44 5.38}
{0 CHEMBL372259,1 7.627,2 47.2,3 42.7,4 1.001,5 1.113,6 0.688,7 0.659,8 678.84,9 4.5,10 36,11 89,13 38,14 56,16 94,17 42,20 38,21 4,22 2,24 38,25 9,28 4,29 5,32 51,35 5.6,36 0.17,37 16,38 76,39 89.065,40 99.099,41 61.239,42 58.615,44 5.699}
{0 CHEMBL372379,1 8.843,2 45.5,3 42.4,4 1,5 1.105,6 0.736,7 0.68,8 291.82,9 3,10 12,11 33,13 13,14 20,16 34,17 15,18 1,20 13,21 2,22 1,24 14,25 4,26 2,28 1,29 1,31 1,32 19,34 1,35 3,36 0.118,37 4,38 27,39 33.014,40 36.478,41 24.296,42 22.438,43 3,44 4.6}
{0 CHEMBL372413,1 7.177,2 42.9,3 50.8,4 0.981,5 1.116,6 0.688,7 0.623,8 452.13,9 3.2,10 18,11 63,13 18,14 34,16 66,17 27,18 1,20 18,21 9,24 32,25 4,26 2,28 2,31 1,32 31,34 1,36 0.091,37 6,38 43,39 61.8,40 70.296,41 43.319,42 39.223,43 1.6,44 4.18}
{0 CHEMBL378136,1 6.434,2 37.3,3 52.5,4 0.986,5 1.139,6 0.636,7 0.588,8 759.18,9 10.2,10 24,11 118,13 28,14 59,16 121,17 44,20 28,21 16,22 4,24 62,25 12,28 12,32 56,36 0.256,37 31,38 75,39 116.312,40 134.36,41 75.103,42 69.427,44 5.529}
{0 CHEMBL378900,1 6.309,2 37,3 53.5,4 0.984,5 1.139,6 0.633,7 0.583,8 801.27,9 9.4,10 24,11 127,13 28,14 62,16 130,17 47,20 28,21 19,22 4,24 68,25 12,28 12,32 59,36 0.262,37 34,38 78,39 124.962,40 144.605,41 80.388,42 74.007,44 6.022}
{0 CHEMBL379701,1 6.13,2 38.5,3 54.7,4 0.979,5 1.133,6 0.636,7 0.581,8 717.17,9 6.8,10 24,11 117,13 26,14 56,16 120,17 45,20 26,21 19,22 2,24 64,25 8,28 8,32 53,36 0.25,37 30,38 70,39 114.555,40 132.612,41 74.365,42 67.922,44 5.65}
{0 CHEMBL380857,1 6.251,2 38.9,3 53.7,4 0.981,5 1.133,6 0.64,7 0.586,8 675.08,9 7.4,10 24,11 108,13 26,14 53,16 111,17 42,20 26,21 16,22 2,24 58,25 8,28 8,32 50,36 0.243,37 27,38 67,39 105.904,40 122.366,41 69.081,42 63.341,44 5.527}
{0 CHEMBL382434,1 6.296,2 39,3 53.3,4 0.981,5 1.133,6 0.641,7 0.589,8 661.05,9 7.6,10 24,11 105,13 26,14 52,16 108,17 41,20 26,21 15,22 2,24 56,25 8,28 8,32 49,36 0.241,37 26,38 66,39 103.021,40 118.951,41 67.319,42 61.814,44 5.295}
{0 CHEMBL382522,1 8.81,2 43.4,3 45.3,4 0.996,5 1.112,6 0.731,7 0.666,8 466.91,9 3.8,10 18,11 53,13 18,14 31,16 55,17 23,18 3,20 18,21 5,24 24,25 6,26 4,28 2,31 1,32 29,34 3,36 0.145,37 8,38 40,39 52.796,40 58.939,41 38.75,42 35.297,43 5.7,44 5.771}
{0 CHEMBL38403,1 8.045,2 41.9,3 46.5,4 0.992,5 1.119,6 0.706,7 0.647,8 345.93,9 7,10 12,11 43,13 13,14 25,16 45,17 18,18 1,20 12,21 6,22 1,24 20,25 5,26 2,28 3,31 1,32 23,34 1,36 0.133,37 6,38 32,39 42.658,40 48.096,41 30.375,42 27.82,43 2.3,44 4.374}
{0 CHEMBL415,1 6.998,2 42.2,3 51.1,4 0.983,5 1.122,6 0.672,7 0.615,8 314.89,9 4.4,10 12,11 45,13 12,14 24,16 47,17 19,18 1,20 12,21 7,24 23,25 3,26 1,28 2,32 22,34 1,36 0.085,37 4,38 30,39 44.247,40 50.508,41 30.245,42 27.665,43 2.2,44 5.171}
{0 CHEMBL41531,1 9.026,2 46.9,3 40.6,4 0.997,5 1.105,6 0.753,7 0.694,8 288.82,9 6.3,10 12,11 32,13 12,14 22,16 35,17 15,18 1,20 12,21 3,24 13,25 4,26 2,28 2,31 1,32 19,34 1,36 0.029,37 1,38 28,39 31.905,40 35.352,41 24.085,42 22.218,43 3.1,44 4.093}
{0 CHEMBL418611,1 8.563,2 47.4,3 39.5,4 1.009,5 1.104,6 0.72,7 0.685,8 325.41,9 2.6,10 12,11 38,13 15,14 25,16 40,17 18,20 15,21 3,22 3,24 15,25 5,26 1,28 1,29 3,31 1,32 23,35 7.9,36 0.05,37 2,38 34,39 38.345,40 41.953,41 27.347,42 26.041,44 4.309}
{0 CHEMBL422,1 7.837,2 40.4,3 46.2,4 1.01,5 1.143,6 0.666,7 0.629,8 407.55,9 5.8,10 12,11 52,13 12,14 31,16 55,17 21,20 12,21 9,23 3,24 24,25 7,26 1,28 3,31 1,32 28,34 3,36 0.073,37 4,38 37,39 52.523,40 59.416,41 34.614,42 32.723,43 5.8,44 4.391}
{0 CHEMBL424147,1 6.889,2 37.9,3 50,4 1.002,5 1.133,6 0.633,7 0.6,8 399.54,9 5.2,10 6,11 58,13 10,14 31,16 60,17 22,20 11,21 11,22 4,24 29,25 7,28 3,29 4,32 29,35 6.9,36 0.117,37 7,38 38,39 58.101,40 65.73,41 36.733,42 34.772,44 4.796}
{0 CHEMBL427365,1 7.525,2 44.8,3 47.8,4 0.987,5 1.112,6 0.698,7 0.641,8 504.16,9 3,10 24,11 67,13 24,14 38,16 70,17 30,18 1,20 24,21 6,24 32,25 5,26 2,28 2,29 1,31 1,32 35,34 1,35 1.5,36 0.157,37 11,38 50,39 66.127,40 74.506,41 46.773,42 42.938,43 1.5,44 5.18}
{0 CHEMBL43184,1 7.77,2 52,3 40,4 0.99,5 1.106,6 0.722,7 0.686,8 194.25,9 8,10 16,11 25,13 16,14 17,16 27,17 13,20 13,24 10,25 2,28 2,32 15,38 25,39 24.738,40 27.657,41 18.057,42 17.15,44 4.42}
{0 CHEMBL435289,1 7.818,2 41.2,3 42.6,4 1.016,5 1.128,6 0.66,7 0.643,8 531.62,9 7.4,10 17,11 68,13 23,14 42,16 71,17 28,20 20,21 8,22 6,24 29,25 11,28 5,29 6,32 39,35 8.8,36 0.141,37 10,38 56.5,39 69.076,40 76.73,41 44.892,42 43.717,44 5.208}
{0 CHEMBL436292,1 7.396,2 45.5,3 48.5,4 0.982,5 1.111,6 0.702,7 0.64,8 488.16,9 3,10 24,11 66,13 24,14 37,16 69,17 30,18 1,20 24,21 6,24 32,25 4,26 2,28 2,31 1,32 34,34 1,36 0.145,37 10,38 49,39 64.8,40 73.296,41 46.319,42 42.223,43 1.5,44 5.276}
{0 CHEMBL439520,1 5.986,2 34.1,3 56.5,4 0.982,5 1.145,6 0.615,7 0.561,8 508.85,9 9.4,10 12,11 85,13 14,14 38,16 86,17 29,20 14,21 15,22 2,24 48,25 8,28 8,32 37,36 0.279,37 24,38 46,39 83.486,40 97.29,41 52.274,42 47.707,44 4.158}
{0 CHEMBL443557,1 6.626,2 38.3,3 51.7,4 0.994,5 1.132,6 0.634,7 0.593,8 397.57,9 5,10 6,11 60,13 10,14 31,16 62,17 23,20 11,21 12,22 4,24 31,25 6,28 3,29 3,32 29,35 5,36 0.129,37 8,38 38,39 59.658,40 67.936,41 38.04,42 35.584,44 4.357}
{0 CHEMBL449782,1 7.31,2 44.6,3 45.8,4 1.001,5 1.117,6 0.668,7 0.636,8 606.77,9 2.4,10 24,11 83,13 24,14 52,16 90,17 37,20 24,21 13,24 38,25 8,28 2,29 6,32 45,35 7.2,36 0.022,37 2,38 64,39 83.072,40 92.727,41 55.444,42 52.814,44 4.287}
{0 CHEMBL470902,1 9.281,2 40.5,3 35.1,4 1.03,5 1.127,6 0.705,7 0.69,8 343.4,9 13.5,10 16,11 37,13 19,14 26,16 39,17 15,20 14,21 1,22 3,24 13,25 9,26 1,28 5,29 3,31 1,32 24,35 8.1,36 0.128,37 5,38 37,39 38.102,40 41.701,41 26.085,42 25.546,44 4.367}
{0 CHEMBL474006,1 8.895,2 45.8,3 39.6,4 1.011,5 1.109,6 0.724,7 0.686,8 426.95,9 4.2,10 12,11 48,13 16,14 32,16 51,17 22,18 1,20 17,21 5,22 4,24 19,25 7,26 2,28 2,29 3,31 1,32 29,34 1,35 6.3,36 0.098,37 5,38 42,39 48.538,40 53.226,41 34.733,42 32.943,43 2.1,44 4}
{0 CHEMBL474017,1 7.893,2 47.1,3 43.1,4 0.996,5 1.108,6 0.709,7 0.665,8 402.55,9 3.9,10 18,11 51,13 20,14 32,16 54,17 24,20 20,21 4,22 2,24 22,25 5,26 1,28 2,29 2,31 1,32 29,35 3.9,36 0.093,37 5,38 43,39 50.771,40 56.487,41 36.182,42 33.928,44 4}
{0 CHEMBL481759,1 7.081,2 35.1,3 50.9,4 0.997,5 1.137,6 0.644,7 0.597,8 403.61,9 8.8,10 6,11 57,13 9,14 30,16 59,17 20,20 10,21 10,22 3,24 29,25 8,26 1,28 5,29 2,31 1,32 28,35 3.5,36 0.136,37 8,38 36,39 56.843,40 64.813,41 36.722,42 34.045,44 4.57}
{0 CHEMBL481876,1 6.371,2 38.3,3 53.2,4 0.986,5 1.133,6 0.635,7 0.587,8 299.46,9 6.4,10 10,11 47,13 11,14 24,16 49,17 18,20 9,21 9,22 1,24 25,25 4,28 3,29 1,32 22,35 2.1,36 0.102,37 5,38 30,39 46.352,40 53.272,41 29.847,42 27.574,44 4.455}
{0 CHEMBL492346,1 7.696,2 44.2,3 48.8,4 0.983,5 1.11,6 0.709,7 0.641,8 330.93,9 2.3,10 12,11 43,13 12,14 25,16 46,17 19,18 1,20 12,21 7,24 21,25 3,26 2,28 1,31 1,32 22,34 1,38 31,39 42.28,40 47.722,41 30.506,42 27.567,43 2.3,44 4.123}
{0 CHEMBL492957,1 6.65,2 37.5,3 51.6,4 0.995,5 1.135,6 0.632,7 0.592,8 425.61,9 6.3,10 6,11 64,13 10,14 34,16 67,17 24,20 10,21 14,22 4,24 33,25 7,28 4,29 3,32 31,35 4.7,36 0.075,37 5,38 41,39 63.701,40 72.642,41 40.427,42 37.869,44 4.345}
{0 CHEMBL511120,1 7.387,2 42.9,3 47.1,4 0.995,5 1.123,6 0.674,7 0.632,8 517.12,9 5.7,10 22,11 70,13 22,14 42,16 75,17 30,18 1,20 18,21 12,24 33,25 7,26 1,28 4,29 2,32 37,34 1,35 2.9,36 0.093,37 7,38 53,39 69.64,40 78.584,41 47.211,42 44.245,43 1.4,44 4.921}
{0 CHEMBL516210,1 7.701,2 41.8,3 45.5,4 1.002,5 1.12,6 0.68,7 0.64,8 423.58,9 5.5,10 12,11 55,13 15,14 33,16 58,17 23,20 15,21 8,22 3,24 25,25 7,26 1,28 3,29 3,31 1,32 30,35 5.5,36 0.086,37 5,38 42,39 55.083,40 61.61,41 37.404,42 35.19,44 4}
{0 CHEMBL519457,1 6.331,2 39.3,3 53.6,4 0.986,5 1.129,6 0.635,7 0.587,8 354.54,9 3.6,10 6,11 56,13 7,14 30,16 60,17 22,20 7,21 15,22 1,24 30,25 4,28 2,29 2,32 26,35 3.6,36 0.033,37 2,38 34,39 55.229,40 63.228,41 35.58,42 32.848,44 4.117}
{0 CHEMBL522652,1 7.701,2 41.8,3 45.5,4 1.002,5 1.12,6 0.68,7 0.64,8 423.58,9 5.5,10 12,11 55,13 15,14 33,16 58,17 23,20 15,21 8,22 3,24 25,25 7,26 1,28 3,29 3,31 1,32 30,35 5.5,36 0.086,37 5,38 42,39 55.083,40 61.61,41 37.404,42 35.19,44 4.074}
{0 CHEMBL522887,1 6.727,2 39.1,3 50,4 0.988,5 1.135,6 0.65,7 0.605,8 309.46,9 10.9,10 11,11 46,13 13,14 25,16 48,17 18,20 11,21 7,22 2,24 23,25 5,28 5,32 23,36 0.042,37 2,38 32.5,39 45.461,40 52.228,41 29.881,42 27.848,44 4.77}
{0 CHEMBL524325,1 8.595,2 43.8,3 41.7,4 1.006,5 1.108,6 0.719,7 0.673,8 412.57,9 4.2,10 18,11 48,13 21,14 30,16 50,17 21,20 19,21 2,22 3,24 20,25 7,26 2,28 2,29 3,31 2,32 28,35 6.3,36 0.14,37 7,38 42,39 48.291,40 53.202,41 34.523,42 32.303,44 4}
{0 CHEMBL549931,1 7.879,2 38.9,3 42.6,4 1.02,5 1.135,6 0.651,7 0.637,8 425.49,9 9.3,10 11,11 54,13 15,14 34,16 57,17 21,20 14,21 7,22 4,24 23,25 10,28 5,29 5,32 31,35 9.3,36 0.088,37 5,38 43.5,39 55.098,40 61.275,41 35.154,42 34.422,44 4.495}
{0 CHEMBL559342,1 7.022,2 37.5,3 48.8,4 1.002,5 1.137,6 0.638,7 0.605,8 561.76,9 8.8,10 11,11 80,13 16,14 45,16 84,17 30,20 16,21 14,22 5,24 39,25 11,28 7,29 4,32 41,35 5,36 0.119,37 10,38 55.5,39 80.159,40 90.969,41 51.04,42 48.438,44 4.959}
{0 CHEMBL564,1 7.111,2 42.5,3 50,4 0.981,5 1.116,6 0.688,7 0.624,8 284.46,9 5,10 12,11 40,13 12,14 22,16 42,17 17,20 12,21 5,24 20,25 3,26 1,28 2,31 1,32 20,36 0.095,37 4,38 28,39 39.232,40 44.653,41 27.512,42 24.971,44 4.228}
{0 CHEMBL570,1 8.197,2 41.9,3 44.2,4 1.015,5 1.142,6 0.676,7 0.643,8 352.46,9 4.7,10 12,11 43,13 12,14 26,16 45,17 18,20 12,21 6,23 3,24 19,25 6,26 1,28 2,31 1,32 24,34 3,36 0.089,37 4,38 32,39 43.654,40 49.088,41 29.086,42 27.648,43 7,44 4.52}
{0 CHEMBL58084,1 5.798,2 36.4,3 57.6,4 0.976,5 1.137,6 0.621,7 0.561,8 382.66,9 6.1,10 12,11 66,13 12,14 29,16 67,17 24,20 12,21 12,24 38,25 4,28 4,32 28,36 0.224,37 15,38 35,39 64.428,40 75.052,41 40.967,42 37.041,44 4.721}
{0 CHEMBL590,1 8.2,2 52.4,3 38.1,4 1.009,5 1.099,6 0.712,7 0.692,8 172.19,10 6,11 21,13 9,14 14,16 22,17 11,20 10,21 1,22 3,24 8,25 2,29 2,32 13,35 9.5,38 20,39 21.189,40 23.08,41 14.955,42 14.537,44 4.469}
{0 CHEMBL599883,1 9.845,2 33.3,3 33.3,4 1.037,5 1.147,6 0.704,7 0.69,8 236.29,9 25,10 12,11 24,13 12,14 17,16 25,17 8,20 6,21 2,24 8,25 8,26 1,28 6,29 1,31 1,32 16,35 4.2,36 0.12,37 3,38 23,39 24.898,40 27.534,41 16.898,42 16.557,44 4.569}
{0 CHEMBL602365,1 7.741,2 38.5,3 42.3,4 1.006,5 1.144,6 0.666,7 0.642,8 201.26,9 19.2,10 11,11 26,13 12,14 16,16 27,17 10,20 9,21 1,22 1,24 11,25 5,28 5,32 15,36 0.037,37 1,38 22.5,39 26.16,40 29.737,41 17.313,42 16.687,44 4}
{0 CHEMBL60430,1 7.028,2 33.6,3 50.9,4 1.007,5 1.141,6 0.624,7 0.588,8 773.08,9 7.3,10 12,11 110,13 18,14 55,16 111,17 37,20 18,21 19,22 6,24 56,25 17,26 1,28 8,29 8,31 1,32 54,35 7.3,36 0.243,37 27,38 67,39 110.716,40 125.546,41 68.603,42 64.72,44 4.367}
{0 CHEMBL608846,1 6.952,2 41.2,3 51,4 0.985,5 1.12,6 0.672,7 0.613,8 354.56,9 3.9,10 12,11 51,13 13,14 27,16 53,17 21,20 13,21 8,22 1,24 26,25 4,26 1,28 2,29 1,31 1,32 25,35 2,36 0.113,37 6,38 34,39 50.211,40 57.108,41 34.25,42 31.266,44 4.249}
{0 CHEMBL608849,1 7.638,2 42.6,3 48.9,4 0.986,5 1.115,6 0.7,7 0.635,8 358.97,9 4.3,10 12,11 47,13 12,14 27,16 50,17 20,18 1,20 12,21 8,24 23,25 4,26 2,28 2,31 1,32 24,34 1,36 0.04,37 2,38 33,39 46.323,40 52.428,41 32.892,42 29.852,43 2.1,44 4.536}
{0 CHEMBL609096,1 7.783,2 41.8,3 47.3,4 0.993,5 1.119,6 0.693,7 0.638,8 428.04,9 5.5,10 12,11 55,13 13,14 33,16 59,17 23,18 1,20 13,21 10,22 1,24 26,25 6,26 2,28 3,29 1,31 1,32 29,34 1,35 1.8,36 0.051,37 3,38 40,39 54.636,40 61.551,41 38.114,42 35.115,43 1.8,44 4.451}
{0 CHEMBL609110,1 7.474,2 44.4,3 46.3,4 0.989,5 1.115,6 0.694,7 0.644,8 403.59,9 5.6,10 18,11 54,13 19,14 32,16 57,17 24,20 19,21 5,22 1,24 25,25 5,26 1,28 3,29 1,31 1,32 29,35 1.9,36 0.105,37 6,38 42,39 53.429,40 60.192,41 37.495,42 34.761,44 4}
{0 CHEMBL611773,1 7.951,2 36.4,3 45.5,4 1.013,5 1.14,6 0.657,7 0.627,8 349.86,9 11.4,10 6,11 44,13 9,14 26,16 46,17 16,18 1,20 9,21 7,22 3,24 20,25 8,26 1,28 5,29 2,32 24,34 1,35 4.5,36 0.065,37 3,38 32,39 44.556,40 50.176,41 28.887,42 27.579,43 2.3,44 4}
{0 CHEMBL612047,1 7.513,2 42.9,3 50,4 0.978,5 1.107,6 0.712,7 0.635,8 315.54,9 2.4,10 12,11 42,13 12,14 23,16 44,17 18,20 12,21 6,24 21,25 3,26 2,28 1,31 2,32 21,36 0.091,37 4,38 29,39 41.091,40 46.49,41 29.915,42 26.664,44 4.435}
{0 CHEMBL612055,1 7.076,2 43.5,3 50,4 0.983,5 1.113,6 0.684,7 0.624,8 325.51,9 2.2,10 12,11 46,13 12,14 26,16 49,17 20,20 12,21 8,24 23,25 3,26 1,28 1,29 1,31 1,32 23,35 2.2,36 0.041,37 2,38 32,39 45.225,40 51.195,41 31.483,42 28.718,44 4.939}
{0 CHEMBL612060,1 7.073,2 39.1,3 50,4 0.992,5 1.127,6 0.66,7 0.611,8 452.68,9 6.3,10 12,11 64,13 14,14 35,16 67,17 25,20 14,21 11,22 2,24 32,25 7,26 1,28 4,29 2,31 1,32 32,35 3.1,36 0.104,37 7,38 43,39 63.509,40 72.145,41 42.239,42 39.077,44 4}
{0 CHEMBL612061,1 8.108,2 43.5,3 45.7,4 0.995,5 1.114,6 0.708,7 0.653,8 372.95,9 4.3,10 12,11 46,13 13,14 28,16 49,17 20,18 1,20 13,21 7,22 1,24 21,25 5,26 2,28 2,29 1,31 1,32 25,34 1,35 2.2,36 0.041,37 2,38 35,39 45.767,40 51.222,41 32.586,42 30.04,43 2.2,44 4.104}
{0 CHEMBL61691,1 6.189,2 41,3 53.8,4 0.977,5 1.127,6 0.647,7 0.591,8 482.78,9 5.1,10 22,11 78,13 22,14 39,16 81,17 32,20 20,21 12,24 42,25 4,28 4,32 36,36 0.185,37 15,38 50,39 76.196,40 87.882,41 50.489,42 46.095,44 5.26}
{0 CHEMBL62048,1 5.625,2 35.9,3 59,4 0.974,5 1.137,6 0.616,7 0.553,8 438.78,9 5.1,10 12,11 78,13 12,14 33,16 79,17 28,20 12,21 16,24 46,25 4,28 4,32 32,36 0.241,37 19,38 39,39 75.963,40 88.712,41 48.012,42 43.148,44 5.457}
{0 CHEMBL71,1 7.972,2 42.5,3 47.5,4 0.989,5 1.115,6 0.709,7 0.645,8 318.9,9 5,10 12,11 40,13 12,14 23,16 42,17 17,18 1,20 12,21 5,24 19,25 4,26 2,28 2,31 1,32 21,34 1,36 0.095,37 4,38 29,39 39.556,40 44.597,41 28.37,42 25.799,43 2.5,44 4.709}
{0 CHEMBL726,1 7.814,2 39.3,3 46.4,4 1.013,5 1.144,6 0.658,7 0.624,8 437.58,9 5.4,10 12,11 56,13 12,14 33,16 59,17 22,20 12,21 10,23 3,24 26,25 8,26 1,28 3,29 1,31 1,32 30,34 3,35 1.8,36 0.102,37 6,38 39,39 56.734,40 64.041,41 36.83,42 34.964,43 5.4,44 4.404}
{0 CHEMBL7568,1 6.897,2 39.7,3 51.7,4 0.988,5 1.129,6 0.655,7 0.603,8 400.01,9 5.2,10 16,11 58,13 16,14 30,16 60,17 23,18 1,20 13,21 10,24 30,25 5,26 1,28 3,29 1,32 28,34 1,35 1.7,36 0.15,37 9,38 38,39 57.327,40 65.461,41 37.989,42 34.982,43 1.7,44 4.721}
{0 CHEMBL76523,1 6.553,2 38.3,3 51.9,4 0.99,5 1.134,6 0.638,7 0.593,8 530.79,9 7.4,10 20,11 81,13 22,14 42,16 84,17 31,20 18,21 13,22 2,24 42,25 8,28 6,29 2,32 39,35 2.5,36 0.214,37 18,38 54,39 80.17,40 91.882,41 51.648,42 48.04,44 6.456}
{0 CHEMBL76582,1 6.625,2 38.5,3 51.3,4 0.991,5 1.134,6 0.64,7 0.596,8 516.76,9 7.7,10 20,11 78,13 22,14 41,16 81,17 30,20 18,21 12,22 2,24 40,25 8,28 6,29 2,32 38,35 2.6,36 0.21,37 17,38 53,39 77.287,40 88.467,41 49.887,42 46.514,44 6.409}
{0 CHEMBL76694,1 8.648,2 38.5,3 48.7,4 0.997,5 1.13,6 0.674,7 0.623,8 674.54,9 7.7,10 20,11 78,13 22,14 43,15 2,16 81,17 30,20 18,21 12,22 2,24 38,25 10,26 2,28 6,29 2,32 40,34 2,35 2.6,36 0.21,37 17,38 55,39 77.745,40 88.15,41 52.592,42 48.564,43 2.6,44 7.119}
{0 CHEMBL76954,1 8.921,2 48.3,3 37.9,4 1.009,5 1.111,6 0.729,7 0.697,8 258.72,9 6.9,10 16,11 29,13 16,14 20,16 31,17 14,18 1,20 13,21 1,24 11,25 4,26 1,28 2,29 1,32 18,34 1,35 3.4,36 0.032,37 1,38 28,39 29.273,40 32.226,41 21.131,42 20.219,43 3.4,44 5.155}
{0 CHEMBL76994,1 6.93,2 36.8,3 50,4 1.005,5 1.136,6 0.628,7 0.596,8 526.7,9 5.3,10 12,11 76,13 16,14 39,16 77,17 28,20 18,21 10,22 4,24 38,25 10,28 4,29 6,32 38,35 7.9,36 0.221,37 17,38 49,39 76.392,40 86.308,41 47.694,42 45.33,44 5.857}
{0 CHEMBL77912,1 6.365,2 37.8,3 53.3,4 0.987,5 1.135,6 0.633,7 0.585,8 572.88,9 6.7,10 20,11 90,13 22,14 45,16 93,17 34,20 18,21 16,22 2,24 48,25 8,28 6,29 2,32 42,35 2.2,36 0.226,37 21,38 57,39 88.821,40 102.128,41 56.933,42 52.621,44 5.9}
{0 CHEMBL78036,1 8.301,2 39,3 41.5,4 1.037,5 1.158,6 0.639,7 0.637,8 680.72,9 7.3,10 22,11 82,13 24,14 51,16 85,17 32,20 20,21 12,22 2,23 6,24 34,25 16,28 6,29 4,32 48,34 6,35 4.9,36 0.176,37 15,38 64,39 85.017,40 94.924,41 52.421,42 52.243,43 7.3,44 6.125}
{0 CHEMBL78448,1 7.593,2 50,3 41.7,4 0.989,5 1.111,6 0.711,7 0.673,8 273.36,9 8.3,10 16,11 36,13 17,14 24,16 39,17 18,19 1,20 14,21 3,24 15,25 3,28 3,32 21,33 1,36 0.026,37 1,38 34,39 35.607,40 39.986,41 25.586,42 24.225,44 5.699}
{0 CHEMBL790,1 7.899,2 34.4,3 46.9,4 1.006,5 1.147,6 0.659,7 0.62,8 505.52,9 15.6,10 12,11 64,13 16,14 35,16 65,17 22,18 2,20 16,21 6,22 4,24 30,25 12,26 2,28 10,32 34,34 2,36 0.262,37 17,38 45,39 64.385,40 73.438,41 42.148,42 39.664,43 3.1,44 5.699}
{0 CHEMBL79129,1 6.634,2 35,3 52.5,4 1.002,5 1.139,6 0.615,7 0.58,8 530.74,9 5,10 12,11 80,13 14,14 39,16 81,17 28,20 14,21 14,22 2,24 42,25 10,28 4,29 6,32 38,35 7.5,36 0.235,37 19,38 47,39 80.159,40 91.138,41 49.216,42 46.384,44 7.119}
{0 CHEMBL823,1 8.168,2 41.5,3 46.3,4 0.997,5 1.117,6 0.703,7 0.647,8 334.9,9 4.9,10 12,11 41,13 13,14 24,16 43,17 17,18 1,20 12,21 5,22 1,24 19,25 5,26 2,28 2,29 1,31 1,32 22,34 1,35 2.4,36 0.093,37 4,38 31,39 40.883,40 45.807,41 28.824,42 26.513,43 2.4,44 4.116}
{0 CHEMBL82641,1 5.812,2 39.5,3 57,4 0.972,5 1.128,6 0.634,7 0.572,8 499.86,9 3.5,10 18,11 86,13 18,14 39,16 88,17 34,20 18,21 16,24 49,25 3,28 3,32 37,36 0.239,37 21,38 48,39 83.628,40 97.045,41 54.529,42 49.181,44 5.456}
{0 CHEMBL84221,1 5.742,2 38.1,3 57.7,4 0.973,5 1.132,6 0.627,7 0.565,8 556.97,9 4.1,10 18,11 97,13 18,14 43,16 99,17 37,20 18,21 19,24 56,25 4,28 4,32 41,36 0.253,37 25,38 52,39 94.381,40 109.788,41 60.819,42 54.782,44 5.441}
{0 CHEMBL84760,1 7.6,2 28.4,3 49.5,4 1.022,5 1.151,6 0.614,7 0.587,8 721.97,9 9.5,11 95,13 8,14 48,16 95,17 27,20 8,21 19,22 8,24 47,25 21,26 2,28 9,29 10,31 2,32 48,35 10.5,36 0.105,37 10,38 56,39 97.13,40 109.308,41 58.358,42 55.724,44 4.301}
{0 CHEMBL85161,1 5.877,2 40.7,3 56.3,4 0.972,5 1.125,6 0.64,7 0.578,8 793.35,9 3,10 30,11 135,13 30,14 63,16 139,17 55,20 30,21 25,24 76,25 4,28 4,32 59,36 0.237,37 33,38 78,39 131.217,40 151.94,41 86.433,42 78.05,44 6.821}
{0 CHEMBL85189,1 5.742,2 38.1,3 57.7,4 0.973,5 1.132,6 0.627,7 0.565,8 556.97,9 4.1,10 18,11 97,13 18,14 43,16 99,17 37,20 18,21 19,24 56,25 4,28 4,32 41,36 0.242,37 24,38 52,39 94.381,40 109.788,41 60.819,42 54.782,44 5.86}
{0 CHEMBL85198,1 5.697,2 37.3,3 58.2,4 0.973,5 1.134,6 0.623,7 0.56,8 381.67,9 4.5,10 12,11 67,13 12,14 29,16 68,17 25,20 12,21 13,24 39,25 3,28 3,32 28,36 0.235,37 16,38 35,39 65.21,40 75.969,41 41.722,42 37.547,44 5.331}
{0 CHEMBL85779,1 5.434,2 32.2,3 61,4 0.975,5 1.146,6 0.597,7 0.534,8 320.59,9 6.8,10 6,11 59,13 6,14 23,16 59,17 19,20 6,21 13,24 36,25 4,28 4,32 23,36 0.271,37 16,38 26,39 57.545,40 67.636,41 35.205,42 31.514,44 4.425}
{0 CHEMBL85964,1 5.489,2 33.3,3 60.4,4 0.975,5 1.144,6 0.602,7 0.54,8 263.48,9 6.3,10 6,11 48,13 6,14 19,16 48,17 16,20 6,21 10,24 29,25 3,28 3,32 19,36 0.229,37 11,38 22,39 46.792,40 54.893,41 28.915,42 25.913,44 4.851}
{0 CHEMBL86096,1 5.625,2 35.9,3 59,4 0.974,5 1.137,6 0.616,7 0.553,8 438.78,9 5.1,10 12,11 78,13 12,14 33,16 79,17 28,20 12,21 16,24 46,25 4,28 4,32 32,36 0.266,37 21,38 39,39 75.963,40 88.712,41 48.012,42 43.148,44 4.91}
{0 CHEMBL86281,1 5.82,2 39.7,3 56.9,4 0.972,5 1.128,6 0.635,7 0.573,8 675.16,9 3.4,10 24,11 116,13 24,14 53,16 119,17 46,20 24,21 22,24 66,25 4,28 4,32 50,36 0.244,37 29,38 65,39 112.799,40 130.864,41 73.626,42 66.416,44 6.212}
{0 CHEMBL89303,1 7.441,2 42.4,3 47,4 0.996,5 1.124,6 0.673,7 0.632,8 491.08,9 6.1,10 22,11 66,13 23,14 38,16 69,17 28,18 1,20 20,21 8,22 1,24 31,25 7,26 1,28 4,29 2,32 35,34 1,35 3,36 0.159,37 11,38 50,39 65.756,40 74.169,41 44.449,42 41.718,43 1.5,44 4.943}
{0 CHEMBL89368,1 8.389,2 45.2,3 41.9,4 1.005,5 1.112,6 0.71,7 0.67,8 520.09,9 4.8,10 27,11 62,13 29,14 40,16 66,17 28,18 1,20 23,21 5,22 2,24 26,25 8,26 2,28 3,29 3,31 1,32 36,34 1,35 4.8,36 0.136,37 9,38 55.5,39 62.291,40 68.97,41 44.023,42 41.545,43 1.6,44 5.301}
{0 CHEMBL90820,1 8.577,2 45.8,3 40.7,4 1.007,5 1.111,6 0.716,7 0.678,8 506.06,9 5.1,10 27,11 59,13 29,14 39,16 63,17 27,18 1,20 23,21 4,22 2,24 24,25 8,26 2,28 3,29 3,31 1,32 35,34 1,35 5.1,36 0.127,37 8,38 54.5,39 59.407,40 65.554,41 42.262,42 40.018,43 1.7,44 5.481}
{0 CHEMBL91309,1 7.717,2 43.3,3 45,4 1,5 1.122,6 0.682,7 0.644,8 463.02,9 6.7,10 22,11 60,13 23,14 36,16 63,17 26,18 1,20 20,21 6,22 1,24 27,25 7,26 1,28 4,29 2,32 33,34 1,35 3.3,36 0.143,37 9,38 48,39 59.989,40 67.338,41 40.926,42 38.664,43 1.7,44 4.81}
{0 CHEMBL92155,1 8.786,2 46.4,3 39.3,4 1.009,5 1.11,6 0.723,7 0.687,8 492.03,9 5.4,10 27,11 56,13 29,14 38,16 60,17 26,18 1,20 23,21 3,22 2,24 22,25 8,26 2,28 3,29 3,31 1,32 34,34 1,35 5.4,36 0.117,37 7,38 53.5,39 56.523,40 62.139,41 40.5,42 38.491,43 1.8,44 5.229}
