"molecule_id","AMW","C.","pXC50"
{1 6.454,2 44.4,3 7.398}
{0 CHEMBL116886,1 7.111,2 42,3 7.495}
{0 CHEMBL118268,1 7.693,2 40.4,3 6}
{0 CHEMBL118307,1 7.293,2 41.5,3 5.599}
{0 CHEMBL118693,1 6.952,2 43.1,3 6.529}
{0 CHEMBL119781,1 7.094,2 43.8,3 5.413}
{0 CHEMBL121659,1 6.431,2 42.1,3 5.699}
{0 CHEMBL122823,1 6.191,2 40.9,3 5.699}
{0 CHEMBL139536,1 7.376,2 42.3,3 7.076}
{0 CHEMBL2111557,1 5.975,2 40.4,3 6}
{0 CHEMBL2111790,1 6.01,2 40,3 6.208}
{0 CHEMBL2111791,1 6.431,2 42.1,3 5.699}
{0 CHEMBL2111792,1 6.191,2 40.9,3 5.699}
{0 CHEMBL2114968,1 5.934,2 39.6,3 6}
{0 CHEMBL296193,1 6.691,2 45.5,3 5.699}
{0 CHEMBL324960,1 7.126,2 42.3,3 5}
{0 CHEMBL333032,1 6.01,2 40,3 5.699}
{0 CHEMBL341704,1 7.99,2 41.7,3 6.532}
{0 CHEMBL38,1 6.01,2 40,3 5.699}
{0 CHEMBL43833,1 5.934,2 39.6,3 6.36}
{0 CHEMBL44478,1 6.01,2 40,3 7.328}
{0 CHEMBL44582,1 5.934,2 39.6,3 5.699}
{0 CHEMBL44979,1 6.691,2 45.5,3 6.738}
{0 CHEMBL46397,1 6.691,2 45.5,3 5.699}
{0 CHEMBL46398,1 5.934,2 39.6,3 5.699}
{0 CHEMBL547,1 6.01,2 40,3 4.301}
{0 CHEMBL554740,1 7.421,2 45.6,3 6.24}
{0 CHEMBL560351,1 7.13,2 41.4,3 5.944}
{0 CHEMBL563805,1 7.33,2 43.8,3 6.176}
{0 CHEMBL564563,1 7.199,2 42.3,3 6.222}
{0 CHEMBL705,1 6.01,2 40,3 7.291}
{0 CHEMBL72988,1 5.806,2 39,3 5.824}
{0 CHEMBL75548,1 5.755,2 38.2,3 7.137}
