{
  "data_features": {
    "feature": [
      {
        "data_type": "nominal",
        "index": "0",
        "is_ignore": "false",
        "is_row_identifier": "true",
        "is_target": "false",
        "name": "molecule_id",
        "nominal_value": [
          "CHEMBL132525",
          "CHEMBL132612",
          "CHEMBL132714",
          "CHEMBL132720",
          "CHEMBL13306",
          "CHEMBL133777",
          "CHEMBL133853",
          "CHEMBL134287",
          "CHEMBL134413",
          "CHEMBL134690",
          "CHEMBL135611",
          "CHEMBL170518",
          "CHEMBL22978",
          "CHEMBL27768",
          "CHEMBL289230",
          "CHEMBL292383",
          "CHEMBL292417",
          "CHEMBL293709",
          "CHEMBL293717",
          "CHEMBL294422",
          "CHEMBL300160",
          "CHEMBL334195",
          "CHEMBL334451",
          "CHEMBL334853",
          "CHEMBL335486",
          "CHEMBL336963",
          "CHEMBL337522",
          "CHEMBL337834",
          "CHEMBL339383",
          "CHEMBL38644",
          "CHEMBL40482",
          "CHEMBL40602",
          "CHEMBL422215",
          "CHEMBL448101",
          "CHEMBL55267",
          "CHEMBL56997",
          "CHEMBL57015",
          "CHEMBL57105",
          "CHEMBL57211",
          "CHEMBL57400",
          "CHEMBL57517",
          "CHEMBL59376",
          "CHEMBL59422",
          "CHEMBL78679",
          "CHEMBL78799",
          "CHEMBL79376",
          "CHEMBL81971"
        ],
        "number_of_missing_values": "0"
      },
      {
        "data_type": "numeric",
        "index": "1",
        "is_ignore": "false",
        "is_row_identifier": "false",
        "is_target": "false",
        "name": "Me",
        "number_of_missing_values": "0"
      },
      {
        "data_type": "numeric",
        "index": "2",
        "is_ignore": "false",
        "is_row_identifier": "false",
        "is_target": "false",
        "name": "AMW",
        "number_of_missing_values": "0"
      },
      {
        "data_type": "numeric",
        "index": "3",
        "is_ignore": "false",
        "is_row_identifier": "false",
        "is_target": "false",
        "name": "C.",
        "number_of_missing_values": "0"
      },
      {
        "data_type": "numeric",
        "index": "4",
        "is_ignore": "false",
        "is_row_identifier": "false",
        "is_target": "false",
        "name": "H.",
        "number_of_missing_values": "0"
      },
      {
        "data_type": "numeric",
        "index": "5",
        "is_ignore": "false",
        "is_row_identifier": "false",
        "is_target": "true",
        "name": "pXC50",
        "number_of_missing_values": "0"
      }
    ]
  }
}