"molecule_id","AMW","C.","H.","Me","Mi","Mp","Mv","MW","N.","nAB","nAT","nB","nBM","nBO","nBR","nBT","nC","nCL","nCsp","nCsp2","nCsp3","nDB","nF","nH","nHet","nHM","nI","nN","nO","nP","nS","nSK","nTB","nX","O.","RBF","RBN","SCBO","Se","Si","Sp","Sv","X.","pXC50"
{1 6.661,2 35,3 55,4 0.986,5 1.132,6 0.643,7 0.58,8 266.45,9 5,11 40,13 2,14 20,16 42,17 14,20 2,21 12,22 2,24 22,25 4,26 1,28 2,29 1,31 1,32 18,35 2.5,36 0.071,37 3,38 22,39 39.443,40 45.278,41 25.728,42 23.213,44 5}
{0 CHEMBL1088379,1 6.104,2 41.5,3 54.7,4 0.977,5 1.123,6 0.644,7 0.587,8 323.52,9 1.9,10 6,11 53,13 7,14 28,16 57,17 22,20 7,21 15,22 1,24 29,25 2,28 1,29 1,32 24,35 1.9,36 0.035,37 2,38 32,39 51.8,40 59.521,41 34.12,42 31.111,44 5}
{0 CHEMBL1269273,1 6.021,2 36.7,3 56.7,4 0.987,5 1.133,6 0.615,7 0.564,8 541.85,9 1.1,11 90,13 4,14 43,16 94,17 33,20 5,21 28,22 4,24 51,25 6,28 1,29 5,32 39,35 5.6,36 0.032,37 3,38 47,39 88.828,40 101.925,41 55.313,42 50.765,44 8.538}
{0 CHEMBL1269877,1 5.88,2 36.5,3 57.6,4 0.984,5 1.133,6 0.613,7 0.559,8 499.81,9 1.2,11 85,13 3,14 40,16 89,17 31,20 4,21 27,22 3,24 49,25 5,28 1,29 4,32 36,35 4.7,36 0.034,37 3,38 43,39 83.617,40 96.301,41 52.097,42 47.524,44 7.839}
{0 CHEMBL1269895,1 7.185,2 38.6,3 47.4,4 1.004,5 1.135,6 0.645,7 0.615,8 409.54,9 8.8,10 6,11 57,13 9,14 34,16 61,17 22,19 1,20 7,21 14,22 2,24 27,25 8,28 5,29 3,32 30,33 1,35 5.3,36 0.082,37 5,38 41,39 57.211,40 64.687,41 36.767,42 35.046,44 5.134}
{0 CHEMBL1270001,1 7.185,2 38.6,3 47.4,4 1.004,5 1.135,6 0.645,7 0.615,8 409.54,9 8.8,10 6,11 57,13 9,14 34,16 61,17 22,19 1,20 7,21 14,22 2,24 27,25 8,28 5,29 3,32 30,33 1,35 5.3,36 0.082,37 5,38 41,39 57.211,40 64.687,41 36.767,42 35.046,44 5.063}
{0 CHEMBL1270093,1 5.951,2 37.2,3 57,4 0.984,5 1.131,6 0.617,7 0.564,8 511.82,9 1.2,11 86,13 4,14 41,16 90,17 32,20 5,21 27,22 4,24 49,25 5,28 1,29 4,32 37,35 4.7,36 0.022,37 2,38 45,39 84.617,40 97.301,41 53.097,42 48.524,44 6.339}
{0 CHEMBL1270589,1 5.997,2 37.3,3 56.6,4 0.985,5 1.131,6 0.619,7 0.566,8 497.79,9 1.2,11 83,13 4,14 40,16 87,17 31,20 5,21 26,22 4,24 47,25 5,28 1,29 4,32 36,35 4.8,36 0.023,37 2,38 44,39 81.734,40 93.886,41 51.336,42 46.997,44 6.572}
{0 CHEMBL1270688,1 6.067,2 36.8,3 56.3,4 0.988,5 1.132,6 0.616,7 0.566,8 527.82,9 1.1,11 87,13 4,14 42,16 91,17 32,20 5,21 27,22 4,24 49,25 6,28 1,29 5,32 38,35 5.7,36 0.033,37 3,38 46,39 85.945,40 98.51,41 53.552,42 49.239,44 7.214}
{0 CHEMBL1270994,1 5.88,2 36.5,3 57.6,4 0.984,5 1.133,6 0.613,7 0.559,8 499.81,9 1.2,11 85,13 3,14 40,16 89,17 31,20 4,21 27,22 3,24 49,25 5,28 1,29 4,32 36,35 4.7,36 0.022,37 2,38 43,39 83.617,40 96.301,41 52.097,42 47.524,44 5.672}
{0 CHEMBL1271303,1 5.924,2 36.6,3 57.3,4 0.985,5 1.133,6 0.614,7 0.561,8 485.78,9 1.2,11 82,13 3,14 39,16 86,17 30,20 4,21 26,22 3,24 47,25 5,28 1,29 4,32 35,35 4.9,36 0.012,37 1,38 42,39 80.734,40 92.886,41 50.336,42 45.997,44 6.914}
{0 CHEMBL1271410,1 5.88,2 36.5,3 57.6,4 0.984,5 1.133,6 0.613,7 0.559,8 499.81,9 1.2,11 85,13 3,14 40,16 89,17 31,20 4,21 27,22 3,24 49,25 5,28 1,29 4,32 36,35 4.7,36 0.034,37 3,38 43,39 83.617,40 96.301,41 52.097,42 47.524,44 8.31}
{0 CHEMBL1520220,1 8.325,2 49,3 39.2,4 0.998,5 1.107,6 0.73,7 0.69,8 424.56,9 7.8,10 24,11 51,13 25,14 35,16 55,17 25,20 22,21 3,22 1,24 20,25 6,26 1,28 4,29 1,31 1,32 31,35 2,36 0.091,37 5,38 48,39 50.88,40 56.444,41 37.216,42 35.202,44 5.051}
{0 CHEMBL1689172,1 6.451,2 37.2,3 53.5,4 0.995,5 1.132,6 0.622,7 0.58,8 554.8,9 2.3,11 86,13 5,14 45,16 91,17 32,20 6,21 26,22 5,24 46,25 8,28 2,29 6,32 40,35 7,36 0.033,37 3,38 50,39 85.607,40 97.387,41 53.489,42 49.921,44 7.959}
{0 CHEMBL1689173,1 5.987,2 36.4,3 56.8,4 0.985,5 1.134,6 0.615,7 0.563,8 526.84,9 2.3,11 88,13 4,14 42,16 92,17 32,20 5,21 27,22 4,24 50,25 6,28 2,29 4,32 38,35 4.5,36 0.033,37 3,38 46,39 86.719,40 99.799,41 54.103,42 49.545,44 6.983}
{0 CHEMBL1689277,1 7.01,2 35.1,3 52.1,4 1.009,5 1.144,6 0.62,7 0.583,8 658.91,9 2.1,11 94,13 6,14 49,16 98,17 33,20 5,21 28,22 6,23 3,24 49,25 12,26 1,28 2,29 6,31 1,32 45,34 3,35 6.4,36 0.041,37 4,38 55,39 94.872,40 107.572,41 58.234,42 54.839,43 3.2,44 6.712}
{0 CHEMBL1689279,1 5.998,2 36.1,3 56.6,4 0.985,5 1.136,6 0.616,7 0.564,8 497.8,9 3.6,11 83,13 4,14 40,16 87,17 30,20 5,21 25,22 4,24 47,25 6,28 3,29 3,32 36,35 3.6,36 0.011,37 1,38 44,39 81.727,40 94.258,41 51.131,42 46.798,44 7.481}
{0 CHEMBL1689280,1 6.033,2 36.5,3 56.5,4 0.986,5 1.134,6 0.616,7 0.565,8 512.81,9 2.4,11 85,13 4,14 41,16 89,17 31,20 5,21 26,22 4,24 48,25 6,28 2,29 4,32 37,35 4.7,36 0.011,37 1,38 45,39 83.836,40 96.384,41 52.342,42 48.018,44 7.959}
{0 CHEMBL1689281,1 6.391,2 36,3 53.9,4 0.994,5 1.137,6 0.618,7 0.576,8 568.84,9 4.5,11 89,13 5,14 46,16 94,17 32,20 6,21 26,22 5,24 48,25 9,28 4,29 5,32 41,35 5.6,36 0.032,37 3,38 51,39 88.483,40 101.175,41 55.046,42 51.249,44 5.398}
{0 CHEMBL1689282,1 6.416,2 36.3,3 53.8,4 0.996,5 1.135,6 0.618,7 0.577,8 583.85,9 3.3,11 91,13 5,14 47,16 96,17 33,20 6,21 27,22 5,24 49,25 9,28 3,29 6,32 42,35 6.6,36 0.031,37 3,38 52,39 90.592,40 103.301,41 56.256,42 52.469,44 7.824}
{0 CHEMBL1689283,1 5.841,2 36.1,3 57.8,4 0.982,5 1.135,6 0.613,7 0.558,8 484.8,9 2.4,11 83,13 3,14 39,16 87,17 30,20 4,21 26,22 3,24 48,25 5,28 2,29 3,32 35,35 3.6,36 0.011,37 1,38 42,39 81.508,40 94.174,41 50.887,42 46.304,44 7.77}
{0 CHEMBL1689284,1 5.96,2 37,3 56.8,4 0.983,5 1.133,6 0.619,7 0.565,8 482.78,9 2.5,11 81,13 4,14 39,16 85,17 30,20 5,21 25,22 4,24 46,25 5,28 2,29 3,32 35,35 3.7,36 0.012,37 1,38 43,39 79.625,40 91.759,41 50.126,42 45.777,44 7.347}
{0 CHEMBL1760014,1 8.28,2 41.3,3 42.9,4 1.023,5 1.143,6 0.666,7 0.644,8 521.63,9 4.8,10 17,11 63,13 19,14 40,16 67,17 26,20 14,21 12,22 2,23 4,24 27,25 10,26 1,28 3,29 2,31 1,32 36,34 4,35 3.2,36 0.09,37 6,38 50.5,39 64.458,40 72.005,41 41.983,42 40.589,43 6.3,44 5.398}
{0 CHEMBL1760671,1 8.36,2 45.5,3 40.9,4 1.008,5 1.118,6 0.702,7 0.671,8 367.86,9 6.8,10 17,11 44,13 18,14 29,16 47,17 20,18 1,20 15,21 5,22 1,24 18,25 6,26 1,28 3,29 2,32 26,34 1,35 4.5,36 0.085,37 4,38 38.5,39 44.353,40 49.179,41 30.875,42 29.536,43 2.3,44 5.398}
{0 CHEMBL1760672,1 8.153,2 44.4,3 42.2,4 1.003,5 1.122,6 0.698,7 0.663,8 366.88,9 8.9,10 17,11 45,13 18,14 29,16 48,17 20,18 1,20 15,21 5,22 1,24 19,25 6,26 1,28 4,29 1,32 26,34 1,35 2.2,36 0.083,37 4,38 38.5,39 45.127,40 50.468,41 31.426,42 29.842,43 2.2,44 5.398}
{0 CHEMBL1760673,1 7.744,2 43.1,3 45.1,4 0.998,5 1.124,6 0.685,7 0.645,8 394.94,9 7.8,10 17,11 51,13 18,14 31,16 54,17 22,18 1,20 15,21 7,22 1,24 23,25 6,26 1,28 4,29 1,32 28,34 1,35 2,36 0.093,37 5,38 40.5,39 50.894,40 57.299,41 34.949,42 32.896,43 2,44 5.398}
{0 CHEMBL1760674,1 7.421,2 42.1,3 47.4,4 0.994,5 1.125,6 0.675,7 0.631,8 423,9 7,10 17,11 57,13 18,14 33,16 60,17 24,18 1,20 15,21 9,22 1,24 27,25 6,26 1,28 4,29 1,32 30,34 1,35 1.8,36 0.083,37 5,38 42.5,39 56.661,40 64.129,41 38.472,42 35.949,43 1.8,44 5.398}
{0 CHEMBL1760675,1 7.826,2 44.2,3 44.2,4 0.998,5 1.121,6 0.691,7 0.652,8 406.95,9 7.7,10 17,11 52,13 18,14 33,16 56,17 23,18 1,20 15,21 8,22 1,24 23,25 6,26 1,28 4,29 1,32 29,34 1,35 1.9,36 0.089,37 5,38 42.5,39 51.894,40 58.299,41 35.949,42 33.896,43 1.9,44 5.398}
{0 CHEMBL1760676,1 7.654,2 43.6,3 45.5,4 0.996,5 1.122,6 0.686,7 0.644,8 420.98,9 7.3,10 17,11 55,13 18,14 34,16 59,17 24,18 1,20 15,21 9,22 1,24 25,25 6,26 1,28 4,29 1,32 30,34 1,35 1.8,36 0.085,37 5,38 43.5,39 54.778,40 61.714,41 37.711,42 35.423,43 1.8,44 5.398}
{0 CHEMBL1760677,1 7.826,2 44.2,3 44.2,4 0.998,5 1.121,6 0.691,7 0.652,8 406.95,9 7.7,10 17,11 52,13 18,14 33,16 56,17 23,18 1,20 15,21 8,22 1,24 23,25 6,26 1,28 4,29 1,32 29,34 1,35 1.9,36 0.071,37 4,38 42.5,39 51.894,40 58.299,41 35.949,42 33.896,43 1.9,44 5.398}
{0 CHEMBL1760678,1 7.654,2 43.6,3 45.5,4 0.996,5 1.122,6 0.686,7 0.644,8 420.98,9 7.3,10 17,11 55,13 18,14 34,16 59,17 24,18 1,20 15,21 9,22 1,24 25,25 6,26 1,28 4,29 1,32 30,34 1,35 1.8,36 0.068,37 4,38 43.5,39 54.778,40 61.714,41 37.711,42 35.423,43 1.8,44 5.398}
{0 CHEMBL1760679,1 7.803,2 42.9,3 44.6,4 1.002,5 1.124,6 0.682,7 0.645,8 436.98,9 7.1,10 17,11 56,13 18,14 35,16 60,17 24,18 1,20 15,21 9,22 1,24 25,25 7,26 1,28 4,29 2,32 31,34 1,35 3.6,36 0.067,37 4,38 44.5,39 56.105,40 62.923,41 38.165,42 36.137,43 1.8,44 5.398}
{0 CHEMBL1760680,1 9.143,2 45.5,3 38.6,4 1.015,5 1.116,6 0.721,7 0.69,8 402.3,9 6.8,10 17,11 44,13 18,14 30,16 47,17 20,18 2,20 15,21 5,22 1,24 17,25 7,26 2,28 3,29 2,32 27,34 2,35 4.5,36 0.085,37 4,38 39.5,39 44.676,40 49.123,41 31.733,42 30.363,43 4.5,44 5.398}
{0 CHEMBL1760681,1 8.918,2 44.4,3 40,4 1.01,5 1.12,6 0.717,7 0.682,8 401.32,9 8.9,10 17,11 45,13 18,14 30,16 48,17 20,18 2,20 15,21 5,22 1,24 18,25 7,26 2,28 4,29 1,32 27,34 2,35 2.2,36 0.083,37 4,38 39.5,39 45.451,40 50.412,41 32.284,42 30.67,43 4.4,44 5.398}
{0 CHEMBL1760682,1 7.881,2 44.2,3 44.2,4 0.995,5 1.122,6 0.697,7 0.654,8 338.87,9 9.3,10 17,11 43,13 17,14 27,16 46,17 19,18 1,20 14,21 5,24 19,25 5,26 1,28 4,32 24,34 1,36 0.065,37 3,38 35.5,39 42.8,40 48.259,41 29.972,42 28.128,43 2.3,44 5.509}
{0 CHEMBL1760683,1 7.936,2 43.8,3 43.8,4 1,5 1.123,6 0.691,7 0.654,8 380.91,9 8.3,10 17,11 48,13 18,14 30,16 51,17 21,18 1,20 15,21 6,22 1,24 21,25 6,26 1,28 4,29 1,32 27,34 1,35 2.1,36 0.078,37 4,38 39.5,39 48.011,40 53.883,41 33.188,42 31.369,43 2.1,44 5.398}
{0 CHEMBL1760684,1 8.395,2 45.3,3 39.6,4 1.006,5 1.122,6 0.706,7 0.677,8 444.96,9 11.3,10 23,11 53,13 24,14 36,16 57,17 24,18 1,20 19,21 5,22 1,24 21,25 8,26 1,28 6,29 1,32 32,34 1,35 1.9,36 0.088,37 5,38 48.5,39 53.331,40 59.465,41 37.438,42 35.885,43 1.9,44 5.398}
{0 CHEMBL1760685,1 8.635,2 46.2,3 40.4,4 1.002,5 1.112,6 0.728,7 0.684,8 449.01,9 7.7,10 22,11 52,13 23,14 35,16 56,17 24,18 1,20 19,21 5,22 1,24 21,25 7,26 2,28 4,29 1,31 1,32 31,34 1,35 1.9,36 0.089,37 5,38 47,39 52.087,40 57.803,41 37.835,42 35.556,43 1.9,44 5.398}
{0 CHEMBL1760686,1 7.948,2 44.8,3 43.1,4 1.002,5 1.119,6 0.693,7 0.658,8 461,9 6.9,10 22,11 58,13 23,14 37,16 62,17 26,18 1,20 19,21 7,22 1,24 25,25 7,26 1,28 4,29 2,32 33,34 1,35 3.4,36 0.081,37 5,38 49,39 58.105,40 64.923,41 40.165,42 38.137,43 1.7,44 5.398}
{0 CHEMBL1760687,1 8.508,2 45.1,3 39.2,4 1.011,5 1.121,6 0.704,7 0.678,8 433.93,9 9.8,10 22,11 51,13 23,14 35,16 55,17 23,18 1,20 18,21 5,22 1,24 20,25 8,26 1,28 5,29 2,32 31,34 1,35 3.9,36 0.091,37 5,38 47,39 51.556,40 57.176,41 35.887,42 34.578,43 2,44 5.398}
{0 CHEMBL1760688,1 8.682,2 44.2,3 41.9,4 1.003,5 1.121,6 0.717,7 0.673,8 373.31,9 9.3,10 17,11 43,13 17,14 28,16 46,17 19,18 2,20 14,21 5,24 18,25 6,26 2,28 4,32 25,34 2,36 0.065,37 3,38 36.5,39 43.123,40 48.203,41 30.83,42 28.955,43 4.7,44 5.638}
{0 CHEMBL1760689,1 8.653,2 43.8,3 41.7,4 1.007,5 1.121,6 0.709,7 0.671,8 415.35,9 8.3,10 17,11 48,13 18,14 31,16 51,17 21,18 2,20 15,21 6,22 1,24 20,25 7,26 2,28 4,29 1,32 28,34 2,35 2.1,36 0.078,37 4,38 40.5,39 48.334,40 53.827,41 34.046,42 32.197,43 4.2,44 5.398}
{0 CHEMBL1760690,1 9.045,2 45.3,3 37.7,4 1.012,5 1.121,6 0.723,7 0.693,8 479.4,9 11.3,10 23,11 53,13 24,14 37,16 57,17 24,18 2,20 19,21 5,22 1,24 20,25 9,26 2,28 6,29 1,32 33,34 2,35 1.9,36 0.088,37 5,38 49.5,39 53.654,40 59.409,41 38.296,42 36.713,43 3.8,44 5.398}
{0 CHEMBL1760691,1 8.203,2 46.9,3 40.8,4 0.998,5 1.117,6 0.714,7 0.677,8 401.93,9 10.2,10 23,11 49,13 23,14 33,16 53,17 23,18 1,20 18,21 5,24 20,25 6,26 1,28 5,32 29,34 1,36 0.075,37 4,38 44.5,39 48.902,40 54.757,41 34.978,42 33.149,43 2,44 5.398}
{0 CHEMBL1760791,1 8.175,2 45.1,3 41.2,4 1,5 1.123,6 0.706,7 0.67,8 416.95,9 11.8,10 23,11 51,13 23,14 34,16 55,17 23,18 1,20 18,21 5,24 21,25 7,26 1,28 6,32 30,34 1,36 0.073,37 4,38 45.5,39 51.003,40 57.255,41 35.983,42 34.17,43 2,44 5.398}
{0 CHEMBL1760792,1 8.359,2 46,3 40,4 1.005,5 1.119,6 0.709,7 0.677,8 417.93,9 10,10 23,11 50,13 23,14 34,16 54,17 23,18 1,20 18,21 5,24 20,25 7,26 1,28 5,29 1,32 30,34 1,35 2,36 0.074,37 4,38 45.5,39 50.229,40 55.967,41 35.432,42 33.864,43 2,44 5.398}
{0 CHEMBL1760793,1 8.105,2 43.9,3 42.1,4 1.006,5 1.123,6 0.691,7 0.66,8 461.99,9 8.8,10 23,11 57,13 23,14 37,16 61,17 25,18 1,20 18,21 7,24 24,25 8,26 1,28 5,29 2,32 33,34 1,35 3.5,36 0.098,37 6,38 48.5,39 57.323,40 64.006,41 39.409,42 37.632,43 1.8,44 5.398}
{0 CHEMBL1760794,1 8.203,2 46.9,3 40.8,4 0.998,5 1.117,6 0.714,7 0.677,8 401.93,9 10.2,10 23,11 49,13 23,14 33,16 53,17 23,18 1,20 18,21 5,24 20,25 6,26 1,28 5,32 29,34 1,36 0.075,37 4,38 44.5,39 48.902,40 54.757,41 34.978,42 33.149,43 2,44 5.398}
{0 CHEMBL1760795,1 8.359,2 46,3 40,4 1.005,5 1.119,6 0.709,7 0.677,8 417.93,9 10,10 23,11 50,13 23,14 34,16 54,17 23,18 1,20 18,21 5,24 20,25 7,26 1,28 5,29 1,32 30,34 1,35 2,36 0.074,37 4,38 45.5,39 50.229,40 55.967,41 35.432,42 33.864,43 2,44 5.398}
{0 CHEMBL1760796,1 8.906,2 46.9,3 38.8,4 1.005,5 1.116,6 0.731,7 0.693,8 436.37,9 10.2,10 23,11 49,13 23,14 34,16 53,17 23,18 2,20 18,21 5,24 19,25 7,26 2,28 5,32 30,34 2,36 0.075,37 4,38 45.5,39 49.225,40 54.701,41 35.836,42 33.976,43 4.1,44 5.398}
{0 CHEMBL1760797,1 8.175,2 45.1,3 41.2,4 1,5 1.123,6 0.706,7 0.67,8 416.95,9 11.8,10 23,11 51,13 23,14 34,16 55,17 23,18 1,20 18,21 5,24 21,25 7,26 1,28 6,32 30,34 1,36 0.073,37 4,38 45.5,39 51.003,40 57.255,41 35.983,42 34.17,43 2,44 5.398}
{0 CHEMBL1760798,1 8.317,2 46.8,3 40.4,4 1.003,5 1.116,6 0.711,7 0.677,8 390.9,9 8.5,10 22,11 47,13 22,14 32,16 51,17 22,18 1,20 17,21 5,24 19,25 6,26 1,28 4,29 1,32 28,34 1,35 2.1,36 0.078,37 4,38 43,39 47.127,40 52.468,41 33.426,42 31.842,43 2.1,44 5.398}
{0 CHEMBL1760799,1 7.905,2 45.3,3 43.4,4 0.998,5 1.119,6 0.697,7 0.658,8 418.96,9 7.5,10 22,11 53,13 22,14 34,16 57,17 24,18 1,20 17,21 7,24 23,25 6,26 1,28 4,29 1,32 30,34 1,35 1.9,36 0.07,37 4,38 45,39 52.894,40 59.299,41 36.949,42 34.896,43 1.9,44 5.398}
{0 CHEMBL1760800,1 8.317,2 46.8,3 40.4,4 1.003,5 1.116,6 0.711,7 0.677,8 390.9,9 8.5,10 22,11 47,13 22,14 32,16 51,17 22,18 1,20 17,21 5,24 19,25 6,26 1,28 4,29 1,32 28,34 1,35 2.1,36 0.078,37 4,38 43,39 47.127,40 52.468,41 33.426,42 31.842,43 2.1,44 5.398}
{0 CHEMBL1760801,1 8.458,2 47.9,3 41.7,4 0.993,5 1.106,6 0.737,7 0.684,8 405.98,9 6.3,10 22,11 48,13 22,14 32,16 52,17 23,18 1,20 18,21 5,24 20,25 5,26 2,28 3,31 1,32 28,34 1,36 0.077,37 4,38 43,39 47.658,40 53.096,41 35.375,42 32.82,43 2.1,44 5.886}
{0 CHEMBL1760802,1 8.379,2 48,3 40,4 1.004,5 1.12,6 0.713,7 0.681,8 418.93,9 8,10 23,11 50,13 23,14 34,16 54,17 24,18 1,20 19,21 5,23 1,24 20,25 6,26 1,28 4,32 30,34 2,36 0.074,37 4,38 45.5,39 50.196,40 56.014,41 35.671,42 34.038,43 4,44 5.398}
{0 CHEMBL1760803,1 7.981,2 46.3,3 42.6,4 0.998,5 1.117,6 0.703,7 0.665,8 430.97,9 7.4,10 23,11 54,13 23,14 35,16 58,17 25,18 1,20 19,21 6,24 23,25 6,26 1,28 4,29 1,32 31,34 1,35 1.9,36 0.086,37 5,38 46.5,39 53.894,40 60.299,41 37.949,42 35.896,43 1.9,44 5.398}
{0 CHEMBL1760804,1 8.175,2 47.1,3 41.2,4 1,5 1.115,6 0.71,7 0.674,8 416.94,9 7.8,10 23,11 51,13 23,14 34,16 55,17 24,18 1,20 19,21 5,24 21,25 6,26 1,28 4,29 1,32 30,34 1,35 2,36 0.073,37 4,38 45.5,39 51.011,40 56.883,41 36.188,42 34.369,43 2,44 5.398}
{0 CHEMBL1760805,1 8.57,2 46.9,3 38.8,4 1.008,5 1.124,6 0.713,7 0.684,8 419.92,9 10.2,10 23,11 49,13 23,14 34,16 53,17 23,18 1,20 18,21 5,23 1,24 19,25 7,26 1,28 5,32 30,34 2,36 0.075,37 4,38 45.5,39 49.414,40 55.097,41 34.915,42 33.532,43 4.1,44 5.398}
{0 CHEMBL1760806,1 8.829,2 45.3,3 37.7,4 1.021,5 1.133,6 0.699,7 0.682,8 467.94,9 9.4,10 23,11 53,13 23,14 37,16 57,17 24,18 1,20 18,21 6,23 2,24 20,25 9,26 1,28 5,29 1,32 33,34 3,35 1.9,36 0.088,37 5,38 48.5,39 54.138,40 60.061,41 37.068,42 36.157,43 5.7,44 5.398}
{0 CHEMBL1760807,1 8.395,2 45.3,3 39.6,4 1.006,5 1.122,6 0.706,7 0.677,8 444.96,9 11.3,10 23,11 53,13 24,14 36,16 57,17 24,18 1,20 19,21 5,22 1,24 21,25 8,26 1,28 6,29 1,32 32,34 1,35 1.9,36 0.088,37 5,38 48.5,39 53.331,40 59.465,41 37.438,42 35.885,43 1.9,44 5.398}
{0 CHEMBL1760808,1 8.366,2 42.9,3 40.8,4 1.011,5 1.126,6 0.692,7 0.665,8 409.91,9 10.2,10 17,11 49,13 19,14 32,16 52,17 21,18 1,20 16,21 5,22 2,24 20,25 8,26 1,28 5,29 2,32 29,34 1,35 4.1,36 0.096,37 5,38 42.5,39 49.556,40 55.176,41 33.887,42 32.579,43 2,44 5.398}
{0 CHEMBL1760809,1 9.273,2 46.9,3 36.7,4 1.015,5 1.123,6 0.73,7 0.701,8 454.36,9 10.2,10 23,11 49,13 23,14 35,16 53,17 23,18 2,20 18,21 5,23 1,24 18,25 8,26 2,28 5,32 31,34 3,36 0.075,37 4,38 46.5,39 49.738,40 55.041,41 35.773,42 34.36,43 6.1,44 5.398}
{0 CHEMBL1761135,1 5.76,2 35,3 58.3,4 0.98,5 1.139,6 0.611,7 0.553,8 345.59,9 5,10 5,11 60,13 5,14 28,16 63,17 21,20 2,21 19,24 35,25 4,28 3,29 1,32 25,35 1.7,36 0.079,37 5,38 30.5,39 58.77,40 68.348,41 36.654,42 33.208,44 6.538}
{0 CHEMBL1761136,1 7.026,2 38.3,3 50,4 1.007,5 1.149,6 0.628,7 0.597,8 421.56,9 5,10 11,11 60,13 11,14 33,16 63,17 23,20 8,21 15,23 3,24 30,25 7,28 3,29 1,32 30,34 3,35 1.7,36 0.095,37 6,38 38.5,39 60.425,40 68.951,41 37.705,42 35.831,43 5,44 6}
{0 CHEMBL1761137,1 7.233,2 39.7,3 48.3,4 1.009,5 1.147,6 0.637,7 0.609,8 419.54,9 5.2,10 11,11 58,13 12,14 33,16 61,17 23,20 9,21 14,22 1,23 3,24 28,25 7,28 3,29 1,32 30,34 3,35 1.7,36 0.098,37 6,38 39.5,39 58.541,40 66.536,41 36.944,42 35.304,43 5.2,44 5.398}
{0 CHEMBL1761138,1 7.179,2 39,3 49.2,4 1.01,5 1.154,6 0.63,7 0.602,8 423.55,9 5.1,10 11,11 59,13 11,14 33,16 62,17 23,20 8,21 15,23 4,24 29,25 7,28 3,32 30,34 4,36 0.097,37 6,38 38.5,39 59.61,40 68.082,41 37.188,42 35.499,43 6.8,44 5.886}
{0 CHEMBL1761139,1 7.484,2 39,3 47.5,4 1.019,5 1.16,6 0.629,7 0.608,8 441.54,9 5.1,10 11,11 59,13 11,14 34,16 62,17 23,20 8,21 15,23 5,24 28,25 8,28 3,32 31,34 5,36 0.097,37 6,38 39.5,39 60.123,40 68.421,41 37.126,42 35.883,43 8.5,44 5.398}
{0 CHEMBL1761140,1 7.026,2 38.3,3 50,4 1.007,5 1.149,6 0.628,7 0.597,8 421.56,9 5,10 11,11 60,13 11,14 33,16 63,17 23,20 8,21 15,23 3,24 30,25 7,28 3,29 1,32 30,34 3,35 1.7,36 0.111,37 7,38 38.5,39 60.425,40 68.951,41 37.705,42 35.831,43 5,44 5.398}
{0 CHEMBL1761141,1 7.287,2 38.9,3 48.1,4 1.012,5 1.15,6 0.633,7 0.607,8 393.5,9 5.6,10 11,11 54,13 11,14 31,16 57,17 21,20 8,21 13,23 3,24 26,25 7,28 3,29 1,32 28,34 3,35 1.9,36 0.088,37 5,38 36.5,39 54.658,40 62.121,41 34.182,42 32.777,43 5.6,44 5.398}
{0 CHEMBL1761142,1 8.207,2 43.1,3 43.1,4 1.017,5 1.139,6 0.673,7 0.648,8 475.98,9 5.2,10 17,11 58,13 17,14 37,16 62,17 25,18 1,20 14,21 11,23 3,24 25,25 8,26 1,28 3,29 1,32 33,34 4,35 1.7,36 0.081,37 5,38 45.5,39 58.981,40 66.065,41 39.04,42 37.605,43 6.9,44 6.337}
{0 CHEMBL1761143,1 8.119,2 40.6,3 43.8,4 1.02,5 1.139,6 0.664,7 0.639,8 519.64,9 4.7,10 17,11 64,13 19,14 40,16 68,17 26,20 14,21 12,22 2,23 3,24 28,25 10,26 1,28 3,29 3,31 1,32 36,34 3,35 4.7,36 0.088,37 6,38 50.5,39 65.272,40 72.875,41 42.5,42 40.921,43 4.7,44 5.398}
{0 CHEMBL1761144,1 8.047,2 36.4,3 45.5,4 1.023,5 1.152,6 0.646,7 0.621,8 442.56,9 7.3,10 11,11 55,13 13,14 33,16 58,17 20,20 8,21 12,22 2,23 3,24 25,25 10,26 1,28 4,29 2,31 1,32 30,34 3,35 3.6,36 0.086,37 5,38 40.5,39 56.28,40 63.334,41 35.529,42 34.174,43 5.5,44 5.398}
{0 CHEMBL1761309,1 7.872,2 36.2,3 46.6,4 1.02,5 1.151,6 0.643,7 0.616,8 456.59,9 6.9,10 11,11 58,13 13,14 34,16 61,17 21,20 8,21 13,22 2,23 3,24 27,25 10,26 1,28 4,29 2,31 1,32 31,34 3,35 3.4,36 0.098,37 6,38 41.5,39 59.163,40 66.749,41 37.29,42 35.701,43 5.2,44 5.398}
{0 CHEMBL1761310,1 7.715,2 36.1,3 47.5,4 1.017,5 1.15,6 0.64,7 0.61,8 470.62,9 6.6,10 11,11 61,13 13,14 35,16 64,17 22,20 8,21 14,22 2,23 3,24 29,25 10,26 1,28 4,29 2,31 1,32 32,34 3,35 3.3,36 0.109,37 7,38 42.5,39 62.047,40 70.164,41 39.052,42 37.227,43 4.9,44 5.398}
{0 CHEMBL1761311,1 7.432,2 38.6,3 49.1,4 1.005,5 1.145,6 0.652,7 0.61,8 423.6,9 5.3,10 11,11 57,13 11,14 32,16 60,17 22,20 8,21 14,23 3,24 28,25 7,26 1,28 3,31 1,32 29,34 3,36 0.1,37 6,38 37.5,39 57.29,40 65.247,41 37.137,42 34.776,43 5.3,44 5.398}
{0 CHEMBL1761312,1 7.579,2 37.9,3 48.3,4 1.011,5 1.146,6 0.648,7 0.612,8 439.6,9 5.2,10 11,11 58,13 12,14 33,16 61,17 22,20 8,21 14,22 1,23 3,24 28,25 8,26 1,28 3,29 1,31 1,32 30,34 3,35 1.7,36 0.098,37 6,38 39.5,39 58.618,40 66.456,41 37.591,42 35.491,43 5.2,44 5.398}
{0 CHEMBL1761313,1 7.722,2 37.3,3 47.5,4 1.016,5 1.147,6 0.645,7 0.614,8 455.6,9 5.1,10 11,11 59,13 13,14 34,16 62,17 22,20 8,21 14,22 2,23 3,24 28,25 9,26 1,28 3,29 2,31 1,32 31,34 3,35 3.4,36 0.097,37 6,38 41.5,39 59.945,40 67.666,41 38.046,42 36.206,43 5.1,44 5.398}
{0 CHEMBL1761314,1 7.885,2 37.5,3 46.4,4 1.019,5 1.147,6 0.648,7 0.619,8 441.57,9 5.4,10 11,11 56,13 13,14 33,16 59,17 21,20 8,21 13,22 2,23 3,24 26,25 9,26 1,28 3,29 2,31 1,32 30,34 3,35 3.6,36 0.085,37 5,38 40.5,39 57.061,40 64.25,41 36.285,42 34.679,43 5.4,44 5.398}
{0 CHEMBL1761315,1 7.575,2 37.1,3 48.4,4 1.013,5 1.146,6 0.642,7 0.609,8 469.63,9 4.8,10 11,11 62,13 13,14 35,16 65,17 23,20 8,21 15,22 2,23 3,24 30,25 9,26 1,28 3,29 2,31 1,32 32,34 3,35 3.2,36 0.108,37 7,38 42.5,39 62.829,40 71.081,41 39.807,42 37.733,43 4.8,44 5.398}
{0 CHEMBL1761316,1 7.575,2 37.1,3 48.4,4 1.013,5 1.146,6 0.642,7 0.609,8 469.63,9 4.8,10 11,11 62,13 13,14 35,16 65,17 23,20 8,21 15,22 2,23 3,24 30,25 9,26 1,28 3,29 2,31 1,32 32,34 3,35 3.2,36 0.092,37 6,38 42.5,39 62.829,40 71.081,41 39.807,42 37.733,43 4.8,44 5.398}
{0 CHEMBL1761317,1 7.441,2 36.9,3 49.2,4 1.011,5 1.146,6 0.64,7 0.604,8 483.66,9 4.6,10 11,11 65,13 13,14 36,16 68,17 24,20 8,21 16,22 2,23 3,24 32,25 9,26 1,28 3,29 2,31 1,32 33,34 3,35 3.1,36 0.088,37 6,38 43.5,39 65.712,40 74.496,41 41.569,42 39.26,43 4.6,44 5.398}
{0 CHEMBL1761318,1 7.994,2 41.3,3 44.4,4 1.015,5 1.138,6 0.667,7 0.638,8 503.64,9 4.8,10 17,11 63,13 19,14 39,16 67,17 26,20 14,21 12,22 2,23 3,24 28,25 9,26 1,28 3,29 2,31 1,32 35,34 3,35 3.2,36 0.09,37 6,38 49.5,39 63.945,40 71.666,41 42.046,42 40.206,43 4.8,44 5.398}
{0 CHEMBL1761319,1 8.849,2 37.5,3 41.1,4 1.046,5 1.166,6 0.645,7 0.64,8 495.54,9 5.4,10 11,11 56,13 13,14 36,16 59,17 21,20 8,21 13,22 2,23 6,24 23,25 12,26 1,28 3,29 2,31 1,32 33,34 6,35 3.6,36 0.085,37 5,38 43.5,39 58.599,40 65.27,41 36.097,42 35.829,43 10.7,44 5.398}
{0 CHEMBL1761320,1 8.637,2 37.3,3 42.4,4 1.042,5 1.164,6 0.642,7 0.633,8 509.57,9 5.1,10 11,11 59,13 13,14 37,16 62,17 22,20 8,21 14,22 2,23 6,24 25,25 12,26 1,28 3,29 2,31 1,32 34,34 6,35 3.4,36 0.097,37 6,38 44.5,39 61.483,40 68.685,41 37.858,42 37.356,43 10.2,44 5.796}
{0 CHEMBL1761321,1 7.885,2 37.5,3 46.4,4 1.019,5 1.147,6 0.648,7 0.619,8 441.57,9 5.4,10 11,11 56,13 13,14 33,16 59,17 21,20 8,21 13,22 2,23 3,24 26,25 9,26 1,28 3,29 2,31 1,32 30,34 3,35 3.6,36 0.085,37 5,38 40.5,39 57.061,40 64.25,41 36.285,42 34.679,43 5.4,44 5.398}
{0 CHEMBL1761322,1 7.575,2 37.1,3 48.4,4 1.013,5 1.146,6 0.642,7 0.609,8 469.63,9 4.8,10 11,11 62,13 13,14 35,16 65,17 23,20 8,21 15,22 2,23 3,24 30,25 9,26 1,28 3,29 2,31 1,32 32,34 3,35 3.2,36 0.108,37 7,38 42.5,39 62.829,40 71.081,41 39.807,42 37.733,43 4.8,44 5.398}
{0 CHEMBL1761323,1 7.441,2 36.9,3 49.2,4 1.011,5 1.146,6 0.64,7 0.604,8 483.66,9 4.6,10 11,11 65,13 13,14 36,16 68,17 24,20 8,21 16,22 2,23 3,24 32,25 9,26 1,28 3,29 2,31 1,32 33,34 3,35 3.1,36 0.118,37 8,38 43.5,39 65.712,40 74.496,41 41.569,42 39.26,43 4.6,44 5.398}
{0 CHEMBL1761324,1 7.536,2 37.5,3 50,4 0.997,5 1.128,6 0.667,7 0.614,8 422.04,9 5.4,10 11,11 56,13 13,14 31,16 59,17 21,18 1,20 8,21 13,22 2,24 28,25 7,26 2,28 3,29 2,31 1,32 28,34 1,35 3.6,36 0.102,37 6,38 38.5,39 55.847,40 63.175,41 37.33,42 34.357,43 1.8,44 5.398}
{0 CHEMBL1761325,1 7.536,2 37.5,3 50,4 0.997,5 1.128,6 0.667,7 0.614,8 422.04,9 5.4,10 11,11 56,13 13,14 31,16 59,17 21,18 1,20 8,21 13,22 2,24 28,25 7,26 2,28 3,29 2,31 1,32 28,34 1,35 3.6,36 0.102,37 6,38 38.5,39 55.847,40 63.175,41 37.33,42 34.357,43 1.8,44 5.398}
{0 CHEMBL1761326,1 7.536,2 37.5,3 50,4 0.997,5 1.128,6 0.667,7 0.614,8 422.04,9 5.4,10 11,11 56,13 13,14 31,16 59,17 21,18 1,20 8,21 13,22 2,24 28,25 7,26 2,28 3,29 2,31 1,32 28,34 1,35 3.6,36 0.102,37 6,38 38.5,39 55.847,40 63.175,41 37.33,42 34.357,43 1.8,44 5.398}
{0 CHEMBL1761327,1 7.685,2 36.8,3 49.1,4 1.003,5 1.13,6 0.663,7 0.615,8 438.04,9 5.3,10 11,11 57,13 13,14 32,16 60,17 21,18 1,20 8,21 13,22 2,24 28,25 8,26 2,28 3,29 3,31 1,32 29,34 1,35 5.3,36 0.1,37 6,38 39.5,39 57.174,40 64.385,41 37.784,42 35.072,43 1.8,44 5.398}
{0 CHEMBL1761328,1 8.33,2 37.5,3 50,4 0.996,5 1.126,6 0.675,7 0.617,8 466.49,9 5.4,10 11,11 56,13 13,14 31,15 1,16 59,17 21,20 8,21 13,22 2,24 28,25 7,26 2,28 3,29 2,31 1,32 28,34 1,35 3.6,36 0.102,37 6,38 38.5,39 55.752,40 63.073,41 37.824,42 34.555,43 1.8,44 5.398}
{0 CHEMBL1761329,1 6.807,2 37.3,3 52.5,4 0.99,5 1.13,6 0.648,7 0.594,8 401.63,9 5.1,10 11,11 59,13 13,14 31,16 62,17 22,20 8,21 14,22 2,24 31,25 6,26 1,28 3,29 2,31 1,32 28,35 3.4,36 0.097,37 6,38 38.5,39 58.407,40 66.647,41 38.233,42 35.056,44 5.398}
{0 CHEMBL1761330,1 7.243,2 37.5,3 50,4 1.001,5 1.135,6 0.65,7 0.606,8 405.59,9 5.4,10 11,11 56,13 13,14 31,16 59,17 21,20 8,21 13,22 2,23 1,24 28,25 7,26 1,28 3,29 2,31 1,32 28,34 1,35 3.6,36 0.102,37 6,38 38.5,39 56.036,40 63.571,41 36.41,42 33.913,43 1.8,44 5.398}
{0 CHEMBL1761843,1 7.097,2 39.1,3 47.8,4 1,5 1.134,6 0.647,7 0.614,8 326.44,9 8.7,10 11,11 46,13 12,14 27,16 49,17 18,20 10,21 8,22 1,24 22,25 6,28 4,29 2,32 24,35 4.3,36 0.02,37 1,38 33.5,39 46.014,40 52.149,41 29.784,42 28.256,44 8}
{0 CHEMBL1761844,1 6.899,2 40,3 48.9,4 0.993,5 1.132,6 0.652,7 0.612,8 310.44,9 8.9,10 11,11 45,13 12,14 26,16 48,17 18,20 10,21 8,22 1,24 22,25 5,28 4,29 1,32 23,35 2.2,36 0.021,37 1,38 32.5,39 44.687,40 50.939,41 29.33,42 27.542,44 8}
{0 CHEMBL1761869,1 7.645,2 42.9,3 42.9,4 1.003,5 1.128,6 0.676,7 0.648,8 481.61,9 11.1,10 23,11 63,13 24,14 41,16 68,17 27,20 20,21 7,22 1,24 27,25 9,28 7,29 2,32 36,35 3.2,36 0.059,37 4,38 53.5,39 63.203,40 71.059,41 42.563,42 40.847,44 5}
{0 CHEMBL1800134,1 7.835,2 42.9,3 44.9,4 1.002,5 1.123,6 0.682,7 0.645,8 383.91,9 6.1,10 16,11 49,13 16,14 31,16 53,17 21,18 1,20 12,21 9,24 22,25 6,26 1,28 3,29 2,32 27,34 1,35 4.1,36 0.057,37 3,38 39,39 49.12,40 55.01,41 33.398,42 31.589,43 2,44 5.599}
{0 CHEMBL1829763,1 7.991,2 45.6,3 42.1,4 1.019,5 1.132,6 0.668,7 0.652,8 455.51,9 1.8,10 18,11 57,13 19,14 36,16 60,17 26,20 19,21 7,22 1,23 3,24 24,25 7,28 1,29 3,32 33,34 3,35 5.3,36 0.1,37 6,38 46,39 58.109,40 64.543,41 38.08,42 37.164,43 5.3,44 5}
{0 CHEMBL1911698,1 8.401,2 51.2,3 39,4 0.995,5 1.098,6 0.743,7 0.698,8 344.46,9 4.9,10 18,11 41,13 19,14 28,16 44,17 21,19 1,20 17,21 3,24 16,25 4,26 1,28 2,29 1,31 1,32 25,33 1,35 2.4,36 0.068,37 3,38 39,39 40.793,40 45.032,41 30.443,42 28.632,44 6.413}
{0 CHEMBL1927953,1 6.859,2 35,3 51.7,4 1.014,5 1.135,6 0.607,7 0.581,8 823.04,11 120,13 5,14 64,16 126,17 42,20 6,21 36,22 5,24 62,25 16,29 16,32 58,35 13.3,36 0.056,37 7,38 69,39 121.628,40 136.222,41 72.875,42 69.768,44 9.277}
{0 CHEMBL200351,1 6.567,2 36.5,3 51.9,4 0.991,5 1.14,6 0.632,7 0.589,8 341.51,9 9.6,10 10,11 52,13 10,14 29,16 56,17 19,20 4,21 15,24 27,25 6,28 5,29 1,32 25,35 1.9,36 0.036,37 2,38 34,39 51.556,40 59.268,41 32.858,42 30.617,44 5.398}
{0 CHEMBL200513,1 5.586,2 35.6,3 59.3,4 0.974,5 1.138,6 0.614,7 0.551,8 329.59,9 5.1,10 5,11 59,13 5,14 27,16 62,17 21,20 2,21 19,24 35,25 3,28 3,32 24,36 0.081,37 5,38 29.5,39 57.443,40 67.138,41 36.2,42 32.493,44 6.742}
{0 CHEMBL200876,1 6.35,2 36,3 54,4 0.991,5 1.138,6 0.621,7 0.576,8 317.48,9 6,10 5,11 50,13 6,14 26,16 53,17 18,20 3,21 15,22 1,24 27,25 5,28 3,29 2,32 23,35 4,36 0.057,37 3,38 29.5,39 49.563,40 56.896,41 31.063,42 28.815,44 5.398}
{0 CHEMBL2023584,1 7.736,2 35.9,3 48.4,4 1.008,5 1.133,6 0.656,7 0.615,8 495.1,9 6.3,10 6,11 64,13 10,14 37,16 68,17 23,18 1,20 8,21 15,22 4,24 31,25 10,26 2,28 4,29 4,31 1,32 33,34 1,35 6.3,36 0.059,37 4,38 44,39 64.487,40 72.508,41 42.006,42 39.335,43 1.6,44 5.658}
{0 CHEMBL2023585,1 7.668,2 34.9,3 49.2,4 1.008,5 1.135,6 0.651,7 0.608,8 483.09,9 6.3,10 6,11 63,13 10,14 35,16 66,17 22,18 1,20 8,21 14,22 4,24 31,25 10,26 2,28 4,29 4,31 1,32 32,34 1,35 6.3,36 0.045,37 3,38 42,39 63.487,40 71.508,41 41.006,42 38.335,43 1.6,44 6.066}
{0 CHEMBL2023587,1 7.664,2 36.8,3 48.5,4 1.005,5 1.131,6 0.658,7 0.616,8 521.14,9 5.9,10 6,11 68,13 10,14 40,16 73,17 25,18 1,20 8,21 17,22 4,24 33,25 10,26 2,28 4,29 4,31 1,32 35,34 1,35 5.9,36 0.041,37 3,38 47,39 68.371,40 76.923,41 44.767,42 41.861,43 1.5,44 6.143}
{0 CHEMBL2035568,1 5.884,2 37.5,3 57.5,4 0.983,5 1.13,6 0.617,7 0.562,8 470.76,11 80,13 3,14 38,16 84,17 30,20 4,21 26,22 3,24 46,25 4,29 4,32 34,35 5,36 0.071,37 6,38 41,39 78.632,40 90.387,41 49.33,42 44.976,44 4}
{0 CHEMBL2035569,1 5.774,2 35.3,3 58.8,4 0.985,5 1.134,6 0.604,7 0.55,8 490.8,11 85,13 1,14 39,16 89,17 30,20 1,21 29,22 1,24 50,25 5,29 5,32 35,35 5.9,36 0.067,37 6,38 40,39 83.727,40 96.427,41 51.307,42 46.744,44 6.398}
{0 CHEMBL206908,1 8.641,2 44.2,3 42.3,4 1.017,5 1.114,6 0.695,7 0.664,8 449.35,10 12,11 52,13 15,14 32,16 54,17 23,18 2,20 16,21 7,22 3,24 22,25 7,26 2,29 5,32 30,34 2,35 9.6,36 0.13,37 7,38 41,39 52.887,40 57.917,41 36.125,42 34.551,43 3.8,44 4.523}
{0 CHEMBL2070227,1 7.205,2 45.7,3 45.7,4 0.991,5 1.118,6 0.681,7 0.642,8 331.45,9 6.5,10 16,11 46,13 17,14 29,16 50,17 21,20 14,21 7,22 1,24 21,25 4,28 3,29 1,32 25,35 2.2,36 0.06,37 3,38 38,39 45.585,40 51.441,41 31.324,42 29.52,44 5}
{0 CHEMBL2070230,1 7.665,2 43.8,3 45.8,4 0.996,5 1.121,6 0.686,7 0.643,8 367.91,9 6.3,10 16,11 48,13 17,14 29,16 51,17 21,18 1,20 14,21 7,22 1,24 22,25 5,26 1,28 3,29 1,32 26,34 1,35 2.1,36 0.059,37 3,38 38,39 47.792,40 53.8,41 32.944,42 30.875,43 2.1,44 5}
{0 CHEMBL207413,1 6.033,2 37.6,3 56.5,4 0.986,5 1.13,6 0.618,7 0.567,8 512.8,11 85,13 4,14 41,16 89,17 32,20 5,21 27,22 4,24 48,25 5,29 5,32 37,35 5.9,36 0.034,37 3,38 45,39 83.843,40 96.012,41 52.546,42 48.217,44 6.411}
{0 CHEMBL211039,1 6.321,2 37.7,3 54.5,4 0.994,5 1.13,6 0.62,7 0.576,8 486.71,11 77,13 5,14 38,16 80,17 29,20 6,21 23,22 5,24 42,25 6,29 6,32 35,35 7.8,36 0.075,37 6,38 43,39 76.519,40 86.976,41 47.716,42 44.352,44 5.403}
{0 CHEMBL2152223,1 7.534,2 37.1,3 50,4 1.003,5 1.128,6 0.657,7 0.61,8 467.08,9 3.2,10 6,11 62,13 9,14 35,16 66,17 23,18 1,20 7,21 16,22 3,24 31,25 8,26 2,28 2,29 4,31 1,32 31,34 1,35 6.5,36 0.061,37 4,38 41,39 62.167,40 69.926,41 40.756,42 37.819,43 1.6,44 5.658}
{0 CHEMBL2152237,1 7.338,2 39.1,3 48.4,4 1.001,5 1.126,6 0.658,7 0.617,8 469.66,9 4.7,10 11,11 64,13 14,14 38,16 69,17 25,20 10,21 15,22 3,24 31,25 8,26 1,28 3,29 4,31 1,32 33,35 6.3,36 0.058,37 4,38 46.5,39 64.061,40 72.065,41 42.142,42 39.486,44 5}
{0 CHEMBL2153191,1 6.769,2 35.5,3 53.2,4 0.994,5 1.133,6 0.636,7 0.585,8 419.65,9 4.8,10 6,11 62,13 8,14 31,16 64,17 22,20 7,21 15,22 2,24 33,25 7,26 1,28 3,29 3,31 1,32 29,35 4.8,36 0.125,37 8,38 36,39 61.618,40 70.271,41 39.449,42 36.298,44 4.523}
{0 CHEMBL2158485,1 6.755,2 37.3,3 50.8,4 0.998,5 1.136,6 0.632,7 0.595,8 398.56,9 6.8,10 6,11 59,13 7,14 34,16 64,17 22,20 5,21 17,22 1,24 30,25 7,28 4,29 3,32 29,35 5.1,36 0.063,37 4,38 38,39 58.876,40 67.019,41 37.285,42 35.078,44 4.523}
{0 CHEMBL216783,1 7.322,2 35.9,3 48.4,4 1.018,5 1.154,6 0.619,7 0.598,8 468.58,9 6.3,10 6,11 64,13 8,14 36,16 67,17 23,20 7,21 16,22 2,23 3,24 31,25 10,28 4,29 3,32 33,34 3,35 4.7,36 0.075,37 5,38 41,39 65.181,40 73.869,41 39.62,42 38.282,43 4.7,44 4.523}
{0 CHEMBL216976,1 6.618,2 36.2,3 52.2,4 0.998,5 1.137,6 0.624,7 0.585,8 456.65,9 5.8,10 6,11 69,13 8,14 37,16 73,17 25,20 7,21 18,22 2,24 36,25 8,28 4,29 4,32 33,35 5.8,36 0.096,37 7,38 42,39 68.854,40 78.474,41 43.023,42 40.374,44 4}
{0 CHEMBL216977,1 6.434,2 35.6,3 53.4,4 0.993,5 1.139,6 0.621,7 0.578,8 469.7,9 6.8,10 6,11 73,13 8,14 38,16 77,17 26,20 7,21 19,22 2,24 39,25 8,28 5,29 3,32 34,35 4.1,36 0.091,37 7,38 43,39 72.512,40 83.178,41 45.336,42 42.207,44 4}
{0 CHEMBL2177609,1 6.8,2 40.3,3 50,4 0.994,5 1.128,6 0.646,7 0.606,8 421.59,9 4.8,10 11,11 62,13 13,14 35,16 66,17 25,20 11,21 14,22 2,24 31,25 6,28 3,29 3,32 31,35 4.8,36 0.076,37 5,38 42.5,39 61.658,40 69.936,41 40.04,42 37.584,44 4.523}
{0 CHEMBL2179014,1 6.563,2 36.9,3 52.3,4 0.995,5 1.136,6 0.628,7 0.587,8 426.62,9 6.2,10 6,11 65,13 7,14 36,16 70,17 24,20 5,21 19,22 1,24 34,25 7,28 4,29 3,32 31,35 4.6,36 0.071,37 5,38 40,39 64.643,40 73.849,41 40.807,42 38.132,44 4.523}
{0 CHEMBL217917,1 6.816,2 38.6,3 50.9,4 1.001,5 1.136,6 0.631,7 0.596,8 388.53,9 3.5,10 6,11 57,13 7,14 32,16 61,17 22,20 7,21 15,22 1,23 1,24 29,25 6,28 2,29 3,32 28,34 1,35 5.3,36 0.082,37 5,38 36,39 57.069,40 64.777,41 35.972,42 33.946,43 1.8,44 4.252}
{0 CHEMBL2179452,1 6.563,2 36.9,3 52.3,4 0.995,5 1.136,6 0.628,7 0.587,8 426.62,9 6.2,10 6,11 65,13 7,14 36,16 70,17 24,20 5,21 19,22 1,24 34,25 7,28 4,29 3,32 31,35 4.6,36 0.071,37 5,38 40,39 64.643,40 73.849,41 40.807,42 38.132,44 4.523}
{0 CHEMBL218119,1 6.843,2 38.3,3 50,4 0.998,5 1.134,6 0.638,7 0.601,8 410.57,9 6.7,10 6,11 60,13 9,14 33,16 63,17 23,19 1,20 7,21 15,22 2,24 30,25 7,28 4,29 3,32 30,33 1,35 5,36 0.079,37 5,38 40,39 59.876,40 68.019,41 38.284,42 36.078,44 4}
{0 CHEMBL218120,1 6.804,2 39.7,3 50,4 0.995,5 1.13,6 0.644,7 0.605,8 462.65,9 5.9,10 11,11 68,13 13,14 39,16 73,17 27,20 11,21 16,22 2,24 34,25 7,28 4,29 3,32 34,35 4.4,36 0.082,37 6,38 46.5,39 67.643,40 76.849,41 43.807,42 41.132,44 5.745}
{0 CHEMBL218143,1 7.309,2 36.7,3 48.3,4 1.016,5 1.154,6 0.623,7 0.601,8 438.55,9 6.7,10 6,11 60,13 7,14 35,16 64,17 22,20 6,21 16,22 1,23 3,24 29,25 9,28 4,29 2,32 31,34 3,35 3.3,36 0.063,37 4,38 39,39 60.97,40 69.244,41 37.404,42 36.04,43 5,44 4}
{0 CHEMBL218246,1 7.056,2 35.9,3 50,4 1.01,5 1.155,6 0.621,7 0.592,8 451.6,9 7.8,10 6,11 64,13 8,14 34,16 66,17 23,19 1,20 6,21 16,22 1,23 3,24 32,25 9,28 5,29 1,32 32,33 1,34 3,35 1.6,36 0.061,37 4,38 40,39 64.628,40 73.948,41 39.716,42 37.874,43 4.7,44 4.523}
{0 CHEMBL218247,1 7.194,2 35.4,3 49.2,4 1.015,5 1.156,6 0.618,7 0.594,8 467.6,9 7.7,10 6,11 65,13 8,14 36,16 68,17 23,20 7,21 16,22 2,23 3,24 32,25 10,28 5,29 2,32 33,34 3,35 3.1,36 0.074,37 5,38 41,39 65.956,40 75.157,41 40.171,42 38.588,43 4.6,44 4.046}
{0 CHEMBL218285,1 6.129,2 40.5,3 54.8,4 0.98,5 1.126,6 0.639,7 0.584,8 257.41,9 2.4,10 6,11 42,13 7,14 21,16 44,17 17,20 7,21 10,22 1,24 23,25 2,28 1,29 1,32 19,35 2.4,36 0.068,37 3,38 25,39 41.149,40 47.275,41 26.836,42 24.531,44 5}
{0 CHEMBL218286,1 6.19,2 42,3 54,4 0.978,5 1.122,6 0.647,7 0.592,8 309.49,9 2,10 6,11 50,13 7,14 27,16 54,17 21,20 7,21 14,22 1,24 27,25 2,28 1,29 1,32 23,35 2,36 0.056,37 3,38 31,39 48.916,40 56.105,41 32.358,42 29.585,44 5}
{0 CHEMBL218358,1 7.467,2 37.3,3 47.5,4 1.02,5 1.159,6 0.625,7 0.605,8 440.54,9 6.8,10 6,11 59,13 7,14 35,16 63,17 22,20 6,21 16,22 1,23 4,24 28,25 9,28 4,29 1,32 31,34 4,35 1.7,36 0.063,37 4,38 39,39 60.156,40 68.374,41 36.887,42 35.709,43 6.8,44 4}
{0 CHEMBL218569,1 6.957,2 38.6,3 49.1,4 1,5 1.133,6 0.641,7 0.606,8 396.54,9 7,10 6,11 57,13 9,14 32,16 60,17 22,19 1,20 7,21 14,22 2,24 28,25 7,28 4,29 3,32 29,33 1,35 5.3,36 0.083,37 5,38 39,39 56.992,40 64.604,41 36.523,42 34.552,44 4.77}
{0 CHEMBL218570,1 7.665,2 37.5,3 45.3,4 1.02,5 1.154,6 0.635,7 0.618,8 490.59,9 9.4,10 11,11 64,13 12,14 40,16 69,17 24,20 7,21 17,22 1,23 3,24 29,25 11,28 6,29 2,32 35,34 3,35 3.1,36 0.072,37 5,38 46.5,39 65.29,40 73.825,41 40.654,42 39.556,43 4.7,44 6.201}
{0 CHEMBL218758,1 6.336,2 34.7,3 55.1,4 0.997,5 1.146,6 0.607,7 0.565,8 310.46,9 4.1,11 49,13 1,14 25,16 52,17 17,20 1,21 16,22 1,23 1,24 27,25 5,28 2,29 2,32 22,34 1,35 4.1,36 0.058,37 3,38 26,39 48.858,40 56.153,41 29.756,42 27.704,43 2,44 4}
{0 CHEMBL218943,1 6.864,2 38.7,3 50,4 1,5 1.131,6 0.637,7 0.602,8 425.58,9 4.8,10 6,11 62,13 9,14 34,16 65,17 24,19 1,20 7,21 16,22 2,24 31,25 7,28 3,29 4,32 31,33 1,35 6.5,36 0.108,37 7,38 41,39 61.985,40 70.145,41 39.495,42 37.299,44 4.523}
{0 CHEMBL219028,1 7.118,2 39,3 50.8,4 1,5 1.127,6 0.646,7 0.604,8 419.99,9 1.7,10 6,11 59,13 8,14 32,16 62,17 23,18 1,20 8,21 15,22 2,24 30,25 6,26 1,28 1,29 4,32 29,34 1,35 6.8,36 0.113,37 7,38 37,39 58.989,40 66.508,41 38.103,42 35.61,43 1.7,44 4}
{0 CHEMBL219049,1 6.928,2 39.3,3 49.2,4 0.998,5 1.131,6 0.644,7 0.608,8 422.58,9 6.6,10 6,11 61,13 9,14 35,16 65,17 24,19 1,20 7,21 16,22 2,24 30,25 7,28 4,29 3,32 31,33 1,35 4.9,36 0.077,37 5,38 42,39 60.876,40 69.019,41 39.284,42 37.078,44 4.638}
{0 CHEMBL219081,1 6.41,2 36.7,3 53.3,4 0.991,5 1.137,6 0.627,7 0.582,8 384.58,9 6.7,10 6,11 60,13 8,14 31,16 63,17 22,20 7,21 15,22 2,24 32,25 6,28 4,29 2,32 28,35 3.3,36 0.095,37 6,38 36,39 59.432,40 68.225,41 37.591,42 34.89,44 4}
{0 CHEMBL219136,1 7.414,2 37.9,3 48.3,4 1.002,5 1.135,6 0.654,7 0.615,8 430,9 8.6,10 11,11 58,13 12,14 34,16 62,17 22,18 1,20 9,21 13,22 1,24 28,25 8,26 1,28 5,29 2,32 30,34 1,35 3.4,36 0.081,37 5,38 40.5,39 58.091,40 65.837,41 37.932,42 35.686,43 1.7,44 4.26}
{0 CHEMBL219137,1 7.263,2 40.4,3 49.1,4 0.996,5 1.127,6 0.661,7 0.617,8 413.99,9 5.3,10 11,11 57,13 12,14 33,16 61,17 23,18 1,20 10,21 13,22 1,24 28,25 6,26 1,28 3,29 2,32 29,34 1,35 3.5,36 0.082,37 5,38 39.5,39 56.771,40 64.255,41 37.682,42 35.17,43 1.8,44 4.959}
{0 CHEMBL219142,1 7.309,2 36.7,3 48.3,4 1.016,5 1.154,6 0.623,7 0.601,8 438.55,9 6.7,10 6,11 60,13 7,14 35,16 64,17 22,20 6,21 16,22 1,23 3,24 29,25 9,28 4,29 2,32 31,34 3,35 3.3,36 0.063,37 4,38 39,39 60.97,40 69.244,41 37.404,42 36.04,43 5,44 4}
{0 CHEMBL219295,1 6.991,2 37.7,3 49.1,4 1.002,5 1.136,6 0.637,7 0.604,8 370.5,9 7.5,10 6,11 53,13 9,14 29,16 55,17 20,19 1,20 7,21 12,22 2,24 26,25 7,28 4,29 3,32 27,33 1,35 5.7,36 0.091,37 5,38 36,39 53.109,40 60.189,41 33.762,42 32.025,44 4}
{0 CHEMBL219348,1 6.946,2 38.1,3 49.2,4 1,5 1.135,6 0.64,7 0.605,8 437.6,9 7.9,10 11,11 63,13 13,14 36,16 67,17 24,20 10,21 14,22 2,24 31,25 8,28 5,29 3,32 32,35 4.8,36 0.104,37 7,38 43.5,39 62.978,40 71.517,41 40.29,42 38.1,44 4}
{0 CHEMBL219349,1 6.795,2 39.3,3 50,4 0.994,5 1.132,6 0.644,7 0.604,8 380.54,9 7.1,10 6,11 56,13 9,14 31,16 59,17 22,19 1,20 7,21 14,22 2,24 28,25 6,28 4,29 2,32 28,33 1,35 3.6,36 0.085,37 5,38 38,39 55.665,40 63.394,41 36.069,42 33.837,44 4}
{0 CHEMBL219403,1 7.083,2 35.3,3 50,4 1.012,5 1.155,6 0.617,7 0.59,8 481.63,9 7.4,10 6,11 68,13 8,14 37,16 71,17 24,20 7,21 17,22 2,23 3,24 34,25 10,28 5,29 2,32 34,34 3,35 2.9,36 0.07,37 5,38 42,39 68.839,40 78.573,41 41.932,42 40.115,43 4.4,44 4.262}
{0 CHEMBL219428,1 7.41,2 41.1,3 48.2,4 1,5 1.124,6 0.663,7 0.623,8 414.97,9 3.6,10 11,11 56,13 12,14 33,16 60,17 23,18 1,20 10,21 13,22 1,24 27,25 6,26 1,28 2,29 3,32 29,34 1,35 5.4,36 0.083,37 5,38 39.5,39 55.996,40 62.966,41 37.131,42 34.863,43 1.8,44 4.824}
{0 CHEMBL219448,1 7.15,2 37.7,3 50.9,4 1,5 1.131,6 0.644,7 0.601,8 378.94,9 3.8,10 6,11 53,13 8,14 28,16 55,17 20,18 1,20 8,21 12,22 2,24 27,25 6,26 1,28 2,29 3,32 26,34 1,35 5.7,36 0.091,37 5,38 33,39 52.996,40 59.966,41 34.131,42 31.863,43 1.9,44 4}
{0 CHEMBL219575,1 7.712,2 40.7,3 45.8,4 1.005,5 1.128,6 0.667,7 0.634,8 455,9 6.8,10 11,11 59,13 13,14 36,16 63,17 24,18 1,19 1,20 10,21 13,22 1,24 27,25 8,26 1,28 4,29 3,32 32,33 1,34 1,35 5.1,36 0.079,37 5,38 44.5,39 59.316,40 66.548,41 39.381,42 37.379,43 1.7,44 4}
{0 CHEMBL219606,1 7.298,2 38,3 50,4 1.002,5 1.131,6 0.647,7 0.607,8 364.91,9 4,10 6,11 50,13 8,14 27,16 52,17 19,18 1,20 8,21 11,22 2,24 25,25 6,26 1,28 2,29 3,32 25,34 1,35 6,36 0.096,37 5,38 32,39 50.112,40 56.551,41 32.37,42 30.336,43 2,44 4}
{0 CHEMBL219614,1 8.812,2 38.7,3 45.2,4 1.012,5 1.129,6 0.694,7 0.648,8 273.18,9 6.5,10 6,11 31,13 7,14 18,16 32,17 12,18 2,20 7,21 5,22 1,24 14,25 5,26 2,28 2,29 1,32 17,34 2,35 3.2,36 0.031,37 1,38 22,39 31.364,40 35,41 21.512,42 20.1,43 6.5,44 5}
{0 CHEMBL219666,1 7.982,2 39,3 48.8,4 1,5 1.128,6 0.678,7 0.626,8 327.28,9 4.9,10 6,11 41,13 7,14 23,16 43,17 16,18 2,20 7,21 9,22 1,24 20,25 5,26 2,28 2,29 1,32 21,34 2,35 2.4,36 0.07,37 3,38 27,39 41.014,40 46.246,41 27.796,42 25.681,43 4.9,44 5}
{0 CHEMBL219712,1 7.342,2 37.7,3 47.8,4 1.015,5 1.149,6 0.629,7 0.606,8 506.63,9 5.8,10 6,11 69,13 8,14 41,16 74,17 26,20 7,21 19,22 2,23 3,24 33,25 10,28 4,29 3,32 36,34 3,35 4.3,36 0.081,37 6,38 46,39 70.065,40 79.284,41 43.381,42 41.809,43 4.3,44 4.62}
{0 CHEMBL219784,1 7.558,2 36.7,3 50,4 1.001,5 1.135,6 0.655,7 0.609,8 453.46,9 6.7,10 6,11 60,13 8,14 33,16 63,17 22,18 2,20 8,21 14,22 2,24 30,25 8,26 2,28 4,29 2,32 30,34 2,35 3.3,36 0.063,37 4,38 38,39 60.08,40 68.113,41 39.307,42 36.545,43 3.3,44 5}
{0 CHEMBL220102,1 6.01,2 35.8,3 56.6,4 0.985,5 1.136,6 0.615,7 0.563,8 318.51,9 3.8,11 53,13 1,14 27,16 57,17 19,20 1,21 18,22 1,24 30,25 4,28 2,29 2,32 23,35 3.8,36 0.053,37 3,38 28,39 52.229,40 60.228,41 32.58,42 29.848,44 5.081}
{0 CHEMBL220153,1 7.274,2 36.8,3 48.5,4 1.016,5 1.151,6 0.623,7 0.6,8 494.62,9 5.9,10 6,11 68,13 8,14 39,16 72,17 25,20 7,21 18,22 2,23 3,24 33,25 10,28 4,29 3,32 35,34 3,35 4.4,36 0.083,37 6,38 44,39 69.065,40 78.284,41 42.381,42 40.809,43 4.4,44 4.187}
{0 CHEMBL220282,1 5.828,2 34.5,3 58.2,4 0.984,5 1.139,6 0.606,7 0.552,8 320.53,9 3.6,11 55,13 1,14 26,16 58,17 19,20 1,21 18,22 1,24 32,25 4,28 2,29 2,32 23,35 3.6,36 0.052,37 3,38 27,39 54.112,40 62.643,41 33.341,42 30.374,44 5.444}
{0 CHEMBL220385,1 8.305,2 42.6,3 44.7,4 1.002,5 1.122,6 0.698,7 0.653,8 390.34,9 6.4,10 12,11 47,13 13,14 29,16 50,17 20,18 2,20 13,21 7,22 1,24 21,25 6,26 2,28 3,29 1,32 26,34 2,35 2.1,36 0.06,37 3,38 36,39 47.116,40 52.744,41 32.801,42 30.702,43 4.3,44 5}
{0 CHEMBL220414,1 7.249,2 39.3,3 50,4 1.002,5 1.127,6 0.649,7 0.609,8 405.96,9 1.8,10 6,11 56,13 8,14 31,16 59,17 22,18 1,20 8,21 14,22 2,24 28,25 6,26 1,28 1,29 4,32 28,34 1,35 7.1,36 0.102,37 6,38 36,39 56.105,40 63.093,41 36.341,42 34.083,43 1.8,44 4.284}
{0 CHEMBL220436,1 8.007,2 40.8,3 46.9,4 1,5 1.126,6 0.685,7 0.637,8 392.36,9 6.1,10 12,11 49,13 13,14 28,16 51,17 20,18 2,20 13,21 7,22 1,24 23,25 6,26 2,28 3,29 1,32 26,34 2,35 2,36 0.059,37 3,38 35,39 49,40 55.16,41 33.563,42 31.229,43 4.1,44 5}
{0 CHEMBL220795,1 8.243,2 39.5,3 47.4,4 1.003,5 1.127,6 0.685,7 0.636,8 313.25,9 5.3,10 6,11 38,13 7,14 22,16 40,17 15,18 2,20 7,21 8,22 1,24 18,25 5,26 2,28 2,29 1,32 20,34 2,35 2.6,36 0.075,37 3,38 26,39 38.131,40 42.831,41 26.034,42 24.154,43 5.3,44 5}
{0 CHEMBL220883,1 7.464,2 37.9,3 47,4 1.018,5 1.15,6 0.631,7 0.61,8 492.6,9 6.1,10 6,11 66,13 8,14 40,16 71,17 25,20 7,21 18,22 2,23 3,24 31,25 10,28 4,29 3,32 35,34 3,35 4.5,36 0.07,37 5,38 45,39 67.181,40 75.869,41 41.62,42 40.282,43 4.5,44 5}
{0 CHEMBL221132,1 6.528,2 40.7,3 51.9,4 0.988,5 1.126,6 0.645,7 0.599,8 352.52,9 3.7,10 6,11 54,13 8,14 30,16 58,17 22,20 8,21 14,22 2,24 28,25 4,28 2,29 2,32 26,35 3.7,36 0.069,37 4,38 35,39 53.345,40 60.813,41 34.819,42 32.321,44 4.523}
{0 CHEMBL221158,1 8.943,2 42.6,3 40.4,4 1.019,5 1.122,6 0.701,7 0.672,8 420.32,9 6.4,10 12,11 47,13 14,14 31,16 50,17 20,18 2,20 14,21 6,22 2,24 19,25 8,26 2,28 3,29 3,32 28,34 2,35 6.4,36 0.04,37 2,38 39,39 47.887,40 52.748,41 32.949,42 31.605,43 4.3,44 5}
{0 CHEMBL221159,1 6.01,2 35.8,3 56.6,4 0.985,5 1.136,6 0.615,7 0.563,8 318.51,9 3.8,11 53,13 1,14 27,16 57,17 19,20 1,21 18,22 1,24 30,25 4,28 2,29 2,32 23,35 3.8,36 0.053,37 3,38 28,39 52.229,40 60.228,41 32.58,42 29.848,44 4}
{0 CHEMBL221261,1 7.289,2 37.5,3 51.6,4 0.996,5 1.132,6 0.654,7 0.603,8 466.5,9 4.7,10 6,11 64,13 8,14 34,16 67,17 24,18 2,20 8,21 16,22 2,24 33,25 7,26 2,28 3,29 2,32 31,34 2,35 3.1,36 0.09,37 6,38 39,39 63.745,40 72.445,41 41.824,42 38.578,43 3.1,44 5}
{0 CHEMBL221284,1 6.843,2 38.3,3 50,4 0.998,5 1.134,6 0.638,7 0.601,8 410.57,9 6.7,10 6,11 60,13 9,14 33,16 63,17 23,19 1,20 7,21 15,22 2,24 30,25 7,28 4,29 3,32 30,33 1,35 5,36 0.079,37 5,38 40,39 59.876,40 68.019,41 38.284,42 36.078,44 4.741}
{0 CHEMBL222256,1 7.717,2 38.2,3 49.1,4 1.002,5 1.131,6 0.664,7 0.618,8 424.41,9 5.5,10 6,11 55,13 8,14 31,16 58,17 21,18 2,20 8,21 13,22 2,24 27,25 7,26 2,28 3,29 2,32 28,34 2,35 3.6,36 0.069,37 4,38 36,39 55.094,40 62.199,41 36.54,42 33.997,43 3.6,44 5}
{0 CHEMBL222317,1 8.09,2 35.4,3 47.9,4 1.014,5 1.137,6 0.656,7 0.618,8 388.33,9 6.3,10 6,11 48,13 8,14 26,16 49,17 17,18 2,20 8,21 9,22 2,24 23,25 8,26 2,28 3,29 3,32 25,34 2,35 6.3,36 0.102,37 5,38 31,39 48.654,40 54.578,41 31.472,42 29.658,43 4.2,44 5}
{0 CHEMBL222319,1 6.613,2 34.5,3 53.4,4 1.004,5 1.152,6 0.607,7 0.572,8 383.54,9 5.2,11 58,13 2,14 30,16 61,17 20,20 2,21 18,22 2,23 2,24 31,25 7,28 3,29 2,32 27,34 2,35 3.4,36 0.082,37 5,38 32,39 58.239,40 66.821,41 35.222,42 33.162,43 3.4,44 5}
{0 CHEMBL222365,1 7.231,2 37.5,3 48.6,4 1.013,5 1.149,6 0.627,7 0.602,8 520.66,9 5.6,10 6,11 72,13 8,14 42,16 77,17 27,20 7,21 20,22 2,23 3,24 35,25 10,28 4,29 3,32 37,34 3,35 4.2,36 0.065,37 5,38 47,39 72.948,40 82.699,41 45.143,42 43.335,43 4.2,44 4.824}
{0 CHEMBL222510,1 7.939,2 41.4,3 46.6,4 1.002,5 1.124,6 0.682,7 0.638,8 460.44,9 5.2,10 12,11 58,13 14,14 34,16 61,17 24,18 2,20 14,21 10,22 2,24 27,25 7,26 2,28 3,29 2,32 31,34 2,35 3.4,36 0.098,37 6,38 42,39 58.094,40 65.199,41 39.54,42 36.997,43 3.4,44 5}
{0 CHEMBL222511,1 7.224,2 37.1,3 48.6,4 1.012,5 1.151,6 0.628,7 0.602,8 505.65,9 7.1,10 6,11 70,13 8,14 41,16 75,17 26,20 7,21 19,22 2,23 3,24 34,25 10,28 5,29 2,32 36,34 3,35 2.9,36 0.067,37 5,38 46,39 70.839,40 80.573,41 43.932,42 42.115,43 4.3,44 4.469}
{0 CHEMBL222576,1 8.167,2 40,3 46,4 1.007,5 1.127,6 0.68,7 0.639,8 408.36,9 6,10 12,11 50,13 13,14 29,16 52,17 20,18 2,20 13,21 7,22 1,24 23,25 7,26 2,28 3,29 2,32 27,34 2,35 4,36 0.058,37 3,38 36,39 50.327,40 56.369,41 34.017,42 31.944,43 4,44 5}
{0 CHEMBL222618,1 7.224,2 37.1,3 48.6,4 1.012,5 1.151,6 0.628,7 0.602,8 505.65,9 7.1,10 6,11 70,13 8,14 41,16 75,17 26,20 7,21 19,22 2,23 3,24 34,25 10,28 5,29 2,32 36,34 3,35 2.9,36 0.08,37 6,38 46,39 70.839,40 80.573,41 43.932,42 42.115,43 4.3,44 4}
{0 CHEMBL222668,1 8.142,2 37.8,3 48.6,4 1.004,5 1.131,6 0.677,7 0.626,8 301.24,9 5.4,10 6,11 37,13 7,14 20,16 38,17 14,18 2,20 7,21 7,22 1,24 18,25 5,26 2,28 2,29 1,32 19,34 2,35 2.7,36 0.026,37 1,38 24,39 37.131,40 41.831,41 25.034,42 23.154,43 5.4,44 5}
{0 CHEMBL222670,1 7.154,2 36.2,3 49.3,4 1.012,5 1.153,6 0.622,7 0.596,8 493.64,9 7.2,10 6,11 69,13 8,14 39,16 73,17 25,20 7,21 18,22 2,23 3,24 34,25 10,28 5,29 2,32 35,34 3,35 2.9,36 0.068,37 5,38 44,39 69.839,40 79.573,41 42.932,42 41.115,43 4.3,44 5}
{0 CHEMBL222938,1 8.34,2 41,3 46.2,4 1.003,5 1.124,6 0.693,7 0.645,8 325.26,9 5.1,10 6,11 39,13 7,14 24,16 42,17 16,18 2,20 7,21 9,22 1,24 18,25 5,26 2,28 2,29 1,32 21,34 2,35 2.6,36 0.024,37 1,38 28,39 39.131,40 43.831,41 27.034,42 25.154,43 5.1,44 5}
{0 CHEMBL223083,1 6.746,2 35.1,3 52.6,4 1.008,5 1.15,6 0.608,7 0.576,8 384.52,9 3.5,11 57,13 2,14 30,16 60,17 20,20 2,21 18,22 2,23 2,24 30,25 7,28 2,29 3,32 27,34 2,35 5.3,36 0.083,37 5,38 32,39 57.465,40 65.532,41 34.671,42 32.856,43 3.5,44 4}
{0 CHEMBL223138,1 7.342,2 37.7,3 47.8,4 1.015,5 1.149,6 0.629,7 0.606,8 506.63,9 5.8,10 6,11 69,13 8,14 41,16 74,17 26,20 7,21 19,22 2,23 3,24 33,25 10,28 4,29 3,32 36,34 3,35 4.3,36 0.068,37 5,38 46,39 70.065,40 79.284,41 43.381,42 41.809,43 4.3,44 4.569}
{0 CHEMBL223373,1 8.429,2 40,3 44.4,4 1.007,5 1.129,6 0.69,7 0.649,8 379.32,9 8.9,10 12,11 45,13 13,14 27,16 47,17 18,18 2,20 12,21 6,22 1,24 20,25 7,26 2,28 4,29 1,32 25,34 2,35 2.2,36 0.043,37 2,38 34,39 45.334,40 50.827,41 31.046,42 29.197,43 4.4,44 5}
{0 CHEMBL223424,1 9.982,2 40.5,3 35.7,4 1.047,5 1.153,6 0.693,7 0.686,8 419.26,9 9.5,10 12,11 42,13 13,14 29,16 44,17 17,18 2,20 12,21 5,22 1,23 3,24 15,25 10,26 2,28 4,29 1,32 27,34 5,35 2.4,36 0.045,37 2,38 36,39 43.989,40 48.431,41 29.097,42 28.82,43 11.9,44 5}
{0 CHEMBL223506,1 8.359,2 38.9,3 44.4,4 1.014,5 1.131,6 0.676,7 0.642,8 451.39,9 7.4,10 12,11 54,13 14,14 32,16 56,17 21,18 2,20 13,21 8,22 2,24 24,25 9,26 2,28 4,29 3,32 30,34 2,35 5.6,36 0.089,37 5,38 40,39 54.756,40 61.077,41 36.478,42 34.68,43 3.7,44 5}
{0 CHEMBL223507,1 9.319,2 39.6,3 39.6,4 1.037,5 1.151,6 0.68,7 0.664,8 447.32,9 8.3,10 12,11 48,13 13,14 31,16 50,17 19,18 2,20 12,21 7,22 1,23 3,24 19,25 10,26 2,28 4,29 1,32 29,34 5,35 2.1,36 0.04,37 2,38 38,39 49.756,40 55.262,41 32.62,42 31.873,43 10.4,44 5}
{0 CHEMBL223804,1 7.338,2 37.3,3 47.8,4 1.014,5 1.152,6 0.629,7 0.606,8 491.62,9 7.5,10 6,11 67,13 8,14 40,16 72,17 25,20 7,21 18,22 2,23 3,24 32,25 10,28 5,29 2,32 35,34 3,35 3,36 0.069,37 5,38 45,39 67.956,40 77.157,41 42.171,42 40.588,43 4.5,44 5}
{0 CHEMBL230006,1 5.884,2 37.5,3 57.5,4 0.983,5 1.13,6 0.617,7 0.562,8 470.76,11 80,13 3,14 38,16 84,17 30,20 4,21 26,22 3,24 46,25 4,29 4,32 34,35 5,36 0.012,37 1,38 41,39 78.632,40 90.387,41 49.33,42 44.976,44 6.59}
{0 CHEMBL2322705,1 10.01,2 36.5,3 36.5,4 1.068,5 1.17,6 0.661,7 0.665,8 520.54,9 3.8,10 11,11 52,13 13,14 35,16 54,17 19,20 10,21 9,22 2,23 7,24 19,25 14,26 2,28 2,29 3,31 2,32 33,34 7,35 5.8,36 0.074,37 4,38 42.5,39 55.53,40 60.825,41 34.37,42 34.566,43 13.5,44 4}
{0 CHEMBL2323017,1 9.706,2 37.5,3 35.7,4 1.069,5 1.172,6 0.646,7 0.663,8 543.51,9 5.4,10 12,11 56,13 15,14 38,16 58,17 21,20 13,21 8,22 3,23 7,24 20,25 15,26 1,28 3,29 4,31 1,32 36,34 7,35 7.1,36 0.086,37 5,38 47,39 59.883,40 65.613,41 36.182,42 37.115,43 12.5,44 4}
{0 CHEMBL2323021,1 10.369,2 35.8,3 34,4 1.077,5 1.172,6 0.662,7 0.675,8 549.54,9 5.7,10 11,11 53,13 14,14 37,16 55,17 19,20 11,21 8,22 3,23 7,24 18,25 16,26 2,28 3,29 4,31 2,32 35,34 7,35 7.5,36 0.091,37 5,38 45.5,39 57.076,40 62.118,41 35.068,42 35.775,43 13.2,44 4}
{0 CHEMBL235762,1 8.96,2 40,3 43.3,4 1.008,5 1.119,6 0.718,7 0.664,8 268.79,9 6.7,10 6,11 30,13 8,14 18,16 31,17 12,18 1,20 8,21 4,22 2,24 13,25 5,26 2,28 2,29 1,31 1,32 17,34 1,35 3.3,36 0.097,37 3,38 23,39 30.233,40 33.561,41 21.54,42 19.933,43 3.3,44 5.6}
{0 CHEMBL238187,1 5.921,2 33.3,3 57.8,4 0.988,5 1.142,6 0.601,7 0.551,8 266.43,9 4.4,11 45,13 2,14 20,16 46,17 15,20 2,21 13,22 2,24 26,25 4,28 2,29 2,32 19,35 4.4,36 0.087,37 4,38 22,39 44.461,40 51.398,41 27.057,42 24.794,44 5}
{0 CHEMBL239373,1 7.764,2 36.4,3 49.1,4 1.007,5 1.129,6 0.659,7 0.614,8 427.01,9 3.6,10 6,11 55,13 9,14 31,16 58,17 20,18 1,20 7,21 13,22 3,24 27,25 8,26 2,28 2,29 4,31 1,32 28,34 1,35 7.3,36 0.086,37 5,38 37,39 55.4,40 62.096,41 36.233,42 33.765,43 1.8,44 5.26}
{0 CHEMBL240039,1 8.348,2 40.5,3 45.9,4 1,5 1.119,6 0.704,7 0.648,8 308.86,9 5.4,10 6,11 37,13 8,14 22,16 39,17 15,18 1,20 8,21 7,22 2,24 17,25 5,26 2,28 2,29 1,31 1,32 20,34 1,35 2.7,36 0.077,37 3,38 27,39 37,40 41.392,41 26.063,42 23.987,43 2.7,44 5.337}
{0 CHEMBL240052,1 8.671,2 41.2,3 44.1,4 1.003,5 1.117,6 0.715,7 0.661,8 294.83,9 5.9,10 6,11 34,13 8,14 21,16 36,17 14,18 1,20 8,21 6,22 2,24 15,25 5,26 2,28 2,29 1,31 1,32 19,34 1,35 2.9,36 0.083,37 3,38 26,39 34.116,40 37.976,41 24.301,42 22.46,43 2.9,44 5.347}
{0 CHEMBL240053,1 7.903,2 40.5,3 45.9,4 1.005,5 1.129,6 0.68,7 0.636,8 292.41,9 5.4,10 6,11 37,13 8,14 22,16 39,17 15,20 8,21 7,22 2,23 1,24 17,25 5,26 1,28 2,29 1,31 1,32 20,34 1,35 2.7,36 0.077,37 3,38 27,39 37.189,40 41.787,41 25.142,42 23.542,43 2.7,44 6.276}
{0 CHEMBL240269,1 8.188,2 41.2,3 44.1,4 1.009,5 1.129,6 0.688,7 0.648,8 278.38,9 5.9,10 6,11 34,13 8,14 21,16 36,17 14,20 8,21 6,22 2,23 1,24 15,25 5,26 1,28 2,29 1,31 1,32 19,34 1,35 2.9,36 0.083,37 3,38 26,39 34.305,40 38.372,41 23.381,42 22.016,43 2.9,44 6.42}
{0 CHEMBL240619,1 7.429,2 36,3 50.7,4 1.007,5 1.135,6 0.643,7 0.6,8 557.19,9 2.7,10 6,11 75,13 9,14 41,16 79,17 27,18 1,20 7,21 20,22 3,23 1,24 38,25 10,26 2,28 2,29 5,31 1,32 37,34 2,35 6.7,36 0.114,37 9,38 47,39 75.541,40 85.136,41 48.194,42 45.024,43 2.7,44 4.824}
{0 CHEMBL240622,1 7.327,2 36.7,3 50,4 1.01,5 1.134,6 0.638,7 0.601,8 439.6,9 1.7,10 6,11 60,13 9,14 33,16 63,17 22,20 7,21 15,22 3,23 1,24 30,25 8,26 1,28 1,29 5,31 1,32 30,34 1,35 8.3,36 0.095,37 6,38 39,39 60.581,40 68.033,41 38.284,42 36.068,43 1.7,44 4}
{0 CHEMBL241707,1 7.929,2 37.5,3 48.2,4 1.012,5 1.131,6 0.659,7 0.619,8 444.01,9 1.8,10 6,11 56,13 9,14 32,16 59,17 21,18 1,20 7,21 14,22 3,23 1,24 27,25 8,26 2,28 1,29 4,31 1,32 29,34 2,35 7.1,36 0.085,37 5,38 38,39 56.694,40 63.352,41 36.926,42 34.654,43 3.6,44 4.585}
{0 CHEMBL241709,1 7.763,2 37.3,3 49.2,4 1.01,5 1.132,6 0.656,7 0.613,8 458.04,9 1.7,10 6,11 59,13 9,14 33,16 62,17 22,18 1,20 7,21 15,22 3,23 1,24 29,25 8,26 2,28 1,29 4,31 1,32 30,34 2,35 6.8,36 0.097,37 6,38 39,39 59.578,40 66.768,41 38.688,42 36.18,43 3.4,44 4.824}
{0 CHEMBL241711,1 8.117,2 36.7,3 46.7,4 1.019,5 1.134,6 0.656,7 0.623,8 487.04,9 3.3,10 6,11 60,13 10,14 35,16 63,17 22,18 1,20 8,21 14,22 4,23 1,24 28,25 10,26 2,28 2,29 5,31 1,32 32,34 2,35 8.3,36 0.111,37 7,38 42,39 61.123,40 68.06,41 39.387,42 37.39,43 3.3,44 5.481}
{0 CHEMBL241714,1 7.607,2 37.5,3 50,4 1.003,5 1.125,6 0.661,7 0.612,8 426.02,9 1.8,10 6,11 56,13 9,14 31,16 59,17 21,18 1,20 7,21 14,22 3,24 28,25 7,26 2,28 1,29 4,31 1,32 28,34 1,35 7.1,36 0.085,37 5,38 37,39 56.182,40 63.013,41 36.989,42 34.27,43 1.8,44 4.77}
{0 CHEMBL241716,1 7.607,2 37.5,3 50,4 1.003,5 1.125,6 0.661,7 0.612,8 426.02,9 1.8,10 6,11 56,13 9,14 31,16 59,17 21,18 1,20 7,21 14,22 3,24 28,25 7,26 2,28 1,29 4,31 1,32 28,34 1,35 7.1,36 0.085,37 5,38 37,39 56.182,40 63.013,41 36.989,42 34.27,43 1.8,44 4.187}
{0 CHEMBL241717,1 7.929,2 37.5,3 48.2,4 1.012,5 1.131,6 0.659,7 0.619,8 444.01,9 1.8,10 6,11 56,13 9,14 32,16 59,17 21,18 1,20 7,21 14,22 3,23 1,24 27,25 8,26 2,28 1,29 4,31 1,32 29,34 2,35 7.1,36 0.085,37 5,38 38,39 56.694,40 63.352,41 36.926,42 34.654,43 3.6,44 4.678}
{0 CHEMBL241719,1 7.138,2 36.4,3 50.9,4 1.001,5 1.13,6 0.643,7 0.599,8 392.57,9 3.6,10 6,11 55,13 9,14 30,16 58,17 20,20 7,21 13,22 3,24 28,25 7,26 1,28 2,29 4,31 1,32 27,35 7.3,36 0.086,37 5,38 36,39 55.076,40 62.152,41 35.375,42 32.938,44 4.229}
{0 CHEMBL245647,1 7.395,2 39.6,3 49.1,4 1.004,5 1.126,6 0.652,7 0.614,8 391.93,9 1.9,10 6,11 53,13 8,14 30,16 56,17 21,18 1,20 8,21 13,22 2,24 26,25 6,26 1,28 1,29 4,32 27,34 1,35 7.5,36 0.089,37 5,38 35,39 53.222,40 59.678,41 34.58,42 32.557,43 1.9,44 5.456}
{0 CHEMBL245851,1 7.24,2 38.9,3 50,4 1,5 1.129,6 0.651,7 0.609,8 390.95,9 3.7,10 6,11 54,13 8,14 30,16 57,17 21,18 1,20 8,21 13,22 2,24 27,25 6,26 1,28 2,29 3,32 27,34 1,35 5.6,36 0.088,37 5,38 35,39 53.996,40 60.966,41 35.131,42 32.863,43 1.9,44 4.921}
{0 CHEMBL245852,1 7.501,2 41.4,3 47.1,4 1.004,5 1.123,6 0.662,7 0.627,8 525.09,9 2.9,10 12,11 70,13 15,14 41,16 74,17 29,18 1,20 15,21 14,22 3,24 33,25 8,26 1,28 2,29 5,32 37,34 1,35 7.1,36 0.108,37 8,38 50,39 70.301,40 78.631,41 46.324,42 43.873,43 1.4,44 4.699}
{0 CHEMBL246047,1 7.395,2 39.6,3 49.1,4 1.004,5 1.126,6 0.652,7 0.614,8 391.93,9 1.9,10 6,11 53,13 8,14 30,16 56,17 21,18 1,20 8,21 13,22 2,24 26,25 6,26 1,28 1,29 4,32 27,34 1,35 7.5,36 0.089,37 5,38 35,39 53.222,40 59.678,41 34.58,42 32.557,43 1.9,44 5.745}
{0 CHEMBL246056,1 7.821,2 39,3 46.8,4 1.009,5 1.126,6 0.665,7 0.628,8 602.21,9 3.9,10 12,11 77,13 17,14 45,16 81,17 30,18 1,20 15,21 15,22 5,24 36,25 11,26 2,28 3,29 6,31 1,32 41,34 1,35 7.8,36 0.111,37 9,38 56,39 77.691,40 86.674,41 51.193,42 48.323,43 1.3,44 4.301}
{0 CHEMBL246057,1 7.627,2 40.3,3 45.8,4 1.004,5 1.13,6 0.665,7 0.632,8 549.13,9 8.3,10 17,11 72,13 19,14 44,16 77,17 29,18 1,20 15,21 14,22 2,24 33,25 10,26 1,28 6,29 3,32 39,34 1,35 4.2,36 0.104,37 8,38 54.5,39 72.287,40 81.375,41 47.915,42 45.475,43 1.4,44 4.585}
{0 CHEMBL246265,1 7.78,2 38.9,3 47.2,4 1.007,5 1.126,6 0.666,7 0.626,8 560.17,9 4.2,10 12,11 72,13 16,14 42,16 76,17 28,18 1,20 14,21 14,22 4,24 34,25 10,26 2,28 3,29 5,31 1,32 38,34 1,35 6.9,36 0.105,37 8,38 52,39 72.48,40 81.049,41 47.978,42 45.082,43 1.4,44 4.523}
{0 CHEMBL246442,1 7.46,2 36.1,3 50.8,4 1.003,5 1.13,6 0.652,7 0.604,8 455.07,9 3.3,10 6,11 61,13 9,14 33,16 64,17 22,18 1,20 7,21 15,22 3,24 31,25 8,26 2,28 2,29 4,31 1,32 30,34 1,35 6.6,36 0.094,37 6,38 39,39 61.167,40 68.926,41 39.756,42 36.819,43 1.6,44 4.222}
{0 CHEMBL246471,1 7.304,2 40.9,3 48.5,4 0.998,5 1.126,6 0.662,7 0.62,8 482.07,9 4.5,10 12,11 66,13 14,14 38,16 70,17 27,18 1,20 13,21 14,22 2,24 32,25 7,26 1,28 3,29 3,32 34,34 1,35 4.5,36 0.1,37 7,38 46,39 65.865,40 74.295,41 43.659,42 40.938,43 1.5,44 5.276}
{0 CHEMBL246472,1 7.344,2 37.7,3 49.2,4 1.005,5 1.133,6 0.645,7 0.609,8 448.01,9 4.9,10 6,11 61,13 9,14 34,16 64,17 23,18 1,20 9,21 14,22 3,24 30,25 8,26 1,28 3,29 4,32 31,34 1,35 6.6,36 0.078,37 5,38 40,39 61.309,40 69.089,41 39.353,42 37.126,43 1.6,44 4.921}
{0 CHEMBL246676,1 6.999,2 38.9,3 51.9,4 0.996,5 1.127,6 0.646,7 0.599,8 377.95,9 1.9,10 6,11 54,13 7,14 29,16 57,17 21,18 1,20 7,21 14,22 1,24 28,25 5,26 1,28 1,29 3,32 26,34 1,35 5.6,36 0.088,37 5,38 33,39 53.778,40 60.883,41 34.887,42 32.369,43 1.9,44 4.602}
{0 CHEMBL246677,1 7.266,2 38.3,3 50,4 1.005,5 1.129,6 0.643,7 0.605,8 435.99,9 1.7,10 6,11 60,13 8,14 33,16 63,17 23,18 1,20 8,21 15,22 2,24 30,25 7,26 1,28 1,29 5,32 30,34 1,35 8.3,36 0.127,37 8,38 38,39 60.316,40 67.717,41 38.557,42 36.325,43 1.7,44 4}
{0 CHEMBL246678,1 7.89,2 38.2,3 45.5,4 1.013,5 1.141,6 0.657,7 0.628,8 433.96,9 9.1,10 11,11 55,13 12,14 34,16 59,17 21,18 1,20 8,21 13,22 1,23 1,24 25,25 9,26 1,28 5,29 2,32 30,34 2,35 3.6,36 0.085,37 5,38 40.5,39 55.72,40 62.761,41 36.108,42 34.542,43 3.6,44 6.26}
{0 CHEMBL246858,1 8.077,2 35.6,3 45.8,4 1.031,5 1.149,6 0.634,7 0.616,8 476.57,9 3.4,10 6,11 59,13 9,14 35,16 62,17 21,20 7,21 14,22 3,23 3,24 27,25 11,26 1,28 2,29 5,31 1,32 32,34 3,35 8.5,36 0.097,37 6,38 41,39 60.825,40 67.796,41 37.404,42 36.329,43 5.1,44 4.602}
{0 CHEMBL246888,1 7.817,2 36.7,3 48.3,4 1.01,5 1.129,6 0.657,7 0.617,8 469.05,9 3.3,10 6,11 60,13 10,14 34,16 63,17 22,18 1,20 8,21 14,22 4,24 29,25 9,26 2,28 2,29 5,31 1,32 31,34 1,35 8.3,36 0.095,37 6,38 41,39 60.611,40 67.72,41 39.449,42 37.007,43 1.7,44 6.237}
{0 CHEMBL247286,1 6.745,2 39.6,3 50.9,4 0.998,5 1.127,6 0.636,7 0.599,8 357.49,9 1.9,10 6,11 53,13 8,14 29,16 56,17 21,20 8,21 13,22 2,24 27,25 5,28 1,29 4,32 26,35 7.5,36 0.089,37 5,38 34,39 52.898,40 59.734,41 33.722,42 31.729,44 4.77}
{0 CHEMBL251402,1 7.309,2 42,3 46,4 1.002,5 1.126,6 0.66,7 0.63,8 365.47,9 6,10 12,11 50,13 14,14 30,16 53,17 21,20 14,21 7,22 2,24 23,25 6,28 3,29 3,32 27,35 6,36 0.057,37 3,38 38,39 50.123,40 56.275,41 32.995,42 31.477,44 5}
{0 CHEMBL255259,1 7.901,2 42.9,3 45.2,4 1.002,5 1.131,6 0.683,7 0.643,8 331.85,9 7.1,10 11,11 42,13 11,14 27,16 46,17 18,18 1,20 8,21 10,23 1,24 19,25 5,26 1,28 3,32 23,34 2,36 0.087,37 4,38 32.5,39 42.094,40 47.515,41 28.665,42 27.016,43 4.8,44 5.398}
{0 CHEMBL255260,1 8.33,2 42.9,3 42.9,4 1.014,5 1.139,6 0.681,7 0.652,8 349.84,9 7.1,10 11,11 42,13 11,14 28,16 46,17 18,18 1,20 8,21 10,23 2,24 18,25 6,26 1,28 3,32 24,34 3,36 0.087,37 4,38 33.5,39 42.607,40 47.855,41 28.603,42 27.4,43 7.1,44 5.398}
{0 CHEMBL255660,1 6.805,2 40.9,3 50,4 0.992,5 1.136,6 0.649,7 0.607,8 299.43,9 6.8,10 11,11 44,13 11,14 25,16 47,17 18,20 8,21 10,23 1,24 22,25 4,28 3,32 22,34 1,36 0.043,37 2,38 30.5,39 43.654,40 49.987,41 28.569,42 26.716,43 2.3,44 5.398}
{0 CHEMBL255888,1 8.76,2 38.6,3 40.9,4 1.035,5 1.15,6 0.665,7 0.649,8 385.45,9 6.8,10 12,11 44,13 14,14 28,16 46,17 17,20 11,21 6,22 2,23 3,24 18,25 9,26 1,28 3,29 2,31 1,32 26,34 3,35 4.5,36 0.065,37 3,38 36,39 45.527,40 50.59,41 29.239,42 28.572,43 6.8,44 5}
{0 CHEMBL255934,1 6.19,2 40,3 54,4 0.978,5 1.13,6 0.643,7 0.588,8 309.5,9 6,10 11,11 50,13 11,14 26,16 53,17 20,20 8,21 12,24 27,25 3,28 3,32 23,36 0.038,37 2,38 31.5,39 48.909,40 56.477,41 32.154,42 29.386,44 5.708}
{0 CHEMBL256090,1 6.104,2 39.6,3 54.7,4 0.977,5 1.13,6 0.64,7 0.583,8 323.53,9 5.7,10 11,11 53,13 11,14 27,16 56,17 21,20 8,21 13,24 29,25 3,28 3,32 24,36 0.036,37 2,38 32.5,39 51.792,40 59.893,41 33.915,42 30.913,44 6.666}
{0 CHEMBL256291,1 6.669,2 40.4,3 51.1,4 0.99,5 1.136,6 0.645,7 0.601,8 313.46,9 6.4,10 11,11 47,13 11,14 26,16 50,17 19,20 8,21 11,23 1,24 24,25 4,28 3,32 23,34 1,36 0.04,37 2,38 31.5,39 46.538,40 53.402,41 30.33,42 28.242,43 2.1,44 5.896}
{0 CHEMBL256292,1 6.879,2 40,3 52,4 0.985,5 1.128,6 0.66,7 0.604,8 343.94,9 6,10 11,11 50,13 11,14 27,16 53,17 20,18 1,20 8,21 12,24 26,25 4,26 1,28 3,32 24,34 1,36 0.038,37 2,38 32.5,39 49.232,40 56.421,41 33.012,42 30.213,43 2,44 6.213}
{0 CHEMBL256514,1 6.805,2 40.9,3 50,4 0.992,5 1.136,6 0.649,7 0.607,8 299.43,9 6.8,10 11,11 44,13 11,14 25,16 47,17 18,20 8,21 10,23 1,24 22,25 4,28 3,32 22,34 1,36 0.043,37 2,38 30.5,39 43.654,40 49.987,41 28.569,42 26.716,43 2.3,44 5.398}
{0 CHEMBL256515,1 6.19,2 40,3 54,4 0.978,5 1.13,6 0.643,7 0.588,8 309.5,9 6,10 11,11 50,13 11,14 26,16 53,17 20,20 8,21 12,24 27,25 3,28 3,32 23,36 0.038,37 2,38 31.5,39 48.909,40 56.477,41 32.154,42 29.386,44 6.298}
{0 CHEMBL256571,1 6.19,2 40,3 54,4 0.978,5 1.13,6 0.643,7 0.588,8 309.5,9 6,10 11,11 50,13 11,14 26,16 53,17 20,20 8,21 12,24 27,25 3,28 3,32 23,36 0.038,37 2,38 31.5,39 48.909,40 56.477,41 32.154,42 29.386,44 5.984}
{0 CHEMBL256720,1 6.805,2 40.9,3 50,4 0.992,5 1.136,6 0.649,7 0.607,8 299.43,9 6.8,10 11,11 44,13 11,14 25,16 47,17 18,20 8,21 10,23 1,24 22,25 4,28 3,32 22,34 1,36 0.043,37 2,38 30.5,39 43.654,40 49.987,41 28.569,42 26.716,43 2.3,44 5.398}
{0 CHEMBL256777,1 6.032,2 37.8,3 55.6,4 0.978,5 1.135,6 0.631,7 0.575,8 271.45,9 6.7,10 5,11 45,13 5,14 24,16 49,17 17,20 2,21 15,24 25,25 3,28 3,32 20,36 0.02,37 1,38 26.5,39 44.025,40 51.062,41 28.393,42 25.859,44 5.523}
{0 CHEMBL256778,1 5.947,2 37.5,3 56.3,4 0.977,5 1.135,6 0.628,7 0.571,8 285.48,9 6.3,10 5,11 48,13 5,14 25,16 52,17 18,20 2,21 16,24 27,25 3,28 3,32 21,36 0.019,37 1,38 27.5,39 46.909,40 54.477,41 30.154,42 27.386,44 5.398}
{0 CHEMBL257148,1 6.287,2 40.4,3 53.2,4 0.979,5 1.129,6 0.647,7 0.593,8 295.47,9 6.4,10 11,11 47,13 11,14 25,16 50,17 19,20 8,21 11,24 25,25 3,28 3,32 22,36 0.04,37 2,38 30.5,39 46.025,40 53.062,41 30.393,42 27.859,44 5.398}
{0 CHEMBL257149,1 7.179,2 40.9,3 50,4 0.988,5 1.127,6 0.67,7 0.617,8 315.88,9 6.8,10 11,11 44,13 11,14 25,16 47,17 18,18 1,20 8,21 10,24 22,25 4,26 1,28 3,32 22,34 1,36 0.043,37 2,38 30.5,39 43.465,40 49.591,41 29.489,42 27.16,43 2.3,44 5.398}
{0 CHEMBL257414,1 6.489,2 39.6,3 52.1,4 0.987,5 1.131,6 0.643,7 0.595,8 311.47,9 6.3,10 11,11 48,13 11,14 26,16 51,17 19,20 8,21 11,24 25,25 4,28 3,29 1,32 23,35 2.1,36 0.039,37 2,38 31.5,39 47.352,40 54.272,41 30.847,42 28.574,44 5.398}
{0 CHEMBL258446,1 7.362,2 41.5,3 48.8,4 0.99,5 1.126,6 0.676,7 0.625,8 301.85,9 7.3,10 11,11 41,13 11,14 24,16 44,17 17,18 1,20 8,21 9,24 20,25 4,26 1,28 3,32 21,34 1,36 0.045,37 2,38 29.5,39 40.582,40 46.176,41 27.728,42 25.633,43 2.4,44 5.398}
{0 CHEMBL258447,1 6.396,2 40.9,3 52.3,4 0.98,5 1.128,6 0.651,7 0.598,8 281.44,9 6.8,10 11,11 44,13 11,14 24,16 47,17 18,20 8,21 10,24 23,25 3,28 3,32 21,36 0.043,37 2,38 29.5,39 43.141,40 49.647,41 28.631,42 26.332,44 5.398}
{0 CHEMBL258448,1 7.435,2 40.4,3 46.8,4 1.012,5 1.151,6 0.643,7 0.617,8 349.44,9 6.4,10 11,11 47,13 11,14 28,16 50,17 19,20 8,21 11,23 3,24 22,25 6,28 3,32 25,34 3,36 0.04,37 2,38 33.5,39 47.563,40 54.081,41 30.205,42 29.009,43 6.4,44 5.398}
{0 CHEMBL267734,1 7.394,2 36.9,3 47.7,4 1.018,5 1.152,6 0.625,7 0.604,8 480.59,9 6.2,10 6,11 65,13 8,14 38,16 69,17 24,20 7,21 17,22 2,23 3,24 31,25 10,28 4,29 3,32 34,34 3,35 4.6,36 0.087,37 6,38 43,39 66.181,40 74.869,41 40.62,42 39.282,43 4.6,44 4.854}
{0 CHEMBL372768,1 7.424,2 40.7,3 47.5,4 0.996,5 1.129,6 0.669,7 0.627,8 438.02,9 8.5,10 16,11 59,13 16,14 36,16 64,17 24,18 1,20 10,21 14,24 28,25 7,26 1,28 5,29 1,32 31,34 1,35 1.7,36 0.047,37 3,38 44,39 58.763,40 66.627,41 39.478,42 36.971,43 1.7,44 6.642}
{0 CHEMBL373547,1 7.852,2 40,3 48.9,4 0.998,5 1.126,6 0.679,7 0.627,8 353.32,9 4.4,10 6,11 45,13 7,14 26,16 48,17 18,18 2,20 7,21 11,22 1,24 22,25 5,26 2,28 2,29 1,32 23,34 2,35 2.2,36 0.042,37 2,38 30,39 44.898,40 50.661,41 30.557,42 28.207,43 4.4,44 5}
{0 CHEMBL373601,1 7.467,2 38.8,3 49,4 1.007,5 1.128,6 0.649,7 0.613,8 365.89,9 2,10 6,11 49,13 7,14 28,16 52,17 19,18 1,20 7,21 12,22 1,24 24,25 6,26 1,28 1,29 4,32 25,34 1,35 8.2,36 0.077,37 4,38 32,39 49.338,40 55.262,41 31.818,42 30.03,43 2,44 4.155}
{0 CHEMBL373792,1 7.119,2 37,3 49.3,4 1.01,5 1.151,6 0.626,7 0.598,8 519.68,9 6.8,10 6,11 73,13 8,14 42,16 78,17 27,20 7,21 20,22 2,23 3,24 36,25 10,28 5,29 2,32 37,34 3,35 2.7,36 0.064,37 5,38 47,39 73.723,40 83.988,41 45.694,42 43.642,43 4.1,44 4.301}
{0 CHEMBL373889,1 7.309,2 36.7,3 48.3,4 1.016,5 1.154,6 0.623,7 0.601,8 438.55,9 6.7,10 6,11 60,13 7,14 35,16 64,17 22,20 6,21 16,22 1,23 3,24 29,25 9,28 4,29 2,32 31,34 3,35 3.3,36 0.063,37 4,38 39,39 60.97,40 69.244,41 37.404,42 36.04,43 5,44 5}
{0 CHEMBL374110,1 7.154,2 36.2,3 49.3,4 1.012,5 1.153,6 0.622,7 0.596,8 493.64,9 7.2,10 6,11 69,13 8,14 39,16 73,17 25,20 7,21 18,22 2,23 3,24 34,25 10,28 5,29 2,32 35,34 3,35 2.9,36 0.082,37 6,38 44,39 69.839,40 79.573,41 42.932,42 41.115,43 4.3,44 4}
{0 CHEMBL374283,1 8.199,2 36.2,3 46.8,4 1.012,5 1.137,6 0.665,7 0.626,8 385.33,9 8.5,10 6,11 47,13 8,14 27,16 49,17 17,18 2,20 8,21 9,22 2,24 22,25 8,26 2,28 4,29 2,32 25,34 2,35 4.3,36 0.041,37 2,38 32,39 47.545,40 53.452,41 31.262,42 29.438,43 4.3,44 5}
{0 CHEMBL374318,1 8.399,2 37.3,3 45.1,4 1.019,5 1.133,6 0.665,7 0.635,8 428.35,9 5.9,10 6,11 51,13 9,14 30,16 53,17 19,18 2,20 9,21 10,22 3,24 23,25 9,26 2,28 3,29 4,32 28,34 2,35 7.8,36 0.113,37 6,38 36,39 51.982,40 57.788,41 33.926,42 32.373,43 3.9,44 5}
{0 CHEMBL374409,1 7.203,2 35.8,3 49.3,4 1.016,5 1.153,6 0.618,7 0.594,8 482.61,9 6,10 6,11 67,13 8,14 37,16 70,17 24,20 7,21 17,22 2,23 3,24 33,25 10,28 4,29 3,32 34,34 3,35 4.5,36 0.071,37 5,38 42,39 68.065,40 77.284,41 41.381,42 39.809,43 4.5,44 4}
{0 CHEMBL374487,1 7.482,2 35.6,3 50.8,4 1.001,5 1.138,6 0.649,7 0.602,8 441.45,9 6.8,10 6,11 59,13 8,14 31,16 61,17 21,18 2,20 8,21 13,22 2,24 30,25 8,26 2,28 4,29 2,32 29,34 2,35 3.4,36 0.115,37 7,38 36,39 59.08,40 67.113,41 38.307,42 35.545,43 3.4,44 5}
{0 CHEMBL374728,1 6.655,2 38.7,3 51.6,4 0.996,5 1.13,6 0.633,7 0.594,8 412.58,9 3.2,10 6,11 62,13 7,14 35,16 67,17 24,20 7,21 17,22 1,24 32,25 6,28 2,29 4,32 30,35 6.5,36 0.045,37 3,38 39,39 61.767,40 70.062,41 39.25,42 36.804,44 4.208}
{0 CHEMBL375156,1 7.184,2 36.5,3 49.2,4 1.014,5 1.153,6 0.622,7 0.596,8 452.58,9 6.3,10 6,11 63,13 7,14 36,16 67,17 23,20 6,21 17,22 1,23 3,24 31,25 9,28 4,29 2,32 32,34 3,35 3.2,36 0.06,37 4,38 40,39 63.854,40 72.659,41 39.165,42 37.567,43 4.8,44 4}
{0 CHEMBL375341,1 7.07,2 34.7,3 51,4 1.018,5 1.16,6 0.605,7 0.581,8 346.44,9 4.1,11 49,13 1,14 27,16 52,17 17,20 1,21 16,22 1,23 3,24 25,25 7,28 2,29 2,32 24,34 3,35 4.1,36 0.058,37 3,38 28,39 49.883,40 56.832,41 29.631,42 28.471,43 6.1,44 4}
{0 CHEMBL375743,1 7.194,2 35.4,3 49.2,4 1.015,5 1.156,6 0.618,7 0.594,8 467.6,9 7.7,10 6,11 65,13 8,14 36,16 68,17 23,20 7,21 16,22 2,23 3,24 32,25 10,28 5,29 2,32 33,34 3,35 3.1,36 0.074,37 5,38 41,39 65.956,40 75.157,41 40.171,42 38.588,43 4.6,44 4.523}
{0 CHEMBL375744,1 7.249,2 37.5,3 50,4 1.002,5 1.133,6 0.645,7 0.605,8 405.97,9 5.4,10 6,11 56,13 8,14 31,16 59,17 21,18 1,20 8,21 13,22 2,24 28,25 7,26 1,28 3,29 3,32 28,34 1,35 5.4,36 0.102,37 6,38 36,39 56.098,40 63.465,41 36.137,42 33.885,43 1.8,44 4}
{0 CHEMBL375979,1 6.48,2 36.8,3 52.9,4 0.993,5 1.136,6 0.626,7 0.583,8 440.65,9 5.9,10 6,11 68,13 8,14 36,16 72,17 25,20 7,21 18,22 2,24 36,25 7,28 4,29 3,32 32,35 4.4,36 0.083,37 6,38 41,39 67.527,40 77.265,41 42.569,42 39.659,44 4}
{0 CHEMBL376087,1 7.757,2 38.6,3 50,4 0.998,5 1.129,6 0.672,7 0.618,8 341.31,9 4.5,10 6,11 44,13 7,14 24,16 46,17 17,18 2,20 7,21 10,22 1,24 22,25 5,26 2,28 2,29 1,32 22,34 2,35 2.3,36 0.022,37 1,38 28,39 43.898,40 49.661,41 29.557,42 27.207,43 4.5,44 5}
{0 CHEMBL376226,1 7.259,2 37.5,3 48.4,4 1.013,5 1.151,6 0.628,7 0.603,8 464.59,9 6.3,10 6,11 64,13 8,14 37,16 68,17 24,20 7,21 17,22 2,23 3,24 31,25 9,28 4,29 2,32 33,34 3,35 3.1,36 0.074,37 5,38 42,39 64.854,40 73.659,41 40.165,42 38.567,43 4.7,44 4.046}
{0 CHEMBL376256,1 7.987,2 38,3 48,4 1.009,5 1.13,6 0.665,7 0.623,8 399.35,9 4,10 6,11 50,13 8,14 28,16 52,17 19,18 2,20 8,21 11,22 2,24 24,25 7,26 2,28 2,29 3,32 26,34 2,35 6,36 0.115,37 6,38 33,39 50.436,40 56.495,41 33.228,42 31.164,43 4,44 5}
{0 CHEMBL376272,1 7.469,2 37.3,3 49,4 1.009,5 1.133,6 0.644,7 0.609,8 380.91,9 3.9,10 6,11 51,13 8,14 28,16 53,17 19,18 1,20 8,21 11,22 2,24 25,25 7,26 1,28 2,29 4,32 26,34 1,35 7.8,36 0.094,37 5,38 33,39 51.44,40 57.761,41 32.824,42 31.051,43 2,44 4}
{0 CHEMBL376293,1 7.338,2 37.3,3 47.8,4 1.014,5 1.152,6 0.629,7 0.606,8 491.62,9 7.5,10 6,11 67,13 8,14 40,16 72,17 25,20 7,21 18,22 2,23 3,24 32,25 10,28 5,29 2,32 35,34 3,35 3,36 0.069,37 5,38 45,39 67.956,40 77.157,41 42.171,42 40.588,43 4.5,44 4}
{0 CHEMBL376306,1 6.382,2 41.2,3 52.9,4 0.985,5 1.124,6 0.643,7 0.594,8 325.49,9 2,10 6,11 51,13 7,14 28,16 55,17 21,20 7,21 14,22 1,24 27,25 3,28 1,29 2,32 24,35 3.9,36 0.055,37 3,38 32,39 50.243,40 57.315,41 32.813,42 30.299,44 5}
{0 CHEMBL376695,1 7.274,2 36.8,3 48.5,4 1.016,5 1.151,6 0.623,7 0.6,8 494.62,9 5.9,10 6,11 68,13 8,14 39,16 72,17 25,20 7,21 18,22 2,23 3,24 33,25 10,28 4,29 3,32 35,34 3,35 4.4,36 0.069,37 5,38 44,39 69.065,40 78.284,41 42.381,42 40.809,43 4.4,44 4.678}
{0 CHEMBL380677,1 6.094,2 38.7,3 55.7,4 0.985,5 1.128,6 0.626,7 0.574,8 646.01,9 0.9,10 6,11 106,13 10,14 52,16 111,17 41,20 11,21 30,22 4,24 59,25 6,28 1,29 5,32 47,35 4.7,36 0.045,37 5,38 59,39 104.363,40 119.586,41 66.359,42 60.873,44 5.629}
{0 CHEMBL382614,1 6.301,2 39.6,3 54.2,4 0.989,5 1.126,6 0.63,7 0.583,8 604.9,10 6,11 96,13 10,14 49,16 101,17 38,20 11,21 27,22 4,24 52,25 6,29 6,32 44,35 6.3,36 0.05,37 5,38 56,39 94.937,40 108.052,41 60.523,42 55.986,44 4.319}
{0 CHEMBL383352,1 6.874,2 39,3 50.8,4 1.002,5 1.148,6 0.631,7 0.595,8 405.56,9 5.1,10 11,11 59,13 11,14 32,16 62,17 23,20 8,21 15,23 3,24 30,25 6,28 3,32 29,34 3,36 0.097,37 6,38 37.5,39 59.098,40 67.742,41 37.251,42 35.116,43 5.1,44 5.886}
{0 CHEMBL384364,1 6.659,2 38.6,3 50.9,4 0.99,5 1.135,6 0.642,7 0.599,8 379.56,9 8.8,10 6,11 57,13 8,14 32,16 61,17 22,19 1,20 6,21 15,22 1,24 29,25 6,28 5,29 1,32 28,33 1,35 1.8,36 0.066,37 4,38 38,39 56.44,40 64.683,41 36.62,42 34.143,44 4}
{0 CHEMBL384426,1 7.083,2 35.3,3 50,4 1.012,5 1.155,6 0.617,7 0.59,8 481.63,9 7.4,10 6,11 68,13 8,14 37,16 71,17 24,20 7,21 17,22 2,23 3,24 34,25 10,28 5,29 2,32 34,34 3,35 2.9,36 0.07,37 5,38 42,39 68.839,40 78.573,41 41.932,42 40.115,43 4.4,44 4.523}
{0 CHEMBL384650,1 6.567,2 38.5,3 51.9,4 0.992,5 1.133,6 0.636,7 0.593,8 341.5,9 5.8,10 6,11 52,13 8,14 27,16 54,17 20,19 1,20 6,21 13,22 1,24 27,25 5,28 3,29 2,32 25,33 1,35 3.8,36 0.074,37 4,38 33,39 51.563,40 58.896,41 33.063,42 30.815,44 7.699}
{0 CHEMBL385176,1 6.957,2 38.6,3 49.1,4 1,5 1.133,6 0.641,7 0.606,8 396.54,9 7,10 6,11 57,13 9,14 32,16 60,17 22,19 1,20 7,21 14,22 2,24 28,25 7,28 4,29 3,32 29,33 1,35 5.3,36 0.1,37 6,38 39,39 56.992,40 64.604,41 36.523,42 34.552,44 4}
{0 CHEMBL385777,1 6.92,2 38.8,3 49.3,4 0.998,5 1.133,6 0.643,7 0.606,8 463.64,9 7.5,10 11,11 67,13 13,14 39,16 72,17 26,20 10,21 16,22 2,24 33,25 8,28 5,29 3,32 34,35 4.5,36 0.083,37 6,38 46.5,39 66.861,40 75.933,41 43.052,42 40.627,44 5.796}
{0 CHEMBL386029,1 7.467,2 37.3,3 47.5,4 1.02,5 1.159,6 0.625,7 0.605,8 440.54,9 6.8,10 6,11 59,13 7,14 35,16 63,17 22,20 6,21 16,22 1,23 4,24 28,25 9,28 4,29 1,32 31,34 4,35 1.7,36 0.063,37 4,38 39,39 60.156,40 68.374,41 36.887,42 35.709,43 6.8,44 4.699}
{0 CHEMBL386315,1 7.306,2 38.5,3 50,4 1.004,5 1.128,6 0.646,7 0.607,8 379.92,9 1.9,10 6,11 52,13 8,14 28,16 54,17 20,18 1,20 8,21 12,22 2,24 26,25 6,26 1,28 1,29 4,32 26,34 1,35 7.7,36 0.093,37 5,38 33,39 52.222,40 58.678,41 33.58,42 31.557,43 1.9,44 4.796}
{0 CHEMBL387010,1 7.121,2 38.8,3 51,4 0.996,5 1.129,6 0.651,7 0.605,8 348.91,9 4.1,10 6,11 49,13 8,14 25,16 50,17 19,18 1,19 1,20 7,21 11,22 1,24 25,25 5,26 1,28 2,29 2,32 24,33 1,34 1,35 4.1,36 0.08,37 4,38 31,39 48.785,40 55.342,41 31.915,42 29.622,43 2,44 4}
{0 CHEMBL391447,1 6.974,2 37,3 51.9,4 0.995,5 1.129,6 0.647,7 0.597,8 376.57,9 3.7,10 6,11 54,13 9,14 29,16 57,17 20,20 7,21 13,22 3,24 28,25 6,26 1,28 2,29 3,31 1,32 26,35 5.6,36 0.07,37 4,38 35,39 53.749,40 60.942,41 34.921,42 32.223,44 4}
{0 CHEMBL391652,1 8.091,2 36.4,3 47.3,4 1.017,5 1.135,6 0.658,7 0.621,8 445,9 3.6,10 6,11 55,13 9,14 32,16 58,17 20,18 1,20 7,21 13,22 3,23 1,24 26,25 9,26 2,28 2,29 4,31 1,32 29,34 2,35 7.3,36 0.086,37 5,38 38,39 55.912,40 62.436,41 36.171,42 34.148,43 3.6,44 4}
{0 CHEMBL391653,1 8.717,2 36.4,3 45.5,4 1.022,5 1.134,6 0.673,7 0.636,8 479.44,9 3.6,10 6,11 55,13 9,14 33,16 58,17 20,18 2,20 7,21 13,22 3,23 1,24 25,25 10,26 3,28 2,29 4,31 1,32 30,34 3,35 7.3,36 0.086,37 5,38 39,39 56.236,40 62.38,41 37.029,42 34.976,43 5.5,44 5.046}
{0 CHEMBL392913,1 7.604,2 36.2,3 50,4 1.005,5 1.13,6 0.655,7 0.608,8 441.04,9 3.4,10 6,11 58,13 9,14 32,16 61,17 21,18 1,20 7,21 14,22 3,24 29,25 8,26 2,28 2,29 4,31 1,32 29,34 1,35 6.9,36 0.098,37 6,38 38,39 58.283,40 65.511,41 37.995,42 35.292,43 1.7,44 4.071}
{0 CHEMBL392932,1 7.764,2 36.4,3 49.1,4 1.007,5 1.129,6 0.659,7 0.614,8 427.01,9 3.6,10 6,11 55,13 9,14 31,16 58,17 20,18 1,20 7,21 13,22 3,24 27,25 8,26 2,28 2,29 4,31 1,32 28,34 1,35 7.3,36 0.086,37 5,38 37,39 55.4,40 62.096,41 36.233,42 33.765,43 1.8,44 4.796}
{0 CHEMBL393167,1 7.789,2 37.3,3 47.5,4 1.022,5 1.144,6 0.639,7 0.612,8 459.58,9 1.7,10 6,11 59,13 9,14 34,16 62,17 22,20 7,21 15,22 3,23 3,24 28,25 9,26 1,28 1,29 4,31 1,32 31,34 3,35 6.8,36 0.081,37 5,38 40,39 60.28,40 67.503,41 37.705,42 36.12,43 5.1,44 4}
{0 CHEMBL394217,1 7.607,2 37.5,3 50,4 1.003,5 1.125,6 0.661,7 0.612,8 426.02,9 1.8,10 6,11 56,13 9,14 31,16 59,17 21,18 1,20 7,21 14,22 3,24 28,25 7,26 2,28 1,29 4,31 1,32 28,34 1,35 7.1,36 0.085,37 5,38 37,39 56.182,40 63.013,41 36.989,42 34.27,43 1.8,44 5.268}
{0 CHEMBL394884,1 6.664,2 37.9,3 51.7,4 0.998,5 1.132,6 0.629,7 0.591,8 386.54,9 3.4,10 6,11 58,13 8,14 31,16 61,17 22,20 8,21 14,22 2,24 30,25 6,28 2,29 4,32 28,35 6.9,36 0.098,37 6,38 36,39 57.883,40 65.647,41 36.489,42 34.277,44 4.745}
{0 CHEMBL397073,1 7.748,2 39.7,3 47.6,4 1.001,5 1.124,6 0.675,7 0.629,8 488.1,9 4.8,10 11,11 63,13 13,14 37,16 67,17 25,18 1,20 11,21 14,22 2,24 30,25 8,26 2,28 3,29 3,31 1,32 33,34 1,35 4.8,36 0.104,37 7,38 44.5,39 63.058,40 70.8,41 42.546,42 39.598,43 1.6,44 4.886}
{0 CHEMBL397074,1 7.344,2 37.7,3 49.2,4 1.005,5 1.133,6 0.645,7 0.609,8 448.01,9 4.9,10 6,11 61,13 9,14 34,16 64,17 23,18 1,20 9,21 14,22 3,24 30,25 8,26 1,28 3,29 4,32 31,34 1,35 6.6,36 0.109,37 7,38 40,39 61.309,40 69.089,41 39.353,42 37.126,43 1.6,44 4.699}
{0 CHEMBL399191,1 7.764,2 36.4,3 49.1,4 1.007,5 1.129,6 0.659,7 0.614,8 427.01,9 3.6,10 6,11 55,13 9,14 31,16 58,17 20,18 1,20 7,21 13,22 3,24 27,25 8,26 2,28 2,29 4,31 1,32 28,34 1,35 7.3,36 0.086,37 5,38 37,39 55.4,40 62.096,41 36.233,42 33.765,43 1.8,44 5.201}
{0 CHEMBL402386,1 6.287,2 40.4,3 53.2,4 0.979,5 1.129,6 0.647,7 0.593,8 295.47,9 6.4,10 11,11 47,13 11,14 25,16 50,17 19,20 8,21 11,24 25,25 3,28 3,32 22,36 0.04,37 2,38 30.5,39 46.025,40 53.062,41 30.393,42 27.859,44 5.985}
{0 CHEMBL402387,1 6.55,2 40,3 52,4 0.988,5 1.136,6 0.642,7 0.595,8 327.49,9 6,10 11,11 50,13 11,14 27,16 53,17 20,20 8,21 12,23 1,24 26,25 4,28 3,32 24,34 1,36 0.038,37 2,38 32.5,39 49.421,40 56.817,41 32.091,42 29.769,43 2,44 5.93}
{0 CHEMBL402552,1 6.396,2 40.9,3 52.3,4 0.98,5 1.128,6 0.651,7 0.598,8 281.44,9 6.8,10 11,11 44,13 11,14 24,16 47,17 18,20 8,21 10,24 23,25 3,28 3,32 21,36 0.043,37 2,38 29.5,39 43.141,40 49.647,41 28.631,42 26.332,44 5.398}
{0 CHEMBL402613,1 6.669,2 40.4,3 51.1,4 0.99,5 1.136,6 0.645,7 0.601,8 313.46,9 6.4,10 11,11 47,13 11,14 26,16 50,17 19,20 8,21 11,23 1,24 24,25 4,28 3,32 23,34 1,36 0.04,37 2,38 31.5,39 46.538,40 53.402,41 30.33,42 28.242,43 2.1,44 5.398}
{0 CHEMBL402995,1 6.522,2 41.5,3 51.2,4 0.982,5 1.128,6 0.655,7 0.605,8 267.41,9 7.3,10 11,11 41,13 11,14 23,16 44,17 17,20 8,21 9,24 21,25 3,28 3,32 20,36 0.045,37 2,38 28.5,39 40.258,40 46.232,41 26.87,42 24.805,44 5.398}
{0 CHEMBL403201,1 7.435,2 40.4,3 46.8,4 1.012,5 1.151,6 0.643,7 0.617,8 349.44,9 6.4,10 11,11 47,13 11,14 28,16 50,17 19,20 8,21 11,23 3,24 22,25 6,28 3,32 25,34 3,36 0.04,37 2,38 33.5,39 47.563,40 54.081,41 30.205,42 29.009,43 6.4,44 5.398}
{0 CHEMBL403993,1 8.202,2 41.5,3 46.3,4 0.998,5 1.125,6 0.697,7 0.645,8 336.29,9 7.3,10 11,11 41,13 11,14 25,16 44,17 17,18 2,20 8,21 9,24 19,25 5,26 2,28 3,32 22,34 2,36 0.045,37 2,38 30.5,39 40.905,40 46.12,41 28.586,42 26.46,43 4.9,44 5.707}
{0 CHEMBL404095,1 7.901,2 42.9,3 45.2,4 1.002,5 1.131,6 0.683,7 0.643,8 331.85,9 7.1,10 11,11 42,13 11,14 27,16 46,17 18,18 1,20 8,21 10,23 1,24 19,25 5,26 1,28 3,32 23,34 2,36 0.087,37 4,38 32.5,39 42.094,40 47.515,41 28.665,42 27.016,43 4.8,44 5.398}
{0 CHEMBL404435,1 6.287,2 40.4,3 53.2,4 0.979,5 1.129,6 0.647,7 0.593,8 295.47,9 6.4,10 11,11 47,13 11,14 25,16 50,17 19,20 8,21 11,24 25,25 3,28 3,32 22,36 0.04,37 2,38 30.5,39 46.025,40 53.062,41 30.393,42 27.859,44 5.698}
{0 CHEMBL404436,1 6.287,2 40.4,3 53.2,4 0.979,5 1.129,6 0.647,7 0.593,8 295.47,9 6.4,10 11,11 47,13 11,14 25,16 50,17 19,20 8,21 11,24 25,25 3,28 3,32 22,36 0.04,37 2,38 30.5,39 46.025,40 53.062,41 30.393,42 27.859,44 5.479}
{0 CHEMBL415429,1 6.336,2 34.7,3 55.1,4 0.997,5 1.146,6 0.607,7 0.565,8 310.46,9 4.1,11 49,13 1,14 25,16 52,17 17,20 1,21 16,22 1,23 1,24 27,25 5,28 2,29 2,32 22,34 1,35 4.1,36 0.058,37 3,38 26,39 48.858,40 56.153,41 29.756,42 27.704,43 2,44 4}
{0 CHEMBL424931,1 7.414,2 37.9,3 48.3,4 1.002,5 1.135,6 0.654,7 0.615,8 430,9 8.6,10 11,11 58,13 12,14 34,16 62,17 22,18 1,20 8,21 14,22 1,24 28,25 8,26 1,28 5,29 2,32 30,34 1,35 3.4,36 0.097,37 6,38 40.5,39 58.091,40 65.837,41 37.932,42 35.686,43 1.7,44 4}
{0 CHEMBL424937,1 7.07,2 36.4,3 50,4 1.011,5 1.153,6 0.62,7 0.592,8 466.61,9 6.1,10 6,11 66,13 7,14 37,16 70,17 24,20 6,21 18,22 1,23 3,24 33,25 9,28 4,29 2,32 33,34 3,35 3,36 0.057,37 4,38 41,39 66.738,40 76.074,41 40.927,42 39.094,43 4.5,44 4}
{0 CHEMBL425772,1 5.8,2 37,3 58,4 0.98,5 1.132,6 0.616,7 0.559,8 469.78,9 1.2,11 81,13 3,14 38,16 85,17 30,20 4,21 26,22 3,24 47,25 4,28 1,29 3,32 34,35 3.7,36 0.012,37 1,38 41,39 79.407,40 91.676,41 49.881,42 45.282,44 5.219}
{0 CHEMBL426208,1 8.007,2 36.8,3 47.4,4 1.013,5 1.134,6 0.657,7 0.622,8 456.41,9 5.3,10 6,11 57,13 9,14 32,16 59,17 21,18 2,20 9,21 12,22 3,24 27,25 9,26 2,28 3,29 4,32 30,34 2,35 7,36 0.119,37 7,38 38,39 57.749,40 64.618,41 37.449,42 35.427,43 3.5,44 5}
{0 CHEMBL428429,1 6.521,2 42.2,3 51.1,4 0.981,5 1.125,6 0.658,7 0.607,8 293.45,9 6.7,10 11,11 45,13 11,14 26,16 49,17 19,20 8,21 11,24 23,25 3,28 3,32 22,36 0.041,37 2,38 31.5,39 44.141,40 50.647,41 29.631,42 27.332,44 5.398}
{0 CHEMBL429655,1 6.602,2 38.9,3 51.9,4 0.994,5 1.13,6 0.635,7 0.593,8 356.51,9 3.7,10 6,11 54,13 8,14 29,16 57,17 21,20 8,21 13,22 2,24 28,25 5,28 2,29 3,32 26,35 5.6,36 0.088,37 5,38 34,39 53.672,40 61.022,41 34.273,42 32.036,44 4.638}
{0 CHEMBL435136,1 8.687,2 42,3 42,4 1.015,5 1.123,6 0.694,7 0.663,8 434.35,9 6,10 12,11 50,13 14,14 32,16 53,17 21,18 2,20 14,21 7,22 2,24 21,25 8,26 2,28 3,29 3,32 29,34 2,35 6,36 0.038,37 2,38 40,39 50.771,40 56.163,41 34.71,42 33.132,43 4,44 5}
{0 CHEMBL436335,1 7.714,2 39.3,3 46.4,4 1.01,5 1.13,6 0.658,7 0.626,8 431.96,9 5.4,10 6,11 56,13 9,14 34,16 60,17 22,18 1,20 9,21 13,22 3,24 26,25 8,26 1,28 3,29 4,32 30,34 1,35 7.1,36 0.083,37 5,38 40,39 56.542,40 63.259,41 36.83,42 35.072,43 1.8,44 4.456}
{0 CHEMBL437522,1 8.043,2 37.5,3 50,4 1,5 1.131,6 0.654,7 0.609,8 450.42,9 5.4,10 6,11 56,13 8,14 31,15 1,16 59,17 21,20 7,21 14,22 2,24 28,25 7,26 1,28 3,29 3,32 28,34 1,35 5.4,36 0.102,37 6,38 36,39 56.003,40 63.362,41 36.631,42 34.082,43 1.8,44 4.31}
{0 CHEMBL441553,1 8.39,2 38.3,3 44.7,4 1.009,5 1.135,6 0.682,7 0.643,8 394.34,9 10.6,10 12,11 47,13 13,14 28,16 49,17 18,18 2,20 12,21 6,22 1,24 21,25 8,26 2,28 5,29 1,32 26,34 2,35 2.1,36 0.041,37 2,38 35,39 47.436,40 53.326,41 32.051,42 30.218,43 4.3,44 5}
{0 CHEMBL441687,1 6.859,2 35,3 51.7,4 1.014,5 1.135,6 0.607,7 0.581,8 823.04,11 120,13 5,14 64,16 126,17 42,20 6,21 36,22 5,24 62,25 16,29 16,32 58,35 13.3,36 0.056,37 7,38 69,39 121.628,40 136.222,41 72.875,42 69.768,44 9}
{0 CHEMBL452587,1 7.457,2 41.4,3 46.6,4 1.013,5 1.142,6 0.645,7 0.621,8 432.53,9 3.4,10 12,11 58,13 13,14 34,16 61,17 24,20 12,21 12,22 1,23 3,24 27,25 7,28 2,29 2,32 31,34 3,35 3.4,36 0.082,37 5,38 41,39 58.767,40 66.247,41 37.392,42 35.997,43 5.2,44 5}
{0 CHEMBL456537,1 7.761,2 37.5,3 47.5,4 1.01,5 1.135,6 0.659,7 0.62,8 310.43,9 5,10 6,11 40,13 8,14 22,16 41,17 15,20 8,21 7,22 2,23 1,24 19,25 6,26 1,28 2,29 2,31 1,32 21,34 1,35 5,36 0.098,37 4,38 27,39 40.4,40 45.412,41 26.358,42 24.784,43 2.5,44 5}
{0 CHEMBL456538,1 8.382,2 37.2,3 44.2,4 1.03,5 1.151,6 0.651,7 0.63,8 360.44,9 4.7,10 6,11 43,13 8,14 25,16 44,17 16,20 8,21 8,22 2,23 3,24 19,25 8,26 1,28 2,29 2,31 1,32 24,34 3,35 4.7,36 0.091,37 4,38 30,39 44.309,40 49.507,41 27.995,42 27.077,43 7,44 5}
{0 CHEMBL460393,1 7.864,2 39,3 46.3,4 1.01,5 1.132,6 0.667,7 0.629,8 322.44,9 4.9,10 6,11 41,13 8,14 24,16 43,17 16,20 8,21 8,22 2,23 1,24 19,25 6,26 1,28 2,29 2,31 1,32 22,34 1,35 4.9,36 0.093,37 4,38 29,39 41.4,40 46.412,41 27.358,42 25.784,43 2.4,44 5}
{0 CHEMBL460962,1 8.028,2 33.9,3 46.4,4 1.031,5 1.155,6 0.628,7 0.609,8 449.55,9 5.4,10 6,11 56,13 9,14 32,16 58,17 19,20 7,21 12,22 3,23 3,24 26,25 11,26 1,28 3,29 4,31 1,32 30,34 3,35 7.1,36 0.103,37 6,38 38,39 57.716,40 64.669,41 35.194,42 34.109,43 5.4,44 4}
{0 CHEMBL461879,1 7.761,2 37.5,3 47.5,4 1.01,5 1.135,6 0.659,7 0.62,8 310.43,9 5,10 6,11 40,13 8,14 22,16 41,17 15,20 8,21 7,22 2,23 1,24 19,25 6,26 1,28 2,29 2,31 1,32 21,34 1,35 5,36 0.098,37 4,38 27,39 40.4,40 45.412,41 26.358,42 24.784,43 2.5,44 5}
{0 CHEMBL468988,1 6.392,2 33.3,3 57.1,4 0.984,5 1.136,6 0.631,7 0.565,8 268.47,9 4.8,11 42,13 2,14 19,16 43,17 14,20 2,21 12,22 2,24 24,25 4,26 1,28 2,29 1,31 1,32 18,35 2.4,36 0.093,37 4,38 21,39 41.327,40 47.693,41 26.489,42 23.74,44 5}
{0 CHEMBL469157,1 6.278,2 33.3,3 57.8,4 0.982,5 1.136,6 0.628,7 0.561,8 282.5,9 4.4,11 45,13 2,14 20,16 46,17 15,20 2,21 13,22 2,24 26,25 4,26 1,28 2,29 1,31 1,32 19,35 2.2,36 0.087,37 4,38 22,39 44.211,40 51.108,41 28.25,42 25.266,44 5}
{0 CHEMBL469158,1 6.647,2 36.4,3 54.5,4 0.985,5 1.129,6 0.647,7 0.585,8 292.49,9 4.5,11 44,13 2,14 23,16 47,17 16,20 2,21 14,22 2,24 24,25 4,26 1,28 2,29 1,31 1,32 20,35 2.3,36 0.085,37 4,38 25,39 43.327,40 49.693,41 28.489,42 25.74,44 5}
{0 CHEMBL469698,1 7.254,2 38.8,3 49,4 1.016,5 1.15,6 0.625,7 0.601,8 355.44,9 2,10 6,11 49,13 7,14 27,16 51,17 19,20 7,21 12,22 1,23 3,24 24,25 6,28 1,29 2,32 25,34 3,35 4.1,36 0.078,37 4,38 31,39 49.781,40 56.334,41 30.625,42 29.449,43 6.1,44 5}
{0 CHEMBL469699,1 7.314,2 42.4,3 47.5,4 1.009,5 1.138,6 0.647,7 0.619,8 431.54,9 1.7,10 12,11 59,13 13,14 34,16 62,17 25,20 13,21 12,22 1,23 3,24 28,25 6,28 1,29 2,32 31,34 3,35 3.4,36 0.081,37 5,38 41,39 59.549,40 67.164,41 38.148,42 36.503,43 5.1,44 5}
{0 CHEMBL471750,1 7.314,2 42.4,3 47.5,4 1.009,5 1.138,6 0.647,7 0.619,8 431.54,9 1.7,10 12,11 59,13 13,14 34,16 62,17 25,20 13,21 12,22 1,23 3,24 28,25 6,28 1,29 2,32 31,34 3,35 3.4,36 0.081,37 5,38 41,39 59.549,40 67.164,41 38.148,42 36.503,43 5.1,44 5}
{0 CHEMBL471930,1 7.621,2 38.8,3 46.9,4 1.026,5 1.157,6 0.624,7 0.609,8 373.43,9 2,10 6,11 49,13 7,14 28,16 51,17 19,20 7,21 12,22 1,23 4,24 23,25 7,28 1,29 2,32 26,34 4,35 4.1,36 0.078,37 4,38 32,39 50.294,40 56.674,41 30.563,42 29.833,43 8.2,44 5}
{0 CHEMBL493512,1 6.009,2 38.5,3 56.4,4 0.984,5 1.128,6 0.623,7 0.57,8 468.74,11 78,13 4,14 38,16 82,17 30,20 5,21 25,22 4,24 44,25 4,29 4,32 34,35 5.1,36 0.012,37 1,38 42,39 76.748,40 87.972,41 48.569,42 44.449,44 6.483}
{0 CHEMBL493801,1 7.999,2 48.1,3 42.3,4 0.996,5 1.112,6 0.71,7 0.671,8 415.95,9 5.8,10 23,11 52,13 23,14 34,16 56,17 25,18 1,20 20,21 5,24 22,25 5,26 1,28 3,29 1,32 30,34 1,35 1.9,36 0.089,37 5,38 45.5,39 51.792,40 57.8,41 36.943,42 34.874,43 1.9,44 5.398}
{0 CHEMBL494180,1 8.092,2 45.2,3 42.9,4 1.001,5 1.118,6 0.7,7 0.662,8 339.85,9 7.1,10 17,11 42,13 17,14 27,16 45,17 19,18 1,20 14,21 5,24 18,25 5,26 1,28 3,29 1,32 24,34 1,35 2.4,36 0.067,37 3,38 35.5,39 42.025,40 46.97,41 29.421,42 27.821,43 2.4,44 5.398}
{0 CHEMBL494206,1 8.092,2 45.2,3 42.9,4 1.001,5 1.118,6 0.7,7 0.662,8 339.85,9 7.1,10 17,11 42,13 17,14 27,16 45,17 19,18 1,20 14,21 5,24 18,25 5,26 1,28 3,29 1,32 24,34 1,35 2.4,36 0.067,37 3,38 35.5,39 42.025,40 46.97,41 29.421,42 27.821,43 2.4,44 5.398}
{0 CHEMBL494637,1 8.123,2 45.8,3 41.7,4 0.998,5 1.12,6 0.708,7 0.67,8 389.92,9 10.4,10 22,11 48,13 22,14 32,16 52,17 22,18 1,20 17,21 5,24 20,25 6,26 1,28 5,32 28,34 1,36 0.077,37 4,38 43,39 47.902,40 53.757,41 33.978,42 32.149,43 2.1,44 5.398}
{0 CHEMBL494639,1 8.659,2 46.8,3 40.4,4 0.997,5 1.11,6 0.737,7 0.688,8 406.97,9 8.5,10 22,11 47,13 22,14 32,16 51,17 22,18 1,20 17,21 5,24 19,25 6,26 2,28 4,31 1,32 28,34 1,36 0.078,37 4,38 43,39 46.876,40 52.179,41 34.62,42 32.315,43 2.1,44 5.398}
{0 CHEMBL494809,1 9.063,2 44.4,3 37.8,4 1.032,5 1.142,6 0.689,7 0.678,8 407.85,9 6.7,10 17,11 45,13 17,14 31,16 48,17 20,18 1,20 14,21 6,23 3,24 17,25 8,26 1,28 3,29 1,32 28,34 4,35 2.2,36 0.083,37 4,38 39.5,39 46.447,40 51.404,41 30.995,42 30.498,43 8.9,44 5.398}
{0 CHEMBL494819,1 8.739,2 46.3,3 41.5,4 1.001,5 1.115,6 0.727,7 0.681,8 358.29,9 7.3,10 17,11 41,13 17,14 27,16 44,17 19,18 2,20 14,21 5,24 17,25 5,26 2,28 3,32 24,34 2,36 0.068,37 3,38 35.5,39 41.022,40 45.705,41 29.824,42 27.934,43 4.9,44 5.398}
{0 CHEMBL495690,1 8.195,2 49,3 41.2,4 1,5 1.116,6 0.714,7 0.677,8 417.94,9 5.9,10 23,11 51,13 23,14 34,16 55,17 25,18 1,20 20,21 5,23 1,24 21,25 5,26 1,28 3,32 30,34 2,36 0.073,37 4,38 45.5,39 50.978,40 56.931,41 36.426,42 34.543,43 3.9,44 5.398}
{0 CHEMBL495691,1 7.666,2 48.1,3 44.4,4 0.988,5 1.111,6 0.708,7 0.661,8 413.98,9 5.6,10 23,11 54,13 23,14 34,16 58,17 26,18 1,20 20,21 6,24 24,25 4,26 1,28 3,32 30,34 1,36 0.086,37 5,38 45.5,39 53.349,40 60.006,41 38.25,42 35.686,43 1.9,44 5.398}
{0 CHEMBL495889,1 8.991,2 45.6,3 40.4,4 1.007,5 1.11,6 0.731,7 0.687,8 512.49,9 5.3,10 23,11 57,13 25,14 38,16 61,17 26,18 2,20 20,21 6,22 2,24 23,25 8,26 3,28 3,29 2,31 1,32 34,34 2,35 3.5,36 0.082,37 5,38 51.5,39 57.403,40 63.289,41 41.665,42 39.131,43 3.5,44 5.398}
{0 CHEMBL496095,1 9.579,2 46.3,3 39,4 1.008,5 1.113,6 0.748,7 0.701,8 392.73,9 7.3,10 17,11 41,13 17,14 28,16 44,17 19,18 3,20 14,21 5,24 16,25 6,26 3,28 3,32 25,34 3,36 0.068,37 3,38 36.5,39 41.345,40 45.649,41 30.682,42 28.761,43 7.3,44 5.398}
{0 CHEMBL496096,1 8.52,2 45.2,3 40.5,4 1.013,5 1.126,6 0.699,7 0.672,8 357.84,9 7.1,10 17,11 42,13 17,14 28,16 45,17 19,18 1,20 14,21 5,23 1,24 17,25 6,26 1,28 3,29 1,32 25,34 2,35 2.4,36 0.067,37 3,38 36.5,39 42.538,40 47.31,41 29.358,42 28.204,43 4.8,44 5.398}
{0 CHEMBL496097,1 8.264,2 44.4,3 42.2,4 1.009,5 1.127,6 0.692,7 0.661,8 371.87,9 6.7,10 17,11 45,13 17,14 29,16 48,17 20,18 1,20 14,21 6,23 1,24 19,25 6,26 1,28 3,29 1,32 26,34 2,35 2.2,36 0.083,37 4,38 37.5,39 45.422,40 50.725,41 31.12,42 29.731,43 4.4,44 5.398}
{0 CHEMBL496294,1 8.338,2 46.3,3 41.5,4 1.005,5 1.124,6 0.705,7 0.67,8 341.84,9 7.3,10 17,11 41,13 17,14 27,16 44,17 19,18 1,20 14,21 5,23 1,24 17,25 5,26 1,28 3,32 24,34 2,36 0.068,37 3,38 35.5,39 41.211,40 46.1,41 28.904,42 27.489,43 4.9,44 5.398}
{0 CHEMBL496295,1 8.338,2 46.3,3 41.5,4 1.005,5 1.124,6 0.705,7 0.67,8 341.84,9 7.3,10 17,11 41,13 17,14 27,16 44,17 19,18 1,20 14,21 5,23 1,24 17,25 5,26 1,28 3,32 24,34 2,36 0.068,37 3,38 35.5,39 41.211,40 46.1,41 28.904,42 27.489,43 4.9,44 5.398}
{0 CHEMBL496307,1 8.775,2 45,3 41.7,4 1.005,5 1.112,6 0.724,7 0.678,8 526.52,9 5,10 23,11 60,13 25,14 39,16 64,17 27,18 2,20 20,21 7,22 2,24 25,25 8,26 3,28 3,29 2,31 1,32 35,34 2,35 3.3,36 0.094,37 6,38 52.5,39 60.287,40 66.704,41 43.426,42 40.657,43 3.3,44 5.398}
{0 CHEMBL497122,1 8.991,2 45.6,3 40.4,4 1.007,5 1.11,6 0.731,7 0.687,8 512.49,9 5.3,10 23,11 57,13 25,14 38,16 61,17 26,18 2,20 20,21 6,22 2,24 23,25 8,26 3,28 3,29 2,31 1,32 34,34 2,35 3.5,36 0.082,37 5,38 51.5,39 57.403,40 63.289,41 41.665,42 39.131,43 3.5,44 5.398}
{0 CHEMBL497552,1 6.916,2 38.1,3 52.4,4 0.987,5 1.126,6 0.66,7 0.6,8 290.47,9 4.8,11 42,13 2,14 24,16 46,17 16,20 2,21 14,22 2,24 22,25 4,26 1,28 2,29 1,31 1,32 20,35 2.4,36 0.043,37 2,38 26,39 41.443,40 47.278,41 27.728,42 25.213,44 5}
{0 CHEMBL497558,1 7.169,2 43.4,3 49.1,4 0.986,5 1.121,6 0.679,7 0.627,8 379.97,9 5.7,10 17,11 53,13 17,14 30,16 56,17 23,18 1,20 14,21 9,24 26,25 4,26 1,28 3,32 27,34 1,36 0.071,37 4,38 38.5,39 52.232,40 59.421,41 36.012,42 33.213,43 1.9,44 5.398}
{0 CHEMBL497748,1 8.739,2 46.3,3 41.5,4 1.001,5 1.115,6 0.727,7 0.681,8 358.29,9 7.3,10 17,11 41,13 17,14 27,16 44,17 19,18 2,20 14,21 5,24 17,25 5,26 2,28 3,32 24,34 2,36 0.068,37 3,38 35.5,39 41.022,40 45.705,41 29.824,42 27.934,43 4.9,44 5.398}
{0 CHEMBL497951,1 8.739,2 46.3,3 41.5,4 1.001,5 1.115,6 0.727,7 0.681,8 358.29,9 7.3,10 17,11 41,13 17,14 27,16 44,17 19,18 2,20 14,21 5,24 17,25 5,26 2,28 3,32 24,34 2,36 0.068,37 3,38 35.5,39 41.022,40 45.705,41 29.824,42 27.934,43 4.9,44 5.398}
{0 CHEMBL497960,1 7.753,2 44.9,3 44.9,4 0.996,5 1.118,6 0.693,7 0.651,8 379.92,9 6.1,10 17,11 49,13 17,14 31,16 53,17 22,18 1,20 14,21 8,24 22,25 5,26 1,28 3,29 1,32 27,34 1,35 2,36 0.094,37 5,38 39.5,39 48.792,40 54.8,41 33.944,42 31.875,43 2,44 5.398}
{0 CHEMBL498351,1 10.969,2 46.3,3 41.5,4 0.994,5 1.109,6 0.771,7 0.693,8 449.74,9 7.3,10 17,11 41,13 17,14 27,16 44,17 19,18 1,20 14,21 5,24 17,25 5,26 2,27 1,28 3,32 24,34 2,36 0.068,37 3,38 35.5,39 40.767,40 45.481,41 31.625,42 28.423,43 4.9,44 5.398}
{0 CHEMBL498352,1 7.679,2 45.5,3 45.5,4 0.99,5 1.118,6 0.698,7 0.651,8 337.88,9 6.8,10 17,11 44,13 17,14 27,16 47,17 20,18 1,20 14,21 6,24 20,25 4,26 1,28 3,32 24,34 1,36 0.064,37 3,38 35.5,39 43.582,40 49.176,41 30.728,42 28.633,43 2.3,44 5.398}
{0 CHEMBL498353,1 8.906,2 45.5,3 38.6,4 1.025,5 1.141,6 0.694,7 0.677,8 391.85,9 6.8,10 17,11 44,13 17,14 30,16 47,17 20,18 1,20 14,21 6,23 3,24 17,25 7,26 1,28 3,32 27,34 4,36 0.064,37 3,38 38.5,39 45.12,40 50.195,41 30.54,42 29.783,43 9.1,44 5.398}
{0 CHEMBL503555,1 6.392,2 33.3,3 57.1,4 0.984,5 1.136,6 0.631,7 0.565,8 268.47,9 4.8,11 42,13 2,14 19,16 43,17 14,20 2,21 12,22 2,24 24,25 4,26 1,28 2,29 1,31 1,32 18,35 2.4,36 0.07,37 3,38 21,39 41.327,40 47.693,41 26.489,42 23.74,44 5}
{0 CHEMBL503888,1 6.523,2 34.9,3 55.8,4 0.984,5 1.132,6 0.639,7 0.575,8 280.48,9 4.7,11 43,13 2,14 21,16 45,17 15,20 2,21 13,22 2,24 24,25 4,26 1,28 2,29 1,31 1,32 19,35 2.3,36 0.044,37 2,38 23,39 42.327,40 48.693,41 27.489,42 24.74,44 5}
{0 CHEMBL506720,1 6.278,2 33.3,3 57.8,4 0.982,5 1.136,6 0.628,7 0.561,8 282.5,9 4.4,11 45,13 2,14 20,16 46,17 15,20 2,21 13,22 2,24 26,25 4,26 1,28 2,29 1,31 1,32 19,35 2.2,36 0.087,37 4,38 22,39 44.211,40 51.108,41 28.25,42 25.266,44 5}
{0 CHEMBL508147,1 8.338,2 46.3,3 41.5,4 1.005,5 1.124,6 0.705,7 0.67,8 341.84,9 7.3,10 17,11 41,13 17,14 27,16 44,17 19,18 1,20 14,21 5,23 1,24 17,25 5,26 1,28 3,32 24,34 2,36 0.068,37 3,38 35.5,39 41.211,40 46.1,41 28.904,42 27.489,43 4.9,44 5.398}
{0 CHEMBL511828,1 7.609,2 43.3,3 45,4 1.013,5 1.137,6 0.657,7 0.633,8 456.55,9 3.3,10 12,11 60,13 14,14 36,16 63,17 26,19 1,20 13,21 12,22 1,23 3,24 27,25 7,28 2,29 2,32 33,33 1,34 3,35 3.3,36 0.079,37 5,38 45,39 60.767,40 68.247,41 39.392,42 37.997,43 5,44 5}
{0 CHEMBL512355,1 7.295,2 39.3,3 48.2,4 1.014,5 1.147,6 0.632,7 0.607,8 408.51,9 3.6,10 6,11 56,13 8,14 31,16 58,17 22,19 1,20 7,21 14,22 1,23 3,24 27,25 7,28 2,29 2,32 29,33 1,34 3,35 3.6,36 0.103,37 6,38 37,39 56.767,40 64.247,41 35.393,42 33.998,43 5.4,44 5}
{0 CHEMBL512826,1 6.524,2 33.3,3 56.4,4 0.986,5 1.135,6 0.634,7 0.57,8 254.44,9 5.1,11 39,13 2,14 18,16 40,17 13,20 2,21 11,22 2,24 22,25 4,26 1,28 2,29 1,31 1,32 17,35 2.6,36 0.075,37 3,38 20,39 38.443,40 44.278,41 24.728,42 22.213,44 5}
{0 CHEMBL512907,1 8.172,2 37.5,3 47.5,4 1.005,5 1.125,6 0.682,7 0.631,8 326.88,9 5,10 6,11 40,13 8,14 22,16 41,17 15,18 1,20 8,21 7,22 2,24 19,25 6,26 2,28 2,29 2,31 1,32 21,34 1,35 5,36 0.098,37 4,38 27,39 40.211,40 45.016,41 27.279,42 25.228,43 2.5,44 5}
{0 CHEMBL513695,1 6.792,2 36.6,3 53.7,4 0.986,5 1.129,6 0.652,7 0.591,8 278.46,9 4.9,11 41,13 2,14 22,16 44,17 15,20 2,21 13,22 2,24 22,25 4,26 1,28 2,29 1,31 1,32 19,35 2.4,36 0.068,37 3,38 24,39 40.443,40 46.278,41 26.728,42 24.213,44 5}
{0 CHEMBL517874,1 7.647,2 38.6,3 47.7,4 1.006,5 1.132,6 0.662,7 0.621,8 336.47,9 4.5,10 6,11 44,13 8,14 25,16 46,17 17,20 8,21 9,22 2,23 1,24 21,25 6,26 1,28 2,29 2,31 1,32 23,34 1,35 4.5,36 0.087,37 4,38 30,39 44.283,40 49.827,41 29.12,42 27.311,43 2.3,44 5}
{0 CHEMBL521688,1 8.092,2 45.2,3 42.9,4 1.001,5 1.118,6 0.7,7 0.662,8 339.85,9 7.1,10 17,11 42,13 17,14 27,16 45,17 19,18 1,20 14,21 5,24 18,25 5,26 1,28 3,29 1,32 24,34 1,35 2.4,36 0.067,37 3,38 35.5,39 42.025,40 46.97,41 29.421,42 27.821,43 2.4,44 5.398}
{0 CHEMBL522533,1 9.063,2 44.4,3 37.8,4 1.032,5 1.142,6 0.689,7 0.678,8 407.85,9 6.7,10 17,11 45,13 17,14 31,16 48,17 20,18 1,20 14,21 6,23 3,24 17,25 8,26 1,28 3,29 1,32 28,34 4,35 2.2,36 0.083,37 4,38 39.5,39 46.447,40 51.404,41 30.995,42 30.498,43 8.9,44 5.398}
{0 CHEMBL522701,1 8.708,2 48,3 40,4 1,5 1.112,6 0.732,7 0.69,8 435.38,9 8,10 23,11 50,13 23,14 34,16 54,17 24,18 2,20 19,21 5,24 20,25 6,26 2,28 4,32 30,34 2,36 0.074,37 4,38 45.5,39 50.007,40 55.618,41 36.591,42 34.482,43 4,44 5.398}
{0 CHEMBL523177,1 7.899,2 46.3,3 43.9,4 0.993,5 1.116,6 0.706,7 0.661,8 323.85,9 7.3,10 17,11 41,13 17,14 26,16 44,17 19,18 1,20 14,21 5,24 18,25 4,26 1,28 3,32 23,34 1,36 0.068,37 3,38 34.5,39 40.698,40 45.761,41 28.966,42 27.106,43 2.4,44 5.398}
{0 CHEMBL523590,1 7.812,2 40,3 46.7,4 0.997,5 1.121,6 0.689,7 0.637,8 234.35,9 6.7,10 6,11 30,13 8,14 17,16 31,17 12,20 8,21 4,22 2,24 14,25 4,26 1,28 2,29 1,31 1,32 16,35 3.3,36 0.097,37 3,38 22,39 29.909,40 33.617,41 20.682,42 19.106,44 5}
{0 CHEMBL524040,1 7.937,2 46.9,3 42.9,4 0.994,5 1.116,6 0.709,7 0.666,8 388.93,9 8.2,10 22,11 49,13 22,14 32,16 53,17 23,18 1,20 18,21 5,24 21,25 5,26 1,28 4,32 28,34 1,36 0.075,37 4,38 43,39 48.683,40 54.674,41 34.733,42 32.654,43 2,44 5.398}
{0 CHEMBL524062,1 6.822,2 35.1,3 54.1,4 0.988,5 1.131,6 0.648,7 0.586,8 252.42,9 5.4,11 37,13 2,14 19,16 39,17 13,20 2,21 11,22 2,24 20,25 4,26 1,28 2,29 1,31 1,32 17,35 2.7,36 0.077,37 3,38 21,39 36.56,40 41.863,41 23.966,42 21.686,44 5}
{0 CHEMBL524824,1 8.906,2 45.5,3 38.6,4 1.025,5 1.141,6 0.694,7 0.677,8 391.85,9 6.8,10 17,11 44,13 17,14 30,16 47,17 20,18 1,20 14,21 6,23 3,24 17,25 7,26 1,28 3,32 27,34 4,36 0.064,37 3,38 38.5,39 45.12,40 50.195,41 30.54,42 29.783,43 9.1,44 5.398}
{0 CHEMBL524854,1 6.661,2 35,3 55,4 0.986,5 1.132,6 0.643,7 0.58,8 266.45,9 5,11 40,13 2,14 20,16 42,17 14,20 2,21 12,22 2,24 22,25 4,26 1,28 2,29 1,31 1,32 18,35 2.5,36 0.095,37 4,38 22,39 39.443,40 45.278,41 25.728,42 23.213,44 5}
{0 CHEMBL525003,1 7.864,2 44.4,3 44.4,4 0.998,5 1.12,6 0.693,7 0.652,8 353.88,9 6.7,10 17,11 45,13 17,14 28,16 48,17 20,18 1,20 14,21 6,24 20,25 5,26 1,28 3,29 1,32 25,34 1,35 2.2,36 0.083,37 4,38 36.5,39 44.909,40 50.385,41 31.182,42 29.348,43 2.2,44 5.398}
{0 CHEMBL525361,1 7.842,2 49,3 43.1,4 0.99,5 1.11,6 0.715,7 0.67,8 399.95,9 5.9,10 23,11 51,13 23,14 33,16 55,17 25,18 1,20 20,21 5,24 22,25 4,26 1,28 3,32 29,34 1,36 0.073,37 4,38 44.5,39 50.465,40 56.591,41 36.489,42 34.16,43 2,44 5.398}
{0 CHEMBL525606,1 9.063,2 44.4,3 37.8,4 1.032,5 1.142,6 0.689,7 0.678,8 407.85,9 6.7,10 17,11 45,13 17,14 31,16 48,17 20,18 1,20 14,21 6,23 3,24 17,25 8,26 1,28 3,29 1,32 28,34 4,35 2.2,36 0.083,37 4,38 39.5,39 46.447,40 51.404,41 30.995,42 30.498,43 8.9,44 5.398}
{0 CHEMBL525924,1 7.842,2 49,3 43.1,4 0.99,5 1.11,6 0.715,7 0.67,8 399.95,9 5.9,10 23,11 51,13 23,14 33,16 55,17 25,18 1,20 20,21 5,24 22,25 4,26 1,28 3,32 29,34 1,36 0.073,37 4,38 44.5,39 50.465,40 56.591,41 36.489,42 34.16,43 2,44 5.398}
{0 CHEMBL549600,1 7.943,2 39.6,3 47.2,4 1.004,5 1.122,6 0.68,7 0.633,8 421,9 3.8,10 12,11 53,13 15,14 30,16 55,17 21,18 1,20 13,21 8,22 3,24 25,25 7,26 2,28 2,29 3,31 1,32 28,34 1,35 5.7,36 0.109,37 6,38 39,39 53.189,40 59.471,41 36.017,42 33.523,43 1.9,44 5}
{0 CHEMBL550424,1 6.115,2 35.1,3 56.1,4 0.99,5 1.138,6 0.61,7 0.563,8 348.54,9 3.5,11 57,13 2,14 28,16 60,17 20,20 2,21 18,22 2,24 32,25 5,28 2,29 3,32 25,35 5.3,36 0.1,37 6,38 30,39 56.44,40 64.853,41 34.796,42 32.089,44 5}
{0 CHEMBL552288,1 7.768,2 39.3,3 48.2,4 1.001,5 1.123,6 0.675,7 0.626,8 435.03,9 3.6,10 12,11 56,13 15,14 31,16 58,17 22,18 1,20 13,21 9,22 3,24 27,25 7,26 2,28 2,29 3,31 1,32 29,34 1,35 5.4,36 0.103,37 6,38 40,39 56.072,40 62.886,41 37.779,42 35.05,43 1.8,44 5.604}
{0 CHEMBL554502,1 7.319,2 46,3 48,4 0.987,5 1.113,6 0.689,7 0.638,8 365.93,9 2,10 12,11 50,13 13,14 30,16 54,17 23,18 1,20 13,21 10,22 1,24 24,25 3,26 1,28 1,29 1,32 26,34 1,35 2,36 0.037,37 2,38 37,39 49.356,40 55.634,41 34.455,42 31.885,43 2,44 4}
{0 CHEMBL555375,1 7.395,2 39.6,3 49.1,4 1.004,5 1.126,6 0.652,7 0.614,8 391.93,9 1.9,10 6,11 53,13 8,14 30,16 56,17 21,18 1,20 8,21 13,22 2,24 26,25 6,26 1,28 1,29 4,32 27,34 1,35 7.5,36 0.089,37 5,38 35,39 53.222,40 59.678,41 34.58,42 32.557,43 1.9,44 4.523}
{0 CHEMBL557417,1 6.162,2 41.3,3 54.3,4 0.979,5 1.124,6 0.643,7 0.588,8 283.45,9 2.2,10 6,11 46,13 7,14 24,16 49,17 19,20 7,21 12,22 1,24 25,25 2,28 1,29 1,32 21,35 2.2,36 0.041,37 2,38 28,39 45.032,40 51.69,41 29.597,42 27.058,44 4}
{0 CHEMBL562614,1 6.911,2 41.3,3 52.2,4 0.986,5 1.122,6 0.662,7 0.606,8 317.89,9 2.2,10 6,11 46,13 7,14 25,16 49,17 19,18 1,20 7,21 12,22 1,24 24,25 3,26 1,28 1,29 1,32 22,34 1,35 2.2,36 0.041,37 2,38 29,39 45.356,40 51.634,41 30.455,42 27.885,43 2.2,44 4}
{0 CHEMBL563234,1 6.259,2 35,3 55,4 0.992,5 1.139,6 0.613,7 0.569,8 375.57,9 5,11 60,13 3,14 30,16 63,17 21,20 3,21 18,22 3,24 33,25 6,28 3,29 3,32 27,35 5,36 0.111,37 7,38 33,39 59.541,40 68.351,41 36.802,42 34.111,44 5}
{0 CHEMBL564652,1 7.487,2 46.8,3 46.8,4 0.989,5 1.111,6 0.696,7 0.646,8 351.9,9 2.1,10 12,11 47,13 13,14 29,16 51,17 22,18 1,20 13,21 9,22 1,24 22,25 3,26 1,28 1,29 1,32 25,34 1,35 2.1,36 0.039,37 2,38 36,39 46.472,40 52.219,41 32.694,42 30.359,43 2.1,44 4}
{0 CHEMBL597063,1 6.421,2 39.7,3 52.9,4 0.988,5 1.128,6 0.637,7 0.59,8 436.65,9 2.9,10 6,11 68,13 8,14 37,16 73,17 27,20 8,21 19,22 2,24 36,25 5,28 2,29 3,32 32,35 4.4,36 0.041,37 3,38 42,39 67.207,40 76.683,41 43.319,42 40.143,44 6.292}
{0 CHEMBL597481,1 6.421,2 39.7,3 52.9,4 0.988,5 1.128,6 0.637,7 0.59,8 436.65,9 2.9,10 6,11 68,13 8,14 37,16 73,17 27,20 8,21 19,22 2,24 36,25 5,28 2,29 3,32 32,35 4.4,36 0.041,37 3,38 42,39 67.207,40 76.683,41 43.319,42 40.143,44 8}
{0 CHEMBL597676,1 6.421,2 39.7,3 52.9,4 0.988,5 1.128,6 0.637,7 0.59,8 436.65,9 2.9,10 6,11 68,13 8,14 37,16 73,17 27,20 8,21 19,22 2,24 36,25 5,28 2,29 3,32 32,35 4.4,36 0.041,37 3,38 42,39 67.207,40 76.683,41 43.319,42 40.143,44 5}
{0 CHEMBL598675,1 6.502,2 40,3 52.3,4 0.99,5 1.127,6 0.639,7 0.594,8 422.62,9 3.1,10 6,11 65,13 8,14 36,16 70,17 26,20 8,21 18,22 2,24 34,25 5,28 2,29 3,32 31,35 4.6,36 0.043,37 3,38 41,39 64.323,40 73.268,41 41.557,42 38.616,44 5.115}
{0 CHEMBL601210,1 8.037,2 37.5,3 50,4 0.999,5 1.127,6 0.664,7 0.612,8 578.63,9 4.2,10 6,11 72,13 10,14 41,15 1,16 77,17 27,20 8,21 19,22 4,24 36,25 9,26 2,28 3,29 4,31 1,32 36,34 1,35 5.6,36 0.052,37 4,38 48,39 71.941,40 81.153,41 47.779,42 44.091,43 1.4,44 5}
{0 CHEMBL601849,1 7.716,2 40,3 50.8,4 0.993,5 1.125,6 0.66,7 0.61,8 501.51,9 3.1,10 6,11 65,13 8,14 37,15 1,16 70,17 26,20 8,21 18,22 2,24 33,25 6,26 1,28 2,29 3,32 32,34 1,35 4.6,36 0.043,37 3,38 42,39 64.552,40 73.11,41 42.91,42 39.641,43 1.5,44 5}
{0 CHEMBL602051,1 7.032,2 40,3 50.8,4 0.995,5 1.126,6 0.653,7 0.607,8 457.06,9 3.1,10 6,11 65,13 8,14 37,16 70,17 26,18 1,20 8,21 18,22 2,24 33,25 6,26 1,28 2,29 3,32 32,34 1,35 4.6,36 0.043,37 3,38 42,39 64.647,40 73.212,41 42.415,42 39.443,43 1.5,44 5}
{0 CHEMBL602248,1 7.032,2 40,3 50.8,4 0.995,5 1.126,6 0.653,7 0.607,8 457.06,9 3.1,10 6,11 65,13 8,14 37,16 70,17 26,18 1,20 8,21 18,22 2,24 33,25 6,26 1,28 2,29 3,32 32,34 1,35 4.6,36 0.043,37 3,38 42,39 64.647,40 73.212,41 42.415,42 39.443,43 1.5,44 5}
{0 CHEMBL602249,1 7.716,2 40,3 50.8,4 0.993,5 1.125,6 0.66,7 0.61,8 501.51,9 3.1,10 6,11 65,13 8,14 37,15 1,16 70,17 26,20 8,21 18,22 2,24 33,25 6,26 1,28 2,29 3,32 32,34 1,35 4.6,36 0.043,37 3,38 42,39 64.552,40 73.11,41 42.91,42 39.641,43 1.5,44 5}
{0 CHEMBL605162,1 7.716,2 40,3 50.8,4 0.993,5 1.125,6 0.66,7 0.61,8 501.51,9 3.1,10 6,11 65,13 8,14 37,15 1,16 70,17 26,20 8,21 18,22 2,24 33,25 6,26 1,28 2,29 3,32 32,34 1,35 4.6,36 0.043,37 3,38 42,39 64.552,40 73.11,41 42.91,42 39.641,43 1.5,44 5}
{0 CHEMBL605756,1 6.421,2 39.7,3 52.9,4 0.988,5 1.128,6 0.637,7 0.59,8 436.65,9 2.9,10 6,11 68,13 8,14 37,16 73,17 27,20 8,21 19,22 2,24 36,25 5,28 2,29 3,32 32,35 4.4,36 0.041,37 3,38 42,39 67.207,40 76.683,41 43.319,42 40.143,44 5}
{0 CHEMBL605954,1 7.032,2 40,3 50.8,4 0.995,5 1.126,6 0.653,7 0.607,8 457.06,9 3.1,10 6,11 65,13 8,14 37,16 70,17 26,18 1,20 8,21 18,22 2,24 33,25 6,26 1,28 2,29 3,32 32,34 1,35 4.6,36 0.043,37 3,38 42,39 64.647,40 73.212,41 42.415,42 39.443,43 1.5,44 5}
{0 CHEMBL606420,1 7.387,2 39.4,3 53,4 0.986,5 1.126,6 0.655,7 0.598,8 487.53,9 3,10 6,11 66,13 7,14 36,15 1,16 71,17 26,20 7,21 19,22 1,24 35,25 5,26 1,28 2,29 2,32 31,34 1,35 3,36 0.042,37 3,38 40,39 65.109,40 74.315,41 43.216,42 39.453,43 1.5,44 5.046}
