{
  "data_set_description": {
    "collection_date": "November 2013",
    "creator": "Dr Jeremy Besnard, Dr Ivan Olier, Dr Noureddin Sadawi, Dr Larisa Soldatova, Dr Crina Grosan, Prof Ross King, Dr Richard Bickerton, Prof Andrew Hopkins and Dr Willem van Hoorn",
    "default_target_attribute": "pXC50",
    "description": "This dataset contains QSAR data (from ChEMBL version 17) showing activity values (unit is pseudo-pCI50) of several compounds on drug target ChEMBL_ID: CHEMBL1847 (TID: 11881), and it has 17 rows and 1148 features (not including molecule IDs and class feature: molecule_id and pXC50). The features represent Molecular Descriptors which were generated from SMILES strings. Missing value imputation was applied to this dataset (By choosing the Median).",
    "description_version": "1",
    "file_id": "3630570",
    "format": "ARFF",
    "id": "38143",
    "licence": "Public",
    "md5_checksum": "6fa49270689dd13b4533549b53a2d288",
    "minio_url": "https://data.openml.org/datasets/0003/38143/dataset_38143.pq",
    "name": "QSAR-DATASET-FOR-DRUG-TARGET-CHEMBL1847",
    "original_data_url": "https://www.ebi.ac.uk/chembl/target/inspect/CHEMBL1847",
    "parquet_url": "https://data.openml.org/datasets/0003/38143/dataset_38143.pq",
    "processing_date": "2018-10-04 05:48:54",
    "row_id_attribute": "molecule_id",
    "status": "deactivated",
    "tag": [
      "MetaQSAR",
      "study_13"
    ],
    "upload_date": "2016-07-16T03:06:31",
    "url": "https://api.openml.org/data/v1/download/3630570/QSAR-DATASET-FOR-DRUG-TARGET-CHEMBL1847.arff",
    "version": "11",
    "visibility": "public"
  }
}