"molecule_id","AMW","C.","H.","Me","pXC50"
{1 6.698,2 40,3 51.1,4 0.996,5 5.011}
{0 CHEMBL1627565,1 6.698,2 40,3 51.1,4 0.996,5 5.614}
{0 CHEMBL1627683,1 6.382,2 41.9,3 53.5,4 0.987,5 4.866}
{0 CHEMBL1627685,1 6.266,2 41.9,3 53.5,4 0.98,5 4.978}
{0 CHEMBL1627689,1 6.032,2 40,3 55.6,4 0.978,5 5.124}
{0 CHEMBL1627690,1 6.644,2 43.9,3 51.2,4 0.989,5 4.83}
{0 CHEMBL1627697,1 6.032,2 40,3 55.6,4 0.978,5 4.924}
{0 CHEMBL1627698,1 6.205,2 43.9,3 53.7,4 0.977,5 4.6}
{0 CHEMBL1627977,1 6.382,2 41.9,3 53.5,4 0.987,5 4.991}
{0 CHEMBL194749,1 5.963,2 41.9,3 55.8,4 0.975,5 4.788}
