"molecule_id","FCFP4_1024b1","FCFP4_1024b10","FCFP4_1024b100","FCFP4_1024b1000","FCFP4_1024b1001","FCFP4_1024b1002","FCFP4_1024b1003","FCFP4_1024b1004","FCFP4_1024b1005","FCFP4_1024b1006","FCFP4_1024b1007","FCFP4_1024b1008","FCFP4_1024b1009","FCFP4_1024b101","FCFP4_1024b1010","FCFP4_1024b1011","FCFP4_1024b1012","FCFP4_1024b1013","FCFP4_1024b1014","FCFP4_1024b1015","FCFP4_1024b1016","FCFP4_1024b1017","FCFP4_1024b1018","FCFP4_1024b1019","FCFP4_1024b102","FCFP4_1024b1020","FCFP4_1024b1021","FCFP4_1024b1022","FCFP4_1024b1023","FCFP4_1024b1024","FCFP4_1024b103","FCFP4_1024b104","FCFP4_1024b105","FCFP4_1024b106","FCFP4_1024b107","FCFP4_1024b108","FCFP4_1024b109","FCFP4_1024b11","FCFP4_1024b110","FCFP4_1024b111","FCFP4_1024b112","FCFP4_1024b113","FCFP4_1024b114","FCFP4_1024b115","FCFP4_1024b116","FCFP4_1024b117","FCFP4_1024b118","FCFP4_1024b119","FCFP4_1024b12","FCFP4_1024b120","FCFP4_1024b121","FCFP4_1024b122","FCFP4_1024b123","FCFP4_1024b124","FCFP4_1024b125","FCFP4_1024b126","FCFP4_1024b127","FCFP4_1024b128","FCFP4_1024b129","FCFP4_1024b13","FCFP4_1024b130","FCFP4_1024b131","FCFP4_1024b132","FCFP4_1024b133","FCFP4_1024b134","FCFP4_1024b135","FCFP4_1024b136","FCFP4_1024b137","FCFP4_1024b138","FCFP4_1024b139","FCFP4_1024b14","FCFP4_1024b140","FCFP4_1024b141","FCFP4_1024b142","FCFP4_1024b143","FCFP4_1024b144","FCFP4_1024b145","FCFP4_1024b146","FCFP4_1024b147","FCFP4_1024b148","FCFP4_1024b149","FCFP4_1024b15","FCFP4_1024b150","FCFP4_1024b151","FCFP4_1024b152","FCFP4_1024b153","FCFP4_1024b154","FCFP4_1024b155","FCFP4_1024b156","FCFP4_1024b157","FCFP4_1024b158","FCFP4_1024b159","FCFP4_1024b16","FCFP4_1024b160","FCFP4_1024b161","FCFP4_1024b162","FCFP4_1024b163","FCFP4_1024b164","FCFP4_1024b165","FCFP4_1024b166","FCFP4_1024b167","FCFP4_1024b168","pXC50"
{1 1,15 1,24 1,95 1,103 4.77}
{0 CHEMBL418052,1 1,26 1,29 1,75 1,98 1,103 6.602}
{0 CHEMBL538627,1 1,26 1,29 1,52 1,98 1,103 4.347}
{0 CHEMBL538692,1 1,26 1,29 1,98 1,103 5.167}
{0 CHEMBL538693,1 1,26 1,29 1,75 1,98 1,103 4.77}
{0 CHEMBL539449,1 1,26 1,29 1,75 1,98 1,103 4}
{0 CHEMBL549412,1 1,29 1,75 1,98 1,103 5.699}
{0 CHEMBL550440,1 1,26 1,29 1,52 1,75 1,98 1,103 5.824}
{0 CHEMBL551100,1 1,26 1,29 1,52 1,75 1,98 1,103 4.585}
{0 CHEMBL551174,1 1,29 1,35 1,52 1,75 1,98 1,103 4.481}
{0 CHEMBL551787,1 1,26 1,29 1,52 1,75 1,98 1,103 4.409}
{0 CHEMBL552246,1 1,26 1,29 1,75 1,98 1,103 5.523}
{0 CHEMBL552309,1 1,20 1,26 1,29 1,75 1,98 1,103 6.523}
{0 CHEMBL552763,1 1,29 1,35 1,98 1,103 4.538}
{0 CHEMBL555257,1 1,29 1,35 1,75 1,98 1,103 6.585}
{0 CHEMBL555352,1 1,29 1,35 1,75 1,98 1,103 6.222}
{0 CHEMBL556265,1 1,29 1,35 1,75 1,98 1,103 6}
{0 CHEMBL557902,1 1,26 1,29 1,75 1,98 1,103 6.523}
{0 CHEMBL558883,1 1,2 1,26 1,29 1,75 1,98 1,103 4.959}
{0 CHEMBL559281,1 1,26 1,29 1,75 1,98 1,103 4.18}
{0 CHEMBL559283,1 1,29 1,35 1,98 1,103 6.036}
{0 CHEMBL560045,1 1,26 1,29 1,98 1,103 6}
{0 CHEMBL560105,1 1,29 1,35 1,75 1,98 1,103 6.222}
{0 CHEMBL560106,1 1,26 1,29 1,98 1,103 5.721}
{0 CHEMBL560306,1 1,29 1,35 1,75 1,98 1,103 5.444}
{0 CHEMBL560505,1 1,29 1,35 1,58 1,75 1,98 1,103 6.046}
{0 CHEMBL560768,1 1,29 1,35 1,52 1,98 1,103 4.569}
{0 CHEMBL561047,1 1,26 1,29 1,39 1,53 1,98 1,103 5.167}
{0 CHEMBL562689,1 1,26 1,29 1,52 1,75 1,98 1,103 4.678}
{0 CHEMBL563024,1 1,29 1,35 1,75 1,98 1,103 5.699}
{0 CHEMBL563230,1 1,26 1,29 1,75 1,98 1,103 4.268}
{0 CHEMBL563570,1 1,29 1,50 1,98 1,103 4.553}
{0 CHEMBL563782,1 1,26 1,29 1,52 1,75 1,98 1,103 4}
{0 CHEMBL563888,1 1,26 1,29 1,52 1,75 1,98 1,103 4}
{0 CHEMBL563938,1 1,26 1,29 1,75 1,98 1,103 4.387}
{0 CHEMBL563946,1 1,26 1,29 1,98 1,103 4.347}
{0 CHEMBL564052,1 1,26 1,29 1,52 1,75 1,98 1,103 4.921}
{0 CHEMBL564768,1 1,26 1,29 1,98 1,103 4.243}
