{
  "data_set_description": {
    "collection_date": "November 2013",
    "creator": "Dr Jeremy Besnard, Dr Ivan Olier, Dr Noureddin Sadawi, Dr Larisa Soldatova, Dr Crina Grosan, Prof Ross King, Dr Richard Bickerton, Prof Andrew Hopkins and Dr Willem van Hoorn",
    "default_target_attribute": "pXC50",
    "description": "This dataset contains QSAR data (from ChEMBL version 17) showing activity values (unit is pseudo-pCI50) of several compounds on drug target ChEMBL_ID: CHEMBL4975 (TID: 12265), and it has 636 rows and 1353 features (not including molecule IDs and class feature: molecule_id and pXC50). The features represent Molecular Descriptors which were generated from SMILES strings. Missing value imputation was applied to this dataset (By choosing the Median).",
    "description_version": "1",
    "file_id": "3628606",
    "format": "ARFF",
    "id": "38085",
    "licence": "Public",
    "md5_checksum": "a0b6d0350021d6c3e8bdeaf16ce67f56",
    "minio_url": "https://data.openml.org/datasets/0003/38085/dataset_38085.pq",
    "name": "QSAR-DATASET-FOR-DRUG-TARGET-CHEMBL4975",
    "original_data_url": "https://www.ebi.ac.uk/chembl/target/inspect/CHEMBL4975",
    "parquet_url": "https://data.openml.org/datasets/0003/38085/dataset_38085.pq",
    "processing_date": "2018-10-04 05:44:38",
    "row_id_attribute": "molecule_id",
    "status": "deactivated",
    "tag": [
      "MetaQSAR",
      "study_13"
    ],
    "upload_date": "2016-07-16T02:53:30",
    "url": "https://api.openml.org/data/v1/download/3628606/QSAR-DATASET-FOR-DRUG-TARGET-CHEMBL4975.arff",
    "version": "12",
    "visibility": "public"
  }
}