"molecule_id","AMW","C.","H.","Me","Mi","Mp","Mv","MW","N.","nAB","nAT","nB","nBM","nBO","nBR","nBT","nC","nCL","nCsp","nCsp2","nCsp3","nDB","nF","nH","nHet","nHM","nI","nN","nO","nP","nS","nSK","nTB","nX","O.","RBF","RBN","SCBO","Se","Si","Sp","Sv","X.","pXC50"
{1 7.143,2 43.3,3 46.7,4 0.994,5 1.123,6 0.668,7 0.631,8 214.29,9 6.7,10 10,11 30,13 11,14 18,16 32,17 13,20 9,21 4,22 1,24 14,25 3,28 2,29 1,32 16,35 3.3,36 0.031,37 1,38 24,39 29.833,40 33.697,41 20.034,42 18.918,44 4.606}
{0 CHEMBL1140,1 8.143,2 40,3 40,4 1.02,5 1.136,6 0.666,7 0.654,8 122.14,9 13.3,10 6,11 15,13 7,14 9,16 15,17 6,20 6,22 1,24 6,25 3,28 2,29 1,32 9,35 6.7,36 0.067,37 1,38 13,39 15.298,40 17.036,41 9.989,42 9.811,44 4.725}
{0 CHEMBL115600,1 6.919,2 42.4,3 48.5,4 0.991,5 1.125,6 0.66,7 0.62,8 228.32,9 6.1,10 10,11 33,13 11,14 19,16 35,17 14,20 9,21 5,22 1,24 16,25 3,28 2,29 1,32 17,35 3,36 0.029,37 1,38 25,39 32.716,40 37.112,41 21.796,42 20.445,44 4.939}
{0 CHEMBL1254032,1 7.195,2 29.6,3 51.9,4 1.013,5 1.147,6 0.613,7 0.577,8 388.55,9 7.4,11 54,13 5,14 25,16 53,17 16,20 5,21 11,22 5,24 28,25 10,26 1,28 4,29 5,31 1,32 26,35 9.3,36 0.208,37 11,38 30,39 54.723,40 61.943,41 33.08,42 31.168,44 5.009}
{0 CHEMBL1254033,1 8.064,2 29.6,3 51.9,4 1.014,5 1.146,6 0.622,7 0.581,8 435.44,9 7.4,11 54,13 5,14 25,16 53,17 16,20 5,21 11,22 5,24 28,25 10,26 1,28 4,29 5,32 26,35 9.3,36 0.208,37 11,38 30,39 54.741,40 61.889,41 33.574,42 31.377,44 5.143}
{0 CHEMBL1254035,1 8.223,2 39.3,3 48.2,4 1,5 1.124,6 0.672,7 0.624,8 460.48,9 5.4,10 12,11 56,13 15,14 30,16 57,17 22,20 15,21 7,22 3,24 27,25 7,26 1,28 3,29 3,32 29,35 5.4,36 0.193,37 11,38 39,39 55.985,40 62.972,41 37.659,42 34.926,44 5.569}
{0 CHEMBL1254217,1 6.647,2 29.3,3 53.4,4 1.011,5 1.154,6 0.59,7 0.561,8 385.53,9 8.6,11 58,13 5,14 26,16 57,17 17,20 5,21 12,22 5,24 31,25 10,28 5,29 5,32 27,35 8.6,36 0.193,37 11,38 31,39 58.632,40 66.936,41 34.199,42 32.529,44 4.222}
{0 CHEMBL1254304,1 6.382,2 29.9,3 55.2,4 1.004,5 1.152,6 0.589,7 0.554,8 427.62,9 7.5,11 67,13 5,14 29,16 66,17 20,20 5,21 15,22 5,24 37,25 10,28 5,29 5,32 30,35 7.5,36 0.182,37 12,38 34,39 67.283,40 77.182,41 39.483,42 37.11,44 4.18}
{0 CHEMBL1254380,1 6.665,2 31.3,3 53.1,4 1.01,5 1.148,6 0.596,7 0.567,8 426.58,9 6.3,11 64,13 6,14 29,16 63,17 20,20 7,21 13,22 6,24 34,25 10,28 4,29 6,32 30,35 9.4,36 0.206,37 13,38 35,39 64.625,40 73.478,41 38.171,42 36.276,44 4.161}
{0 CHEMBL1254458,1 6.548,2 30.8,3 53.8,4 1.006,5 1.15,6 0.596,7 0.563,8 425.6,9 7.7,11 65,13 6,14 29,16 64,17 20,20 7,21 13,22 6,24 35,25 10,28 5,29 5,32 30,35 7.7,36 0.188,37 12,38 35,39 65.4,40 74.767,41 38.722,42 36.583,44 4.638}
{0 CHEMBL1254459,1 6.763,2 31.1,3 52.5,4 1.012,5 1.149,6 0.597,7 0.57,8 412.55,9 6.6,11 61,13 6,14 28,16 60,17 19,20 7,21 12,22 6,24 32,25 10,28 4,29 6,32 29,35 9.8,36 0.2,37 12,38 34,39 61.741,40 70.062,41 36.409,42 34.75,44 4.114}
{0 CHEMBL1254539,1 6.58,2 30.2,3 54,4 1.01,5 1.15,6 0.59,7 0.56,8 414.57,9 6.3,11 63,13 5,14 28,16 62,17 19,20 5,21 14,22 5,24 34,25 10,28 4,29 6,32 29,35 9.5,36 0.21,37 13,38 33,39 63.625,40 72.478,41 37.171,42 35.276,44 4.523}
{0 CHEMBL1254613,1 6.836,2 30.2,3 54,4 1.006,5 1.146,6 0.609,7 0.567,8 430.64,9 6.3,11 63,13 5,14 28,16 62,17 19,20 5,21 14,22 5,24 34,25 10,26 1,28 4,29 5,31 1,32 29,35 7.9,36 0.21,37 13,38 33,39 63.374,40 72.188,41 38.364,42 35.749,44 5.444}
{0 CHEMBL1456134,1 9.104,2 50,3 36.4,4 0.997,5 1.098,6 0.77,7 0.719,8 200.28,9 9.1,10 15,11 22,13 15,14 16,16 24,17 11,20 11,24 8,25 3,26 1,28 2,31 1,32 14,38 23.5,39 21.931,40 24.162,41 16.943,42 15.81,44 5}
{0 CHEMBL1483080,1 9.69,2 46.4,3 32.1,4 1.025,5 1.11,6 0.745,7 0.724,8 271.32,9 10.7,10 10,11 28,13 14,14 21,16 30,17 13,20 13,22 4,24 9,25 6,26 1,28 3,29 2,31 1,32 19,35 7.1,36 0.033,37 1,38 30,39 28.687,40 31.079,41 20.858,42 20.261,44 4.699}
{0 CHEMBL1537405,1 9.496,2 45.5,3 33.3,4 1.027,5 1.112,6 0.73,7 0.712,8 313.36,9 9.1,10 11,11 33,13 15,14 24,16 35,17 15,20 14,21 1,22 4,24 11,25 7,26 1,28 3,29 3,31 1,32 22,35 9.1,36 0.029,37 1,38 33.5,39 33.898,40 36.704,41 24.074,42 23.503,44 4.959}
{0 CHEMBL1591531,1 8.171,2 44.6,3 41.1,4 1.003,5 1.117,6 0.704,7 0.669,8 457.6,9 8.9,10 20,11 56,13 24,14 37,16 60,17 25,20 21,21 4,22 4,24 23,25 8,26 1,28 5,29 2,31 1,32 33,35 3.6,36 0.117,37 7,38 51,39 56.192,40 62.567,41 39.438,42 37.465,44 6.097}
{0 CHEMBL1714005,1 9.69,2 46.4,3 32.1,4 1.025,5 1.11,6 0.745,7 0.724,8 271.32,9 10.7,10 10,11 28,13 14,14 21,16 30,17 13,20 13,22 4,24 9,25 6,26 1,28 3,29 2,31 1,32 19,35 7.1,36 0.033,37 1,38 30,39 28.687,40 31.079,41 20.858,42 20.261,44 4.693}
{0 CHEMBL1715925,1 8.906,2 47.4,3 36.8,4 1.015,5 1.106,6 0.726,7 0.698,8 338.41,9 5.3,10 12,11 38,13 16,14 26,16 40,17 18,20 17,21 1,22 4,24 14,25 6,26 1,28 2,29 3,31 1,32 24,35 7.9,36 0.1,37 4,38 36,39 38.564,40 42.036,41 27.591,42 26.535,44 5.009}
{0 CHEMBL1775003,1 10.325,2 29.2,3 37.5,4 1.057,5 1.146,6 0.665,7 0.654,8 743.39,9 9.7,10 16,11 72,13 19,14 49,15 1,16 76,17 21,20 11,21 10,22 3,24 27,25 24,26 3,28 7,29 14,30 2,32 45,34 1,35 19.4,36 0.145,37 11,38 60,39 76.135,40 82.484,41 47.875,42 47.088,43 1.4,44 4.553}
{0 CHEMBL1775005,1 9.452,2 32.9,3 37.8,4 1.049,5 1.139,6 0.67,7 0.658,8 775.04,9 8.5,10 22,11 82,13 25,14 56,16 87,17 27,18 1,20 17,21 10,22 3,24 31,25 24,26 3,28 7,29 14,30 2,32 51,34 1,35 17.1,36 0.138,37 12,38 70,39 85.996,40 93.416,41 54.903,42 53.944,43 1.2,44 4.456}
{0 CHEMBL1775006,1 8.961,2 32.6,3 39.5,4 1.045,5 1.141,6 0.654,7 0.644,8 770.63,9 8.1,10 22,11 86,13 25,14 57,16 91,17 28,20 17,21 11,22 3,24 34,25 24,26 2,28 7,29 15,30 2,32 52,35 17.4,36 0.143,37 13,38 71,39 89.884,40 98.097,41 56.261,42 55.358,44 4.367}
{0 CHEMBL1775007,1 8.878,2 32.9,3 40,4 1.042,5 1.14,6 0.657,7 0.643,8 754.63,9 8.2,10 22,11 85,13 25,14 56,16 90,17 28,20 17,21 11,22 3,24 34,25 23,26 2,28 7,29 14,30 2,32 51,35 16.5,36 0.133,37 12,38 70,39 88.556,40 96.888,41 55.807,42 54.643,44 4.284}
{0 CHEMBL1775011,1 9.008,2 34,3 38.3,4 1.042,5 1.14,6 0.664,7 0.654,8 423.36,9 10.6,10 16,11 47,13 17,14 32,16 50,17 16,20 11,21 5,22 1,24 18,25 13,26 1,28 5,29 7,30 1,32 29,35 14.9,36 0.1,37 5,38 41,39 48.96,40 53.587,41 31.222,42 30.722,44 4.538}
{0 CHEMBL1794051,1 16.87,2 48.4,3 32.3,4 1.019,5 1.091,6 0.866,7 0.774,8 522.96,9 3.2,10 12,11 31,13 13,14 23,15 2,16 33,17 15,20 14,21 1,22 1,24 10,25 6,26 3,27 1,28 1,29 2,32 21,34 3,35 6.5,36 0.03,37 1,38 30,39 31.585,40 33.812,41 26.847,42 23.979,43 9.7,44 4.807}
{0 CHEMBL1795371,1 9.07,2 50,3 35.3,4 1.01,5 1.1,6 0.746,7 0.715,8 308.38,9 5.9,10 12,11 34,13 16,14 24,16 36,17 17,20 17,22 4,24 12,25 5,26 1,28 2,29 2,31 1,32 22,35 5.9,36 0.056,37 2,38 34,39 34.353,40 37.411,41 25.375,42 24.294,44 5.06}
{0 CHEMBL1797725,1 8.195,2 55.8,3 37.2,4 1.001,5 1.092,6 0.732,7 0.706,8 352.4,10 22,11 43,13 24,14 31,16 47,17 24,20 22,21 2,22 2,24 16,25 3,29 3,32 27,35 7,36 0.043,37 2,38 44,39 43.051,40 46.95,41 31.455,42 30.359,44 5.051}
{0 CHEMBL1797726,1 8.052,2 55.3,3 38.3,4 0.999,5 1.093,6 0.728,7 0.7,8 378.44,10 23,11 47,13 25,14 33,16 51,17 26,20 24,21 2,22 2,24 18,25 3,29 3,32 29,35 6.4,36 0.059,37 3,38 46.5,39 46.934,40 51.365,41 34.216,42 32.886,44 5}
{0 CHEMBL1797739,1 8.552,2 52.1,3 37.5,4 1,5 1.097,6 0.743,7 0.706,8 410.52,9 4.2,10 22,11 48,13 25,14 34,16 52,17 25,20 24,21 1,22 3,24 18,25 5,26 1,28 2,29 2,31 1,32 30,35 4.2,36 0.058,37 3,38 48,39 48.003,40 52.657,41 35.659,42 33.874,44 4.302}
{0 CHEMBL1797748,1 8.094,2 47.9,3 41.7,4 0.998,5 1.106,6 0.717,7 0.675,8 388.52,9 4.2,10 17,11 48,13 20,14 31,16 51,17 23,20 20,21 3,22 3,24 20,25 5,26 1,28 2,29 2,31 1,32 28,35 4.2,36 0.098,37 5,38 42.5,39 47.887,40 53.072,41 34.421,42 32.401,44 4.294}
{0 CHEMBL1797749,1 8.235,2 38.8,3 42.9,4 1.02,5 1.127,6 0.669,7 0.644,8 403.5,9 6.1,10 12,11 49,13 17,14 30,16 51,17 19,20 13,21 6,22 5,24 21,25 9,26 1,28 3,29 5,31 1,32 28,35 10.2,36 0.098,37 5,38 41,39 49.971,40 55.199,41 32.79,42 31.567,44 4.903}
{0 CHEMBL1797919,1 9.55,2 45.8,3 29.2,4 1.044,5 1.123,6 0.704,7 0.719,8 229.21,9 12.5,10 11,11 24,13 14,14 19,16 26,17 11,20 11,22 3,24 7,25 6,28 3,29 3,32 17,35 12.5,36 0.038,37 1,38 27.5,39 25.055,40 26.954,41 16.903,42 17.262,44 4.921}
{0 CHEMBL1797920,1 10.223,2 42.1,3 31.6,4 1.037,5 1.114,6 0.742,7 0.722,8 194.23,9 10.5,10 10,11 19,13 11,14 14,16 20,17 8,20 8,22 1,24 6,25 5,26 1,28 2,29 2,31 1,32 13,35 10.5,36 0.05,37 1,38 20,39 19.702,40 21.166,41 14.091,42 13.713,44 4.417}
{0 CHEMBL1797922,1 12.377,2 40,3 26.7,4 1.039,5 1.118,6 0.819,7 0.774,8 185.65,9 20,10 10,11 15,13 10,14 12,16 16,17 6,18 1,20 6,24 4,25 5,26 2,28 3,31 1,32 11,34 1,38 17,39 15.589,40 16.774,41 12.284,42 11.606,43 6.7,44 4.57}
{0 CHEMBL1797923,1 9.539,2 36.8,3 36.8,4 1.025,5 1.129,6 0.718,7 0.685,8 181.24,9 15.8,10 10,11 19,13 10,14 13,16 20,17 7,20 6,21 1,24 7,25 5,26 1,28 3,29 1,31 1,32 12,35 5.3,36 0.05,37 1,38 18,39 19.476,40 21.455,41 13.642,42 13.02,44 4.788}
{0 CHEMBL1797925,1 7.686,2 38.2,3 44.1,4 1.017,5 1.136,6 0.646,7 0.629,8 261.31,9 8.8,10 6,11 34,13 9,14 21,16 36,17 13,20 7,21 6,22 3,24 15,25 6,28 3,29 3,32 19,35 8.8,36 0.056,37 2,38 27,39 34.589,40 38.614,41 21.949,42 21.369,44 4.463}
{0 CHEMBL1797926,1 9.165,2 34.6,3 38.5,4 1.03,5 1.138,6 0.687,7 0.665,8 238.3,9 15.4,10 10,11 26,13 12,14 17,16 27,17 9,20 7,21 2,22 2,24 10,25 7,26 1,28 4,29 2,31 1,32 16,35 7.7,36 0.111,37 3,38 24,39 26.789,40 29.578,41 17.864,42 17.283,44 5.301}
{0 CHEMBL1814815,1 6.887,2 29.6,3 53.1,4 1.008,5 1.15,6 0.606,7 0.569,8 557.81,9 8.6,11 81,13 7,14 37,16 80,17 24,20 7,21 17,22 7,24 43,25 14,26 1,28 7,29 6,31 1,32 38,35 7.4,36 0.238,37 19,38 44,39 81.658,40 93.138,41 49.12,42 46.108,44 5.538}
{0 CHEMBL1835296,1 6.924,2 29.3,3 53.4,4 1.007,5 1.149,6 0.61,7 0.569,8 401.6,9 8.6,11 58,13 5,14 26,16 57,17 17,20 5,21 12,22 5,24 31,25 10,26 1,28 5,29 4,31 1,32 27,35 6.9,36 0.193,37 11,38 31,39 58.381,40 66.647,41 35.392,42 33.002,44 5.538}
{0 CHEMBL1835297,1 7.063,2 29.8,3 52.6,4 1.011,5 1.147,6 0.611,7 0.574,8 402.58,9 7,11 57,13 5,14 26,16 56,17 17,20 5,21 12,22 5,24 30,25 10,26 1,28 4,29 5,31 1,32 27,35 8.8,36 0.214,37 12,38 31,39 57.607,40 65.358,41 34.841,42 32.695,44 4.886}
{0 CHEMBL1835298,1 7.072,2 28.6,3 53.1,4 1.01,5 1.149,6 0.609,7 0.57,8 346.51,9 8.2,11 49,13 4,14 22,16 48,17 14,20 4,21 10,22 4,24 26,25 9,26 1,28 4,29 4,31 1,32 23,35 8.2,36 0.208,37 10,38 26,39 49.512,40 56.318,41 29.864,42 27.927,44 4.444}
{0 CHEMBL1835299,1 7.062,2 28.2,3 53.8,4 1.008,5 1.148,6 0.612,7 0.568,8 275.42,9 7.7,11 39,13 3,14 17,16 38,17 11,20 3,21 8,22 3,24 21,25 7,26 1,28 3,29 3,31 1,32 18,35 7.7,36 0.211,37 8,38 20,39 39.316,40 44.78,41 23.881,42 22.137,44 5.699}
{0 CHEMBL1835301,1 7.148,2 31,3 51.7,4 1.01,5 1.144,6 0.618,7 0.581,8 414.59,9 6.9,11 58,13 5,14 28,16 58,17 18,20 5,21 13,22 5,24 30,25 10,26 1,28 4,29 5,31 1,32 28,35 8.6,36 0.172,37 10,38 33,39 58.607,40 66.358,41 35.841,42 33.695,44 4.509}
{0 CHEMBL1835302,1 6.979,2 29.7,3 53.1,4 1.011,5 1.147,6 0.607,7 0.57,8 446.64,9 6.3,11 64,13 5,14 29,16 63,17 19,20 5,21 14,22 5,24 34,25 11,26 1,28 4,29 6,31 1,32 30,35 9.4,36 0.206,37 13,38 34,39 64.701,40 73.398,41 38.818,42 36.463,44 5.187}
{0 CHEMBL1835303,1 7.163,2 33.9,3 50.8,4 1.005,5 1.138,6 0.634,7 0.593,8 422.61,9 6.8,10 6,11 59,13 10,14 29,16 59,17 20,20 10,21 10,22 4,24 30,25 9,26 1,28 4,29 4,31 1,32 29,35 6.8,36 0.203,37 12,38 36,39 59.28,40 67.148,41 37.387,42 34.98,44 4.65}
{0 CHEMBL1835304,1 7.447,2 34.5,3 49.1,4 1.011,5 1.135,6 0.638,7 0.603,8 409.56,9 5.5,10 6,11 55,13 10,14 28,16 55,17 19,20 10,21 9,22 4,24 27,25 9,26 1,28 3,29 5,31 1,32 28,35 9.1,36 0.218,37 12,38 35,39 55.622,40 62.444,41 35.074,42 33.147,44 4.77}
{0 CHEMBL1835305,1 7.151,2 35.1,3 50.9,4 1.003,5 1.134,6 0.638,7 0.596,8 407.59,9 5.3,10 6,11 57,13 10,14 28,16 57,17 20,20 10,21 10,22 4,24 29,25 8,26 1,28 3,29 4,31 1,32 28,35 7,36 0.211,37 12,38 35,39 57.178,40 64.65,41 36.381,42 33.959,44 4.252}
{0 CHEMBL1835306,1 7.466,2 35.1,3 49.1,4 1.012,5 1.14,6 0.637,7 0.602,8 425.58,9 5.3,10 6,11 57,13 10,14 29,16 57,17 20,20 10,21 10,22 4,23 1,24 28,25 9,26 1,28 3,29 4,31 1,32 29,34 1,35 7,36 0.211,37 12,38 36,39 57.691,40 64.99,41 36.319,42 34.342,43 1.8,44 4.569}
{0 CHEMBL1835307,1 7.303,2 34.5,3 50,4 1.009,5 1.136,6 0.635,7 0.598,8 423.59,9 5.2,10 6,11 58,13 10,14 29,16 58,17 20,20 10,21 10,22 4,24 29,25 9,26 1,28 3,29 5,31 1,32 29,35 8.6,36 0.207,37 12,38 36,39 58.505,40 65.86,41 36.836,42 34.674,44 4.276}
{0 CHEMBL1835308,1 6.855,2 31,3 53.5,4 1.007,5 1.144,6 0.61,7 0.571,8 486.71,9 5.6,11 71,13 5,14 33,16 71,17 22,20 5,21 17,22 5,24 38,25 11,26 1,28 4,29 6,31 1,32 33,35 8.5,36 0.169,37 12,38 38,39 71.469,40 81.228,41 43.341,42 40.517,44 4.886}
{0 CHEMBL1835309,1 6.769,2 35.5,3 53.2,4 0.994,5 1.133,6 0.636,7 0.585,8 419.65,9 4.8,10 6,11 62,13 9,14 30,16 63,17 22,20 9,21 13,22 3,24 33,25 7,26 1,28 3,29 3,31 1,32 29,35 4.8,36 0.175,37 11,38 36,39 61.618,40 70.271,41 39.449,42 36.298,44 4.243}
{0 CHEMBL1835310,1 7.707,2 39.3,3 46.4,4 1.009,5 1.132,6 0.663,7 0.627,8 431.58,9 5.4,10 12,11 56,13 15,14 31,16 57,17 22,20 15,21 7,22 3,23 1,24 26,25 8,26 1,28 3,29 3,31 1,32 30,34 1,35 5.4,36 0.193,37 11,38 40,39 56.48,40 63.365,41 37.103,42 35.101,43 1.8,44 4.796}
{0 CHEMBL1835311,1 7.537,2 38.6,3 47.4,4 1.005,5 1.127,6 0.66,7 0.622,8 429.59,9 5.3,10 12,11 57,13 15,14 31,16 58,17 22,20 15,21 7,22 3,24 27,25 8,26 1,28 3,29 4,31 1,32 30,35 7,36 0.19,37 11,38 40,39 57.294,40 64.235,41 37.62,42 35.432,44 5.131}
{0 CHEMBL1835312,1 7.469,2 39.3,3 47.5,4 1.003,5 1.125,6 0.662,7 0.622,8 455.63,9 4.9,10 12,11 61,13 16,14 33,16 62,17 24,20 16,21 8,22 4,24 29,25 8,26 1,28 3,29 4,31 1,32 32,35 6.6,36 0.21,37 13,38 43,39 61.178,40 68.65,41 40.381,42 37.959,44 5.367}
{0 CHEMBL1945130,1 6.889,2 37.9,3 51.5,4 0.991,5 1.13,6 0.652,7 0.6,8 454.7,9 6.1,10 12,11 66,13 15,14 33,16 67,17 25,20 15,21 10,22 3,24 34,25 7,26 1,28 4,29 2,31 1,32 32,35 3,36 0.134,37 9,38 42,39 65.392,40 74.56,41 43,42 39.604,44 4.983}
{0 CHEMBL1945131,1 6.995,2 38.1,3 50.8,4 0.992,5 1.129,6 0.655,7 0.604,8 440.67,9 6.3,10 12,11 63,13 15,14 32,16 64,17 24,20 15,21 9,22 3,24 32,25 7,26 1,28 4,29 2,31 1,32 31,35 3.2,36 0.125,37 8,38 41,39 62.509,40 71.145,41 41.239,42 38.077,44 4.893}
{0 CHEMBL1945132,1 6.793,2 37.7,3 52.2,4 0.99,5 1.13,6 0.649,7 0.596,8 468.73,9 5.8,10 12,11 69,13 15,14 34,16 70,17 26,20 15,21 11,22 3,24 36,25 7,26 1,28 4,29 2,31 1,32 33,35 2.9,36 0.143,37 10,38 43,39 68.276,40 77.975,41 44.762,42 41.131,44 4.672}
{0 CHEMBL1945133,1 6.624,2 37.3,3 53.3,4 0.987,5 1.131,6 0.644,7 0.589,8 496.79,9 5.3,10 12,11 75,13 15,14 36,16 76,17 28,20 15,21 13,22 3,24 40,25 7,26 1,28 4,29 2,31 1,32 35,35 2.7,36 0.158,37 12,38 45,39 74.043,40 84.806,41 48.285,42 44.185,44 4.38}
{0 CHEMBL1945134,1 6.879,2 34.8,3 52.2,4 1.002,5 1.136,6 0.626,7 0.585,8 632.91,9 4.3,10 12,11 92,13 15,14 45,16 93,17 32,20 15,21 17,22 3,24 48,25 12,26 1,28 4,29 7,31 1,32 44,35 7.6,36 0.226,37 21,38 54,39 92.214,40 104.513,41 57.603,42 53.866,44 4.046}
{0 CHEMBL1945136,1 6.995,2 38.1,3 50.8,4 0.992,5 1.129,6 0.655,7 0.604,8 440.67,9 6.3,10 12,11 63,13 15,14 32,16 64,17 24,20 15,21 9,22 3,24 32,25 7,26 1,28 4,29 2,31 1,32 31,35 3.2,36 0.156,37 10,38 41,39 62.509,40 71.145,41 41.239,42 38.077,44 5.105}
{0 CHEMBL1945137,1 6.995,2 38.1,3 50.8,4 0.992,5 1.129,6 0.655,7 0.604,8 440.67,9 6.3,10 12,11 63,13 15,14 32,16 64,17 24,20 15,21 9,22 3,24 32,25 7,26 1,28 4,29 2,31 1,32 31,35 3.2,36 0.141,37 9,38 41,39 62.509,40 71.145,41 41.239,42 38.077,44 5.243}
{0 CHEMBL1945254,1 6.889,2 37.9,3 51.5,4 0.991,5 1.13,6 0.652,7 0.6,8 454.7,9 6.1,10 12,11 66,13 15,14 33,16 67,17 25,20 15,21 10,22 3,24 34,25 7,26 1,28 4,29 2,31 1,32 32,35 3,36 0.164,37 11,38 42,39 65.392,40 74.56,41 43,42 39.604,44 5.066}
{0 CHEMBL1945255,1 6.793,2 37.7,3 52.2,4 0.99,5 1.13,6 0.649,7 0.596,8 468.73,9 5.8,10 12,11 69,13 15,14 34,16 70,17 26,20 15,21 11,22 3,24 36,25 7,26 1,28 4,29 2,31 1,32 33,35 2.9,36 0.171,37 12,38 43,39 68.276,40 77.975,41 44.762,42 41.131,44 5.252}
{0 CHEMBL1945256,1 7.381,2 38.9,3 48.1,4 0.997,5 1.128,6 0.666,7 0.62,8 398.58,9 7.4,10 12,11 54,13 15,14 29,16 55,17 21,20 15,21 6,22 3,24 26,25 7,26 1,28 4,29 2,31 1,32 28,35 3.7,36 0.145,37 8,38 38,39 53.858,40 60.899,41 35.955,42 33.497,44 4.046}
{0 CHEMBL1945257,1 7.239,2 38.6,3 49.1,4 0.995,5 1.128,6 0.662,7 0.614,8 412.61,9 7,10 12,11 57,13 15,14 30,16 58,17 22,20 15,21 7,22 3,24 28,25 7,26 1,28 4,29 2,31 1,32 29,35 3.5,36 0.138,37 8,38 39,39 56.741,40 64.314,41 37.716,42 35.024,44 4.046}
{0 CHEMBL1945258,1 7.39,2 37.9,3 48.3,4 1.001,5 1.13,6 0.658,7 0.616,8 428.61,9 6.9,10 12,11 58,13 15,14 31,16 59,17 22,20 15,21 7,22 3,24 28,25 8,26 1,28 4,29 3,31 1,32 30,35 5.2,36 0.153,37 9,38 40,39 58.069,40 65.524,41 38.171,42 35.739,44 4.296}
{0 CHEMBL1945259,1 8.019,2 38.9,3 46.3,4 1.003,5 1.127,6 0.682,7 0.636,8 433.02,9 7.4,10 12,11 54,13 15,14 30,16 55,17 21,18 1,20 15,21 6,22 3,24 25,25 8,26 2,28 4,29 2,31 1,32 29,34 1,35 3.7,36 0.145,37 8,38 39,39 54.182,40 60.843,41 36.813,42 34.325,43 1.9,44 4.046}
{0 CHEMBL1945260,1 8.842,2 38.9,3 46.3,4 1.002,5 1.125,6 0.691,7 0.639,8 477.47,9 7.4,10 12,11 54,13 15,14 30,15 1,16 55,17 21,20 15,21 6,22 3,24 25,25 8,26 2,28 4,29 2,31 1,32 29,34 1,35 3.7,36 0.145,37 8,38 39,39 54.087,40 60.741,41 37.307,42 34.522,43 1.9,44 4.26}
{0 CHEMBL1945261,1 7.239,2 38.6,3 49.1,4 0.995,5 1.128,6 0.662,7 0.614,8 412.61,9 7,10 12,11 57,13 15,14 30,16 58,17 22,20 15,21 7,22 3,24 28,25 7,26 1,28 4,29 2,31 1,32 29,35 3.5,36 0.138,37 8,38 39,39 56.741,40 64.314,41 37.716,42 35.024,44 4.046}
{0 CHEMBL1945264,1 8.842,2 38.9,3 46.3,4 1.002,5 1.125,6 0.691,7 0.639,8 477.47,9 7.4,10 12,11 54,13 15,14 30,15 1,16 55,17 21,20 15,21 6,22 3,24 25,25 8,26 2,28 4,29 2,31 1,32 29,34 1,35 3.7,36 0.145,37 8,38 39,39 54.087,40 60.741,41 37.307,42 34.522,43 1.9,44 4.674}
{0 CHEMBL1945265,1 8.085,2 37.9,3 50,4 0.994,5 1.127,6 0.672,7 0.616,8 533.59,9 6.1,10 12,11 66,13 15,14 34,15 1,16 67,17 25,20 15,21 10,22 3,24 33,25 8,26 2,28 4,29 2,31 1,32 33,34 1,35 3,36 0.134,37 9,38 43,39 65.621,40 74.402,41 44.353,42 40.629,43 1.5,44 5.337}
{0 CHEMBL1945266,1 8.657,2 38.9,3 44.4,4 1.009,5 1.126,6 0.698,7 0.651,8 467.46,9 7.4,10 12,11 54,13 15,14 31,16 55,17 21,18 2,20 15,21 6,22 3,24 24,25 9,26 3,28 4,29 2,31 1,32 30,34 2,35 3.7,36 0.145,37 8,38 40,39 54.505,40 60.787,41 37.671,42 35.152,43 3.7,44 4.496}
{0 CHEMBL1945670,1 7.239,2 38.6,3 49.1,4 0.995,5 1.128,6 0.662,7 0.614,8 412.61,9 7,10 12,11 57,13 15,14 30,16 58,17 22,20 15,21 7,22 3,24 28,25 7,26 1,28 4,29 2,31 1,32 29,35 3.5,36 0.138,37 8,38 39,39 56.741,40 64.314,41 37.716,42 35.024,44 4.372}
{0 CHEMBL1945671,1 8.019,2 38.9,3 46.3,4 1.003,5 1.127,6 0.682,7 0.636,8 433.02,9 7.4,10 12,11 54,13 15,14 30,16 55,17 21,18 1,20 15,21 6,22 3,24 25,25 8,26 2,28 4,29 2,31 1,32 29,34 1,35 3.7,36 0.145,37 8,38 39,39 54.182,40 60.843,41 36.813,42 34.325,43 1.9,44 4.046}
{0 CHEMBL1945672,1 6.646,2 37.9,3 51.5,4 0.995,5 1.134,6 0.633,7 0.593,8 438.63,9 6.1,10 12,11 66,13 15,14 33,16 67,17 25,20 15,21 10,22 3,24 34,25 7,28 4,29 3,32 32,35 4.5,36 0.134,37 9,38 42,39 65.643,40 74.849,41 41.807,42 39.132,44 4.054}
{0 CHEMBL1945673,1 6.889,2 37.9,3 51.5,4 0.991,5 1.13,6 0.652,7 0.6,8 454.7,9 6.1,10 12,11 66,13 15,14 33,16 67,17 25,20 15,21 10,22 3,24 34,25 7,26 1,28 4,29 2,31 1,32 32,35 3,36 0.134,37 9,38 42,39 65.392,40 74.56,41 43,42 39.604,44 4.907}
{0 CHEMBL197282,1 7.587,2 50,3 42.3,4 0.994,5 1.107,6 0.703,7 0.668,8 394.5,9 3.8,10 23,11 52,13 25,14 33,16 55,17 26,20 24,21 2,22 2,24 22,25 4,28 2,29 2,32 30,35 3.8,36 0.091,37 5,38 46.5,39 51.694,40 57.567,41 36.534,42 34.74,44 4.405}
{0 CHEMBL198582,1 7.587,2 50,3 42.3,4 0.994,5 1.107,6 0.703,7 0.668,8 394.5,9 3.8,10 23,11 52,13 25,14 33,16 55,17 26,20 24,21 2,22 2,24 22,25 4,28 2,29 2,32 30,35 3.8,36 0.091,37 5,38 46.5,39 51.694,40 57.567,41 36.534,42 34.74,44 4.307}
{0 CHEMBL200762,1 7.587,2 50,3 42.3,4 0.994,5 1.107,6 0.703,7 0.668,8 394.5,9 3.8,10 23,11 52,13 25,14 33,16 55,17 26,20 24,21 2,22 2,24 22,25 4,28 2,29 2,32 30,35 3.8,36 0.091,37 5,38 46.5,39 51.694,40 57.567,41 36.534,42 34.74,44 4.455}
{0 CHEMBL2151055,1 7.787,2 46.7,3 42.2,4 1.007,5 1.122,6 0.682,7 0.658,8 350.42,9 4.4,10 18,11 45,13 19,14 28,16 47,17 21,20 19,21 2,22 1,23 1,24 19,25 5,28 2,29 2,32 26,34 1,35 4.4,36 0.149,37 7,38 38,39 45.323,40 50.492,41 30.711,42 29.597,43 2.2,44 5.699}
{0 CHEMBL2152567,1 9.041,2 45.2,3 35.5,4 1.044,5 1.152,6 0.672,7 0.68,8 280.27,9 6.5,10 12,11 31,13 13,14 21,16 32,17 14,20 13,21 1,22 1,23 3,24 11,25 6,28 2,29 1,32 20,34 3,35 3.2,36 0.094,37 3,38 28,39 32.371,40 35.716,41 20.847,42 21.068,43 9.7,44 4}
{0 CHEMBL2152568,1 7.95,2 44.1,3 41.2,4 1.014,5 1.121,6 0.675,7 0.657,8 270.31,9 5.9,10 12,11 34,13 14,14 21,16 35,17 15,20 14,21 1,22 2,24 14,25 5,28 2,29 3,32 20,35 8.8,36 0.143,37 5,38 29,39 34.487,40 38.116,41 22.943,42 22.348,44 4}
{0 CHEMBL2152569,1 8.267,2 45.2,3 38.7,4 1.019,5 1.119,6 0.683,7 0.672,8 256.28,9 6.5,10 12,11 31,13 14,14 20,16 32,17 14,20 14,22 2,24 12,25 5,28 2,29 3,32 19,35 9.7,36 0.125,37 4,38 28,39 31.604,40 34.701,41 21.182,42 20.821,44 4}
{0 CHEMBL2152570,1 7.459,2 42.5,3 45,4 1.006,5 1.124,6 0.662,7 0.635,8 298.37,9 5,10 12,11 40,13 14,14 23,16 41,17 17,20 14,21 3,22 2,24 18,25 5,28 2,29 3,32 22,35 7.5,36 0.171,37 7,38 31,39 40.254,40 44.946,41 26.466,42 25.402,44 4.032}
{0 CHEMBL2152571,1 7.685,2 43.2,3 43.2,4 1.01,5 1.122,6 0.668,7 0.645,8 284.34,9 5.4,10 12,11 37,13 14,14 22,16 38,17 16,20 14,21 2,22 2,24 16,25 5,28 2,29 3,32 21,35 8.1,36 0.158,37 6,38 30,39 37.371,40 41.531,41 24.705,42 23.875,44 4}
{0 CHEMBL2152572,1 8.811,2 46.4,3 39.3,4 1.01,5 1.115,6 0.719,7 0.686,8 246.71,9 7.1,10 12,11 28,13 13,14 18,16 29,17 13,18 1,20 13,22 1,24 11,25 4,26 1,28 2,29 1,32 17,34 1,35 3.6,36 0.103,37 3,38 25,39 28.273,40 31.226,41 20.131,42 19.219,43 3.6,44 4}
{0 CHEMBL2152573,1 7.3,2 45.2,3 45.2,4 0.995,5 1.119,6 0.679,7 0.643,8 226.3,9 6.5,10 12,11 31,13 13,14 18,16 32,17 14,20 13,21 1,22 1,24 14,25 3,28 2,29 1,32 17,35 3.2,36 0.094,37 3,38 25,39 30.833,40 34.697,41 21.034,42 19.918,44 4.222}
{0 CHEMBL2152574,1 9.041,2 45.2,3 35.5,4 1.044,5 1.152,6 0.672,7 0.68,8 280.27,9 6.5,10 12,11 31,13 13,14 21,16 32,17 14,20 13,21 1,22 1,23 3,24 11,25 6,28 2,29 1,32 20,34 3,35 3.2,36 0.094,37 3,38 28,39 32.371,40 35.716,41 20.847,42 21.068,43 9.7,44 4.161}
{0 CHEMBL2152575,1 6.71,2 42.5,3 50,4 0.987,5 1.124,6 0.658,7 0.612,8 268.39,9 5,10 12,11 40,13 13,14 21,16 41,17 17,20 13,21 4,22 1,24 20,25 3,28 2,29 1,32 20,35 2.5,36 0.098,37 4,38 28,39 39.483,40 44.943,41 26.319,42 24.499,44 4}
{0 CHEMBL2152576,1 7.572,2 43.8,3 43.8,4 1.005,5 1.122,6 0.672,7 0.645,8 242.3,9 6.3,10 12,11 32,13 13,14 19,16 33,17 14,20 13,21 1,22 1,24 14,25 4,28 2,29 2,32 18,35 6.3,36 0.121,37 4,38 26,39 32.16,40 35.907,41 21.489,42 20.633,44 4.097}
{0 CHEMBL2152577,1 7.581,2 47.6,3 42.9,4 0.998,5 1.113,6 0.691,7 0.659,8 318.4,9 4.8,10 18,11 42,13 19,14 26,16 44,17 20,20 19,21 1,22 1,24 18,25 4,28 2,29 2,32 24,35 4.8,36 0.136,37 6,38 36,39 41.927,40 46.737,41 29.012,42 27.687,44 4.481}
{0 CHEMBL2152578,1 8.182,2 48.3,3 37.9,4 1.006,5 1.116,6 0.707,7 0.686,8 237.28,9 10.3,10 12,11 29,13 14,14 19,16 30,17 14,19 1,20 13,22 1,24 11,25 4,28 3,29 1,32 18,33 1,35 3.4,36 0.1,37 3,38 28,39 29.167,40 32.365,41 20.517,42 19.886,44 4.032}
{0 CHEMBL2152579,1 7.95,2 44.1,3 41.2,4 1.014,5 1.121,6 0.675,7 0.657,8 270.31,9 5.9,10 12,11 34,13 14,14 21,16 35,17 15,20 14,21 1,22 2,24 14,25 5,28 2,29 3,32 20,35 8.8,36 0.143,37 5,38 29,39 34.487,40 38.116,41 22.943,42 22.348,44 4.081}
{0 CHEMBL2152580,1 8.267,2 45.2,3 38.7,4 1.019,5 1.119,6 0.683,7 0.672,8 256.28,9 6.5,10 12,11 31,13 14,14 20,16 32,17 14,20 14,22 2,24 12,25 5,28 2,29 3,32 19,35 9.7,36 0.125,37 4,38 28,39 31.604,40 34.701,41 21.182,42 20.821,44 4}
{0 CHEMBL2152581,1 8.074,2 43.8,3 43.8,4 0.997,5 1.113,6 0.709,7 0.66,8 258.37,9 6.3,10 12,11 32,13 13,14 19,16 33,17 14,20 13,21 1,22 1,24 14,25 4,26 1,28 2,29 1,31 1,32 18,35 3.1,36 0.121,37 4,38 26,39 31.909,40 35.617,41 22.682,42 21.106,44 4}
{0 CHEMBL2152582,1 7.716,2 50,3 41.2,4 0.995,5 1.109,6 0.707,7 0.674,8 262.33,9 5.9,10 17,11 34,13 18,14 22,16 36,17 17,20 17,22 1,24 14,25 3,28 2,29 1,32 20,35 2.9,36 0.083,37 3,38 31.5,39 33.833,40 37.697,41 24.034,42 22.918,44 4}
{0 CHEMBL2152583,1 7.3,2 45.2,3 45.2,4 0.995,5 1.119,6 0.679,7 0.643,8 226.3,9 6.5,10 12,11 31,13 13,14 18,16 32,17 14,20 13,21 1,22 1,24 14,25 3,28 2,29 1,32 17,35 3.2,36 0.125,37 4,38 25,39 30.833,40 34.697,41 21.034,42 19.918,44 4}
{0 CHEMBL2152584,1 7.3,2 45.2,3 45.2,4 0.995,5 1.119,6 0.679,7 0.643,8 226.3,9 6.5,10 12,11 31,13 13,14 18,16 32,17 14,20 13,21 1,22 1,24 14,25 3,28 2,29 1,32 17,35 3.2,36 0.094,37 3,38 25,39 30.833,40 34.697,41 21.034,42 19.918,44 4}
{0 CHEMBL2152585,1 7.069,2 44.1,3 47.1,4 0.992,5 1.121,6 0.67,7 0.631,8 240.33,9 5.9,10 12,11 34,13 13,14 19,16 35,17 15,20 13,21 2,22 1,24 16,25 3,28 2,29 1,32 18,35 2.9,36 0.086,37 3,38 26,39 33.716,40 38.112,41 22.796,42 21.445,44 4}
{0 CHEMBL2152586,1 7.898,2 48.1,3 40.7,4 1.006,5 1.111,6 0.693,7 0.67,8 213.25,9 3.7,10 12,11 27,13 13,14 17,16 28,17 13,20 13,22 1,24 11,25 3,28 1,29 2,32 16,35 7.4,36 0.107,37 3,38 24,39 27.174,40 29.993,41 18.722,42 18.085,44 4}
{0 CHEMBL2152587,1 7.3,2 45.2,3 45.2,4 0.995,5 1.119,6 0.679,7 0.643,8 226.3,9 6.5,10 12,11 31,13 13,14 18,16 32,17 14,20 13,21 1,22 1,24 14,25 3,28 2,29 1,32 17,35 3.2,36 0.094,37 3,38 25,39 30.833,40 34.697,41 21.034,42 19.918,44 4}
{0 CHEMBL2152588,1 7.486,2 50,3 42.9,4 0.99,5 1.108,6 0.704,7 0.666,8 314.41,9 4.8,10 18,11 42,13 20,14 26,16 44,17 21,20 21,22 2,24 18,25 3,28 2,29 1,32 24,35 2.4,36 0.114,37 5,38 37,39 41.6,40 46.528,41 29.557,42 27.972,44 4.699}
{0 CHEMBL2152590,1 7.192,2 47.7,3 45.5,4 0.988,5 1.112,6 0.689,7 0.648,8 316.43,9 4.5,10 18,11 44,13 19,14 26,16 46,17 21,20 19,21 2,22 1,24 20,25 3,28 2,29 1,32 24,35 2.3,36 0.13,37 6,38 36,39 43.483,40 48.943,41 30.319,42 28.499,44 4.056}
{0 CHEMBL2152591,1 7.676,2 46.7,3 42.2,4 1.001,5 1.116,6 0.689,7 0.66,8 345.43,9 6.7,10 18,11 45,13 20,14 28,16 47,17 21,20 20,21 1,22 2,24 19,25 5,28 3,29 2,32 26,35 4.4,36 0.106,37 5,38 39,39 45.029,40 50.235,41 31.017,42 29.708,44 4.161}
{0 CHEMBL2152592,1 7.89,2 47.6,3 40.5,4 1.003,5 1.115,6 0.697,7 0.671,8 331.4,9 7.1,10 18,11 42,13 20,14 27,16 44,17 20,20 20,22 2,24 17,25 5,28 3,29 2,32 25,35 4.8,36 0.114,37 5,38 38,39 42.145,40 46.82,41 29.256,42 28.181,44 4.638}
{0 CHEMBL2152594,1 7.89,2 47.6,3 40.5,4 1.003,5 1.115,6 0.697,7 0.671,8 331.4,9 7.1,10 18,11 42,13 20,14 27,16 44,17 20,20 20,22 2,24 17,25 5,28 3,29 2,32 25,35 4.8,36 0.114,37 5,38 38,39 42.145,40 46.82,41 29.256,42 28.181,44 4.77}
{0 CHEMBL2152595,1 7.695,2 42.9,3 42.9,4 1.007,5 1.126,6 0.671,7 0.647,8 269.33,9 8.6,10 12,11 35,13 14,14 21,16 36,17 15,20 14,21 1,22 2,24 15,25 5,28 3,29 2,32 20,35 5.7,36 0.111,37 4,38 29,39 35.262,40 39.405,41 23.495,42 22.655,44 4.114}
{0 CHEMBL2152596,1 7.253,2 41.5,3 46.3,4 1.001,5 1.128,6 0.659,7 0.627,8 297.39,9 7.3,10 12,11 41,13 14,14 23,16 42,17 17,20 14,21 3,22 2,24 19,25 5,28 3,29 2,32 22,35 4.9,36 0.119,37 5,38 31,39 41.029,40 46.235,41 27.017,42 25.708,44 4}
{0 CHEMBL2152597,1 7.03,2 41.7,3 47.9,4 0.996,5 1.126,6 0.657,7 0.62,8 337.46,9 6.3,10 12,11 48,13 14,14 27,16 50,17 20,20 14,21 6,22 2,24 23,25 5,28 3,29 2,32 25,35 4.2,36 0.1,37 5,38 35,39 47.796,40 54.066,41 31.54,42 29.762,44 4.602}
{0 CHEMBL2152598,1 7.201,2 40.4,3 46.8,4 1,5 1.131,6 0.655,7 0.622,8 338.45,9 8.5,10 12,11 47,13 14,14 27,16 49,17 19,20 14,21 5,22 2,24 22,25 6,28 4,29 2,32 25,35 4.3,36 0.102,37 5,38 35,39 47.014,40 53.149,41 30.784,42 29.256,44 4.276}
{0 CHEMBL2152599,1 8.107,2 46.3,3 39,4 1.009,5 1.12,6 0.695,7 0.675,8 332.39,9 9.8,10 18,11 41,13 20,14 27,16 43,17 19,20 19,22 2,24 16,25 6,28 4,29 2,32 25,35 4.9,36 0.116,37 5,38 38,39 41.363,40 45.903,41 28.5,42 27.676,44 4}
{0 CHEMBL2152600,1 8.107,2 46.3,3 39,4 1.009,5 1.12,6 0.695,7 0.675,8 332.39,9 9.8,10 18,11 41,13 20,14 27,16 43,17 19,20 19,22 2,24 16,25 6,28 4,29 2,32 25,35 4.9,36 0.116,37 5,38 38,39 41.363,40 45.903,41 28.5,42 27.676,44 4.42}
{0 CHEMBL2152601,1 8.107,2 46.3,3 39,4 1.009,5 1.12,6 0.695,7 0.675,8 332.39,9 9.8,10 18,11 41,13 20,14 27,16 43,17 19,20 19,22 2,24 16,25 6,28 4,29 2,32 25,35 4.9,36 0.116,37 5,38 38,39 41.363,40 45.903,41 28.5,42 27.676,44 4}
{0 CHEMBL2152602,1 7.89,2 47.6,3 40.5,4 1.003,5 1.115,6 0.697,7 0.671,8 331.4,9 7.1,10 18,11 42,13 20,14 27,16 44,17 20,20 20,22 2,24 17,25 5,28 3,29 2,32 25,35 4.8,36 0.114,37 5,38 38,39 42.145,40 46.82,41 29.256,42 28.181,44 4.081}
{0 CHEMBL2152603,1 7.676,2 46.7,3 42.2,4 1.001,5 1.116,6 0.689,7 0.66,8 345.43,9 6.7,10 18,11 45,13 20,14 28,16 47,17 21,20 20,21 1,22 2,24 19,25 5,28 3,29 2,32 26,35 4.4,36 0.106,37 5,38 39,39 45.029,40 50.235,41 31.017,42 29.708,44 4}
{0 CHEMBL2152604,1 7.676,2 46.7,3 42.2,4 1.001,5 1.116,6 0.689,7 0.66,8 345.43,9 6.7,10 18,11 45,13 20,14 28,16 47,17 21,20 20,21 1,22 2,24 19,25 5,28 3,29 2,32 26,35 4.4,36 0.128,37 6,38 39,39 45.029,40 50.235,41 31.017,42 29.708,44 4.409}
{0 CHEMBL2152605,1 7.489,2 45.8,3 43.8,4 0.998,5 1.118,6 0.683,7 0.651,8 359.46,9 6.3,10 18,11 48,13 20,14 29,16 50,17 22,20 20,21 2,22 2,24 21,25 5,28 3,29 2,32 27,35 4.2,36 0.12,37 6,38 40,39 47.912,40 53.651,41 32.779,42 31.235,44 4.398}
{0 CHEMBL2152606,1 7.89,2 47.6,3 40.5,4 1.003,5 1.115,6 0.697,7 0.671,8 331.4,9 7.1,10 18,11 42,13 20,14 27,16 44,17 20,20 20,22 2,24 17,25 5,28 3,29 2,32 25,35 4.8,36 0.114,37 5,38 38,39 42.145,40 46.82,41 29.256,42 28.181,44 4.244}
{0 CHEMBL2152607,1 7.676,2 46.7,3 42.2,4 1.001,5 1.116,6 0.689,7 0.66,8 345.43,9 6.7,10 18,11 45,13 20,14 28,16 47,17 21,20 20,21 1,22 2,24 19,25 5,28 3,29 2,32 26,35 4.4,36 0.106,37 5,38 39,39 45.029,40 50.235,41 31.017,42 29.708,44 4}
{0 CHEMBL2152608,1 7.676,2 46.7,3 42.2,4 1.001,5 1.116,6 0.689,7 0.66,8 345.43,9 6.7,10 18,11 45,13 20,14 28,16 47,17 21,20 20,21 1,22 2,24 19,25 5,28 3,29 2,32 26,35 4.4,36 0.128,37 6,38 39,39 45.029,40 50.235,41 31.017,42 29.708,44 4.131}
{0 CHEMBL2152609,1 7.489,2 45.8,3 43.8,4 0.998,5 1.118,6 0.683,7 0.651,8 359.46,9 6.3,10 18,11 48,13 20,14 29,16 50,17 22,20 20,21 2,22 2,24 21,25 5,28 3,29 2,32 27,35 4.2,36 0.12,37 6,38 40,39 47.912,40 53.651,41 32.779,42 31.235,44 4}
{0 CHEMBL2152610,1 6.76,2 41.7,3 50,4 0.991,5 1.125,6 0.652,7 0.61,8 324.46,9 4.2,10 12,11 48,13 13,14 26,16 50,17 20,20 13,21 7,22 1,24 24,25 4,28 2,29 2,32 24,35 4.2,36 0.12,37 6,38 33,39 47.578,40 53.983,41 31.296,42 29.267,44 4.62}
{0 CHEMBL2152611,1 6.936,2 41.5,3 48.8,4 0.995,5 1.126,6 0.653,7 0.615,8 284.39,9 4.9,10 12,11 41,13 13,14 22,16 42,17 17,20 13,21 4,22 1,24 20,25 4,28 2,29 2,32 21,35 4.9,36 0.143,37 6,38 29,39 40.811,40 46.152,41 26.773,42 25.214,44 4.523}
{0 CHEMBL2152612,1 7.581,2 47.6,3 42.9,4 0.998,5 1.113,6 0.691,7 0.659,8 318.4,9 4.8,10 18,11 42,13 19,14 26,16 44,17 20,20 19,21 1,22 1,24 18,25 4,28 2,29 2,32 24,35 4.8,36 0.136,37 6,38 36,39 41.927,40 46.737,41 29.012,42 27.687,44 4.268}
{0 CHEMBL2152613,1 7.387,2 46.7,3 44.4,4 0.996,5 1.114,6 0.684,7 0.649,8 332.43,9 4.4,10 18,11 45,13 19,14 27,16 47,17 21,20 19,21 2,22 1,24 20,25 4,28 2,29 2,32 25,35 4.4,36 0.149,37 7,38 37,39 44.811,40 50.152,41 30.773,42 29.214,44 6}
{0 CHEMBL2152614,1 7.218,2 45.8,3 45.8,4 0.994,5 1.116,6 0.678,7 0.64,8 346.46,9 4.2,10 18,11 48,13 19,14 28,16 50,17 22,20 19,21 3,22 1,24 22,25 4,28 2,29 2,32 26,35 4.2,36 0.16,37 8,38 38,39 47.694,40 53.567,41 32.534,42 30.74,44 5.367}
{0 CHEMBL2152615,1 7.218,2 45.8,3 45.8,4 0.994,5 1.116,6 0.678,7 0.64,8 346.46,9 4.2,10 18,11 48,13 19,14 28,16 50,17 22,20 19,21 3,22 1,24 22,25 4,28 2,29 2,32 26,35 4.2,36 0.14,37 7,38 38,39 47.694,40 53.567,41 32.534,42 30.74,44 5.745}
{0 CHEMBL2152616,1 7.218,2 45.8,3 45.8,4 0.994,5 1.116,6 0.678,7 0.64,8 346.46,9 4.2,10 18,11 48,13 19,14 28,16 50,17 22,20 19,21 3,22 1,24 22,25 4,28 2,29 2,32 26,35 4.2,36 0.14,37 7,38 38,39 47.694,40 53.567,41 32.534,42 30.74,44 5.745}
{0 CHEMBL2152617,1 7.218,2 45.8,3 45.8,4 0.994,5 1.116,6 0.678,7 0.64,8 346.46,9 4.2,10 18,11 48,13 19,14 28,16 50,17 22,20 19,21 3,22 1,24 22,25 4,28 2,29 2,32 26,35 4.2,36 0.14,37 7,38 38,39 47.694,40 53.567,41 32.534,42 30.74,44 5.796}
{0 CHEMBL2152618,1 8.342,2 45.8,3 39.6,4 1.026,5 1.137,6 0.674,7 0.664,8 400.43,9 4.2,10 18,11 48,13 19,14 31,16 50,17 22,20 19,21 3,22 1,23 3,24 19,25 7,28 2,29 2,32 29,34 3,35 4.2,36 0.14,37 7,38 41,39 49.232,40 54.587,41 32.347,42 31.89,43 6.3,44 5.509}
{0 CHEMBL2152619,1 8.342,2 45.8,3 39.6,4 1.026,5 1.137,6 0.674,7 0.664,8 400.43,9 4.2,10 18,11 48,13 19,14 31,16 50,17 22,20 19,21 3,22 1,23 3,24 19,25 7,28 2,29 2,32 29,34 3,35 4.2,36 0.14,37 7,38 41,39 49.232,40 54.587,41 32.347,42 31.89,43 6.3,44 5.678}
{0 CHEMBL2152620,1 8.342,2 45.8,3 39.6,4 1.026,5 1.137,6 0.674,7 0.664,8 400.43,9 4.2,10 18,11 48,13 19,14 31,16 50,17 22,20 19,21 3,22 1,23 3,24 19,25 7,28 2,29 2,32 29,34 3,35 4.2,36 0.14,37 7,38 41,39 49.232,40 54.587,41 32.347,42 31.89,43 6.3,44 5.854}
{0 CHEMBL2152621,1 7.787,2 46.7,3 42.2,4 1.007,5 1.122,6 0.682,7 0.658,8 350.42,9 4.4,10 18,11 45,13 19,14 28,16 47,17 21,20 19,21 2,22 1,23 1,24 19,25 5,28 2,29 2,32 26,34 1,35 4.4,36 0.149,37 7,38 38,39 45.323,40 50.492,41 30.711,42 29.597,43 2.2,44 6.244}
{0 CHEMBL2152622,1 7.787,2 46.7,3 42.2,4 1.007,5 1.122,6 0.682,7 0.658,8 350.42,9 4.4,10 18,11 45,13 19,14 28,16 47,17 21,20 19,21 2,22 1,23 1,24 19,25 5,28 2,29 2,32 26,34 1,35 4.4,36 0.149,37 7,38 38,39 45.323,40 50.492,41 30.711,42 29.597,43 2.2,44 5.569}
{0 CHEMBL2152623,1 8.153,2 46.7,3 42.2,4 1.003,5 1.113,6 0.703,7 0.668,8 366.87,9 4.4,10 18,11 45,13 19,14 28,16 47,17 21,18 1,20 19,21 2,22 1,24 19,25 5,26 1,28 2,29 2,32 26,34 1,35 4.4,36 0.149,37 7,38 38,39 45.134,40 50.096,41 31.631,42 30.041,43 2.2,44 5.824}
{0 CHEMBL2152624,1 8.153,2 46.7,3 42.2,4 1.003,5 1.113,6 0.703,7 0.668,8 366.87,9 4.4,10 18,11 45,13 19,14 28,16 47,17 21,18 1,20 19,21 2,22 1,24 19,25 5,26 1,28 2,29 2,32 26,34 1,35 4.4,36 0.149,37 7,38 38,39 45.134,40 50.096,41 31.631,42 30.041,43 2.2,44 5.699}
{0 CHEMBL2152625,1 8.153,2 46.7,3 42.2,4 1.003,5 1.113,6 0.703,7 0.668,8 366.87,9 4.4,10 18,11 45,13 19,14 28,16 47,17 21,18 1,20 19,21 2,22 1,24 19,25 5,26 1,28 2,29 2,32 26,34 1,35 4.4,36 0.149,37 7,38 38,39 45.134,40 50.096,41 31.631,42 30.041,43 2.2,44 6.081}
{0 CHEMBL2152626,1 9.14,2 46.7,3 42.2,4 1.001,5 1.111,6 0.714,7 0.672,8 411.32,9 4.4,10 18,11 45,13 19,14 28,15 1,16 47,17 21,20 19,21 2,22 1,24 19,25 5,26 1,28 2,29 2,32 26,34 1,35 4.4,36 0.149,37 7,38 38,39 45.04,40 49.994,41 32.125,42 30.239,43 2.2,44 5.959}
{0 CHEMBL2152627,1 9.14,2 46.7,3 42.2,4 1.001,5 1.111,6 0.714,7 0.672,8 411.32,9 4.4,10 18,11 45,13 19,14 28,15 1,16 47,17 21,20 19,21 2,22 1,24 19,25 5,26 1,28 2,29 2,32 26,34 1,35 4.4,36 0.149,37 7,38 38,39 45.04,40 49.994,41 32.125,42 30.239,43 2.2,44 5.469}
{0 CHEMBL2152628,1 9.14,2 46.7,3 42.2,4 1.001,5 1.111,6 0.714,7 0.672,8 411.32,9 4.4,10 18,11 45,13 19,14 28,15 1,16 47,17 21,20 19,21 2,22 1,24 19,25 5,26 1,28 2,29 2,32 26,34 1,35 4.4,36 0.149,37 7,38 38,39 45.04,40 49.994,41 32.125,42 30.239,43 2.2,44 5.921}
{0 CHEMBL215918,1 7.653,2 43.8,3 43.8,4 1.009,5 1.131,6 0.667,7 0.642,8 558.68,9 5.5,10 22,11 73,13 25,14 45,16 77,17 32,20 24,21 8,22 3,23 2,24 32,25 9,28 4,29 3,32 41,34 2,35 4.1,36 0.13,37 10,38 59,39 73.669,40 82.529,41 48.682,42 46.899,43 2.7,44 4.292}
{0 CHEMBL2164003,1 10.843,2 42.9,3 42.9,4 1.014,5 1.111,6 0.73,7 0.677,8 303.59,10 6,11 28,13 7,14 17,15 1,16 29,17 12,18 1,20 7,21 5,22 1,24 12,25 4,26 2,29 2,32 16,34 2,35 7.1,36 0.069,37 2,38 21,39 28.393,40 31.111,41 20.449,42 18.97,43 7.1,44 4.975}
{0 CHEMBL2164005,1 10.447,2 48.6,3 40,4 1.008,5 1.101,6 0.749,7 0.7,8 365.66,10 12,11 35,13 13,14 23,15 1,16 37,17 17,18 1,20 13,21 4,22 1,24 14,25 4,26 2,29 2,32 21,34 2,35 5.7,36 0.081,37 3,38 30,39 35.276,40 38.526,41 26.21,42 24.497,43 5.7,44 5.167}
{0 CHEMBL2164009,1 10.301,2 43.8,3 43.8,4 1.009,5 1.11,6 0.725,7 0.672,8 329.63,10 6,11 32,13 8,14 19,15 1,16 33,17 14,18 1,20 9,21 5,22 2,24 14,25 4,26 2,29 2,32 18,34 2,35 6.3,36 0.121,37 4,38 24,39 32.276,40 35.526,41 23.21,42 21.497,43 6.3,44 5.26}
{0 CHEMBL2164014,1 9.754,2 41.2,3 47.1,4 1.005,5 1.116,6 0.705,7 0.648,8 331.65,10 6,11 34,13 7,14 19,15 1,16 35,17 14,18 1,20 7,21 7,22 1,24 16,25 4,26 2,29 2,32 18,34 2,35 5.9,36 0.114,37 4,38 23,39 34.16,40 37.941,41 23.972,42 22.024,43 5.9,44 5.367}
{0 CHEMBL2164015,1 9.754,2 41.2,3 47.1,4 1.005,5 1.116,6 0.705,7 0.648,8 331.65,10 6,11 34,13 7,14 19,15 1,16 35,17 14,18 1,20 7,21 7,22 1,24 16,25 4,26 2,29 2,32 18,34 2,35 5.9,36 0.114,37 4,38 23,39 34.16,40 37.941,41 23.972,42 22.024,43 5.9,44 5.347}
{0 CHEMBL2164016,1 9.754,2 41.2,3 47.1,4 1.005,5 1.116,6 0.705,7 0.648,8 331.65,10 6,11 34,13 7,14 19,15 1,16 35,17 14,18 1,20 7,21 7,22 1,24 16,25 4,26 2,29 2,32 18,34 2,35 5.9,36 0.114,37 4,38 23,39 34.16,40 37.941,41 23.972,42 22.024,43 5.9,44 5.824}
{0 CHEMBL2164018,1 11.062,2 41.2,3 47.1,4 1.002,5 1.113,6 0.72,7 0.654,8 376.1,10 6,11 34,13 7,14 19,15 2,16 35,17 14,20 7,21 7,22 1,24 16,25 4,26 2,29 2,32 18,34 2,35 5.9,36 0.114,37 4,38 23,39 34.065,40 37.839,41 24.466,42 22.221,43 5.9,44 5.824}
{0 CHEMBL2164019,1 6.159,2 40,3 55,4 0.984,5 1.125,6 0.632,7 0.581,8 246.38,10 6,11 40,13 7,14 19,16 41,17 16,20 7,21 9,22 1,24 22,25 2,29 2,32 18,35 5,36 0.098,37 4,38 23,39 39.374,40 44.986,41 25.284,42 23.224,44 5.208}
{0 CHEMBL2170193,1 7.224,2 38.5,3 47.7,4 1.01,5 1.132,6 0.637,7 0.611,8 469.59,9 4.6,10 12,11 65,13 16,14 35,16 66,17 25,20 16,21 9,22 4,24 31,25 9,28 3,29 6,32 34,35 9.2,36 0.227,37 15,38 45,39 65.64,40 73.564,41 41.404,42 39.728,44 4.187}
{0 CHEMBL2170194,1 9.411,2 50,3 33.3,4 1.016,5 1.1,6 0.754,7 0.726,8 282.34,9 6.7,10 11,11 30,13 15,14 22,16 32,17 15,20 15,22 4,24 10,25 5,26 1,28 2,29 2,31 1,32 20,35 6.7,36 0.031,37 1,38 31.5,39 30.469,40 32.996,41 22.614,42 21.767,44 5.023}
{0 CHEMBL2171191,1 8.977,2 51.6,3 32.3,4 1.023,5 1.106,6 0.723,7 0.719,8 278.28,9 6.5,10 11,11 31,13 15,14 24,16 34,17 16,20 15,21 1,22 4,24 10,25 5,28 2,29 3,32 21,35 9.7,38 33.5,39 31.72,40 34.286,41 22.421,42 22.294,44 4.951}
{0 CHEMBL2171192,1 8.597,2 50,3 35.3,4 1.018,5 1.109,6 0.711,7 0.701,8 292.31,9 5.9,10 11,11 34,13 15,14 25,16 37,17 17,20 15,21 2,22 4,24 12,25 5,28 2,29 3,32 22,35 8.8,36 0.027,37 1,38 34.5,39 34.604,40 37.701,41 24.182,42 23.821,44 4.523}
{0 CHEMBL2171193,1 8.279,2 48.6,3 37.8,4 1.013,5 1.111,6 0.701,7 0.685,8 306.34,9 5.4,10 11,11 37,13 15,14 26,16 40,17 18,20 15,21 3,22 4,24 14,25 5,28 2,29 3,32 23,35 8.1,36 0.05,37 2,38 35.5,39 37.487,40 41.116,41 25.943,42 25.348,44 4.903}
{0 CHEMBL2171194,1 8.695,2 51.4,3 34.3,4 1.017,5 1.106,6 0.719,7 0.709,8 304.32,9 5.7,10 11,11 35,13 16,14 26,16 38,17 18,20 17,21 1,22 5,24 12,25 5,28 2,29 3,32 23,35 8.6,36 0.053,37 2,38 36.5,39 35.604,40 38.701,41 25.182,42 24.821,44 4.967}
{0 CHEMBL2171195,1 8.009,2 47.5,3 40,4 1.009,5 1.113,6 0.693,7 0.672,8 320.37,9 5,10 11,11 40,13 15,14 27,16 43,17 19,20 15,21 4,22 4,24 16,25 5,28 2,29 3,32 24,35 7.5,36 0.07,37 3,38 36.5,39 40.371,40 44.531,41 27.705,42 26.875,44 4.772}
{0 CHEMBL2171196,1 7.873,2 47.7,3 40.9,4 1.006,5 1.112,6 0.692,7 0.668,8 346.41,9 4.5,10 11,11 44,13 15,14 30,16 48,17 21,20 15,21 6,22 4,24 18,25 5,28 2,29 3,32 26,35 6.8,36 0.021,37 1,38 39.5,39 44.254,40 48.946,41 30.466,42 29.402,44 4.233}
{0 CHEMBL2171197,1 8.643,2 53.7,3 34.1,4 1.012,5 1.1,6 0.73,7 0.716,8 354.38,9 4.9,10 17,11 41,13 21,14 31,16 45,17 22,20 21,21 1,22 4,24 14,25 5,28 2,29 3,32 27,35 7.3,36 0.044,37 2,38 43.5,39 41.487,40 45.116,41 29.943,42 29.348,44 4.799}
{0 CHEMBL2171198,1 9.129,2 48,3 32,4 1.033,5 1.115,6 0.706,7 0.711,8 228.22,9 8,10 6,11 25,13 10,14 19,16 27,17 12,20 11,21 1,22 4,24 8,25 5,28 2,29 3,32 17,35 12,38 26,39 25.836,40 27.87,41 17.659,42 17.768,44 4.609}
{0 CHEMBL2171199,1 8.652,2 46.4,3 35.7,4 1.026,5 1.117,6 0.694,7 0.689,8 242.25,9 7.1,10 6,11 28,13 10,14 20,16 30,17 13,20 11,21 2,22 4,24 10,25 5,28 2,29 3,32 18,35 10.7,36 0.033,37 1,38 27,39 28.72,40 31.286,41 19.421,42 19.294,44 4.648}
{0 CHEMBL2171200,1 8.267,2 45.2,3 38.7,4 1.019,5 1.119,6 0.683,7 0.672,8 256.28,9 6.5,10 6,11 31,13 10,14 21,16 33,17 14,20 11,21 3,22 4,24 12,25 5,28 2,29 3,32 19,35 9.7,36 0.061,37 2,38 28,39 31.604,40 34.701,41 21.182,42 20.821,44 4.524}
{0 CHEMBL2171201,1 7.95,2 44.1,3 41.2,4 1.014,5 1.121,6 0.675,7 0.657,8 270.31,9 5.9,10 6,11 34,13 10,14 22,16 36,17 15,20 11,21 4,22 4,24 14,25 5,28 2,29 3,32 20,35 8.8,36 0.083,37 3,38 29,39 34.487,40 38.116,41 22.943,42 22.348,44 4.511}
{0 CHEMBL2181509,1 7.955,2 48.1,3 42.6,4 0.998,5 1.104,6 0.711,7 0.669,8 429.57,9 1.9,10 23,11 54,13 26,14 34,16 57,17 26,20 23,21 3,22 3,24 23,25 5,26 1,28 1,29 3,31 1,32 31,35 5.6,36 0.105,37 6,38 48.5,39 53.88,40 59.614,41 38.392,42 36.148,44 4.616}
{0 CHEMBL218328,1 7.433,2 45.8,3 44.1,4 0.996,5 1.118,6 0.683,7 0.649,8 438.57,9 6.8,10 20,11 59,13 23,14 38,16 64,17 27,20 20,21 7,22 3,24 26,25 6,28 4,29 2,32 33,35 3.4,36 0.078,37 5,38 51,39 58.781,40 65.979,41 40.307,42 38.31,44 5.081}
{0 CHEMBL218377,1 8.009,2 44.4,3 41.3,4 1.016,5 1.131,6 0.673,7 0.656,8 504.58,9 6.3,10 20,11 63,13 23,14 42,16 68,17 28,20 20,21 8,22 3,23 2,24 26,25 9,28 4,29 3,32 37,34 2,35 4.8,36 0.029,37 2,38 55,39 64.018,40 71.283,41 42.398,42 41.318,43 3.2,44 4.301}
{0 CHEMBL218785,1 6.48,2 42.2,3 51.8,4 0.984,5 1.123,6 0.652,7 0.603,8 537.81,9 3.6,10 20,11 83,13 23,14 44,16 87,17 35,20 20,21 15,22 3,24 43,25 5,28 3,29 2,32 40,35 2.4,36 0.161,37 14,38 57,39 81.632,40 93.218,41 54.154,42 50.03,44 4}
{0 CHEMBL218910,1 8.057,2 42.9,3 41.3,4 1.022,5 1.128,6 0.664,7 0.652,8 507.56,9 4.8,10 20,11 63,13 23,14 41,16 67,17 27,20 20,21 7,22 3,23 1,24 26,25 10,28 3,29 6,32 37,34 1,35 9.5,36 0.149,37 10,38 54,39 64.385,40 71.073,41 41.818,42 41.058,43 1.6,44 5.022}
{0 CHEMBL2203540,1 8.596,2 46.3,3 39,4 1.011,5 1.109,6 0.716,7 0.684,8 352.44,9 4.9,10 12,11 41,13 16,14 27,16 43,17 19,20 17,21 2,22 4,24 16,25 6,26 1,28 2,29 3,31 1,32 25,35 7.3,36 0.093,37 4,38 37,39 41.447,40 45.451,41 29.352,42 28.062,44 5}
{0 CHEMBL2203541,1 8.329,2 45.5,3 40.9,4 1.008,5 1.111,6 0.707,7 0.672,8 366.47,9 4.5,10 12,11 44,13 16,14 28,16 46,17 20,20 17,21 3,22 4,24 18,25 6,26 1,28 2,29 3,31 1,32 26,35 6.8,36 0.109,37 5,38 38,39 44.331,40 48.866,41 31.114,42 29.589,44 4.842}
{0 CHEMBL2203543,1 10.982,2 47.4,3 34.2,4 1.021,5 1.102,6 0.762,7 0.725,8 417.3,9 5.3,10 12,11 38,13 16,14 27,15 1,16 40,17 18,20 17,21 1,22 4,24 13,25 7,26 2,28 2,29 3,31 1,32 25,34 1,35 7.9,36 0.1,37 4,38 37,39 38.793,40 41.878,41 28.943,42 27.56,43 2.6,44 5.469}
{0 CHEMBL2203544,1 9.592,2 45.2,3 35.7,4 1.026,5 1.11,6 0.73,7 0.705,8 402.88,9 4.8,10 12,11 42,13 16,14 29,16 44,17 19,18 1,20 17,21 2,22 4,24 15,25 8,26 2,28 2,29 4,31 1,32 27,34 1,35 9.5,36 0.114,37 5,38 39,39 43.098,40 46.605,41 30.665,42 29.604,43 2.4,44 5.125}
{0 CHEMBL2203545,1 8.314,2 42.4,3 42.4,4 1.007,5 1.116,6 0.701,7 0.661,8 274.37,9 6.1,10 6,11 33,13 10,14 20,16 34,17 14,20 11,21 3,22 4,24 14,25 5,26 1,28 2,29 2,31 1,32 19,35 6.1,36 0.059,37 2,38 27,39 33.236,40 36.827,41 23.137,42 21.82,44 4.833}
{0 CHEMBL2203546,1 9.187,2 47.1,3 35.3,4 1.02,5 1.106,6 0.73,7 0.706,8 312.37,9 5.9,10 11,11 34,13 15,14 24,16 36,17 16,20 15,21 1,22 4,24 12,25 6,26 1,28 2,29 3,31 1,32 22,35 8.8,36 0.056,37 2,38 33.5,39 34.68,40 37.621,41 24.83,42 24.008,44 4.932}
{0 CHEMBL2203547,1 11.846,2 48.4,3 25.8,4 1.047,5 1.1,6 0.799,7 0.779,8 367.22,9 6.5,10 11,11 31,13 15,14 25,16 33,17 15,18 2,20 15,22 4,24 8,25 8,26 3,28 2,29 3,31 1,32 23,34 2,35 9.7,36 0.061,37 2,38 34.5,39 32.444,40 34.094,41 24.784,42 24.137,43 6.5,44 4.983}
{0 CHEMBL2203548,1 10.718,2 47.4,3 31.6,4 1.032,5 1.103,6 0.771,7 0.742,8 407.29,9 5.3,10 11,11 38,13 16,14 28,16 40,17 18,18 2,20 17,21 1,22 5,24 12,25 8,26 3,28 2,29 3,31 1,32 26,34 2,35 7.9,36 0.1,37 4,38 38.5,39 39.211,40 41.924,41 29.307,42 28.19,43 5.3,44 5.013}
{0 CHEMBL220456,1 7.632,2 42.9,3 44.2,4 1.012,5 1.126,6 0.661,7 0.639,8 587.7,9 3.9,10 20,11 77,13 23,14 49,16 83,17 33,20 20,21 13,22 3,23 1,24 34,25 10,28 3,29 6,32 43,34 1,35 7.8,36 0.108,37 9,38 62,39 77.92,40 86.734,41 50.864,42 49.165,43 1.3,44 5.602}
{0 CHEMBL220458,1 9.561,2 44.7,3 38.3,4 1.018,5 1.11,6 0.736,7 0.697,8 449.38,9 4.3,10 18,11 47,13 19,14 31,16 49,17 21,18 2,20 18,21 3,22 1,24 18,25 8,26 3,28 2,29 3,31 1,32 29,34 2,35 6.4,36 0.122,37 6,38 41,39 47.862,40 52.17,41 34.591,42 32.771,43 4.3,44 4.13}
{0 CHEMBL224864,1 10.1,2 53.5,3 30.2,4 1.021,5 1.1,6 0.772,7 0.751,8 434.29,9 7,10 22,11 43,13 25,14 33,16 46,17 23,18 2,19 1,20 22,22 2,24 13,25 7,26 2,28 3,29 2,32 30,33 1,34 2,35 4.7,36 0.087,37 4,38 48,39 43.909,40 47.293,41 33.21,42 32.31,43 4.7,44 5.451}
{0 CHEMBL225797,1 9.422,2 52.2,3 30.4,4 1.037,5 1.127,6 0.719,7 0.725,8 433.41,9 6.5,10 22,11 46,13 25,14 35,16 49,17 24,19 1,20 22,21 1,22 2,23 3,24 14,25 8,28 3,29 2,32 32,33 1,34 3,35 4.3,36 0.082,37 4,38 50,39 47.683,40 51.839,41 33.068,42 33.331,43 6.5,44 5.222}
{0 CHEMBL225914,1 9.422,2 52.2,3 30.4,4 1.037,5 1.127,6 0.719,7 0.725,8 433.41,9 6.5,10 22,11 46,13 25,14 35,16 49,17 24,19 1,20 22,21 1,22 2,23 3,24 14,25 8,28 3,29 2,32 32,33 1,34 3,35 4.3,36 0.082,37 4,38 50,39 47.683,40 51.839,41 33.068,42 33.331,43 6.5,44 4.301}
{0 CHEMBL225971,1 9.299,2 53.5,3 32.6,4 1.014,5 1.101,6 0.752,7 0.732,8 399.85,9 7,10 22,11 43,13 25,14 32,16 46,17 23,18 1,19 1,20 22,22 2,24 14,25 6,26 1,28 3,29 2,32 29,33 1,34 1,35 4.7,36 0.087,37 4,38 47,39 43.585,40 47.349,41 32.352,42 31.482,43 2.3,44 4.301}
{0 CHEMBL226026,1 10.1,2 53.5,3 30.2,4 1.021,5 1.1,6 0.772,7 0.751,8 434.29,9 7,10 22,11 43,13 25,14 33,16 46,17 23,18 2,19 1,20 22,22 2,24 13,25 7,26 2,28 3,29 2,32 30,33 1,34 2,35 4.7,36 0.087,37 4,38 48,39 43.909,40 47.293,41 33.21,42 32.31,43 4.7,44 4.301}
{0 CHEMBL226027,1 10.1,2 53.5,3 30.2,4 1.021,5 1.1,6 0.772,7 0.751,8 434.29,9 7,10 22,11 43,13 25,14 33,16 46,17 23,18 2,19 1,20 22,22 2,24 13,25 7,26 2,28 3,29 2,32 30,33 1,34 2,35 4.7,36 0.087,37 4,38 48,39 43.909,40 47.293,41 33.21,42 32.31,43 4.7,44 4.301}
{0 CHEMBL226115,1 8.819,2 44.4,3 37.8,4 1.02,5 1.122,6 0.702,7 0.683,8 396.86,9 8.9,10 17,11 45,13 20,14 31,16 48,17 20,18 1,20 16,21 4,22 3,24 17,25 8,26 1,28 4,29 3,32 28,34 1,35 6.7,36 0.063,37 3,38 42.5,39 45.898,40 50.472,41 31.574,42 30.745,43 2.2,44 4.456}
{0 CHEMBL228175,1 9.299,2 53.5,3 32.6,4 1.014,5 1.101,6 0.752,7 0.732,8 399.85,9 7,10 22,11 43,13 25,14 32,16 46,17 23,18 1,19 1,20 22,22 2,24 14,25 6,26 1,28 3,29 2,32 29,33 1,34 1,35 4.7,36 0.087,37 4,38 47,39 43.585,40 47.349,41 32.352,42 31.482,43 2.3,44 5.26}
{0 CHEMBL2332037,1 7.752,2 38.7,3 45.2,4 1.006,5 1.131,6 0.668,7 0.633,8 480.65,9 9.7,10 16,11 62,13 19,14 37,16 65,17 24,20 15,21 9,22 3,24 28,25 10,26 1,28 6,29 3,31 1,32 34,35 4.8,36 0.123,37 8,38 48,39 62.389,40 70.105,41 41.421,42 39.255,44 8.886}
{0 CHEMBL2332038,1 7.896,2 37.7,3 44.3,4 1.01,5 1.134,6 0.667,7 0.635,8 481.64,9 11.5,10 16,11 61,13 19,14 37,16 64,17 23,20 15,21 8,22 3,24 27,25 11,26 1,28 7,29 3,31 1,32 34,35 4.9,36 0.125,37 8,38 48,39 61.607,40 69.188,41 40.665,42 38.749,44 8}
{0 CHEMBL2332039,1 8.249,2 37.3,3 44.1,4 1.01,5 1.129,6 0.683,7 0.643,8 486.68,9 10.2,10 15,11 59,13 18,14 36,16 62,17 22,20 13,21 9,22 3,24 26,25 11,26 2,28 6,29 3,31 2,32 33,35 5.1,36 0.129,37 8,38 46.5,39 59.582,40 66.61,41 40.307,42 37.915,44 8.569}
{0 CHEMBL2332040,1 8.408,2 36.2,3 43.1,4 1.014,5 1.133,6 0.682,7 0.645,8 487.67,9 12.1,10 15,11 58,13 18,14 36,16 61,17 21,20 13,21 8,22 3,24 25,25 12,26 2,28 7,29 3,31 2,32 33,35 5.2,36 0.131,37 8,38 46.5,39 58.8,40 65.693,41 39.551,42 37.41,44 8.319}
{0 CHEMBL2332041,1 8.058,2 37.5,3 45.3,4 1.009,5 1.127,6 0.676,7 0.635,8 515.72,9 7.8,10 15,11 64,13 18,14 38,16 67,17 24,20 13,21 11,22 3,24 29,25 11,26 2,28 5,29 4,31 2,32 35,35 6.3,36 0.134,37 9,38 48.5,39 64.574,40 72.152,41 43.279,42 40.662,44 8.745}
{0 CHEMBL2332042,1 8.838,2 38.5,3 40.4,4 1.02,5 1.125,6 0.697,7 0.665,8 459.6,9 9.6,10 15,11 52,13 18,14 34,16 55,17 20,20 13,21 7,22 3,24 21,25 11,26 2,28 5,29 4,31 2,32 31,35 7.7,36 0.127,37 7,38 44.5,39 53.04,40 58.491,41 36.233,42 34.555,44 8.357}
{0 CHEMBL2332043,1 8.481,2 38.8,3 42.9,4 1.008,5 1.124,6 0.7,7 0.656,8 415.59,9 10.2,10 15,11 49,13 17,14 31,16 52,17 19,20 12,21 7,22 2,24 21,25 9,26 2,28 5,29 2,31 2,32 28,35 4.1,36 0.115,37 6,38 40.5,39 49.385,40 55.072,41 34.324,42 32.125,44 8.187}
{0 CHEMBL2332044,1 7.374,2 34.5,3 49.1,4 1.005,5 1.138,6 0.644,7 0.604,8 405.58,9 9.1,10 10,11 55,13 12,14 30,16 57,17 19,20 8,21 11,22 2,24 27,25 9,26 1,28 5,29 3,31 1,32 28,35 5.5,36 0.123,37 7,38 37,39 55.287,40 62.607,41 35.415,42 33.233,44 8.268}
{0 CHEMBL2332045,1 7.722,2 35.6,3 46.7,4 1.007,5 1.137,6 0.659,7 0.621,8 347.49,9 11.1,10 10,11 45,13 12,14 26,16 47,17 16,20 8,21 8,22 2,24 21,25 8,26 1,28 5,29 2,31 1,32 24,35 4.4,36 0.106,37 5,38 33,39 45.309,40 51.152,41 29.676,42 27.938,44 7.638}
{0 CHEMBL2332046,1 7.636,2 35,3 47.5,4 1.002,5 1.138,6 0.662,7 0.617,8 305.45,9 12.5,10 10,11 40,13 11,14 23,16 42,17 14,20 7,21 7,22 1,24 19,25 7,26 1,28 5,29 1,31 1,32 21,35 2.5,36 0.095,37 4,38 29,39 40.098,40 45.527,41 26.461,42 24.697,44 6.959}
{0 CHEMBL2332047,1 8.199,2 37.5,3 43.8,4 1.007,5 1.131,6 0.685,7 0.644,8 262.37,9 12.5,10 10,11 32,13 11,14 20,16 34,17 12,20 7,21 5,22 1,24 14,25 6,26 1,28 4,29 1,31 1,32 18,35 3.1,36 0.059,37 2,38 26,39 32.229,40 36.199,41 21.932,42 20.622,44 5.854}
{0 CHEMBL2332048,1 8.892,2 36,3 40,4 1.018,5 1.135,6 0.696,7 0.663,8 222.3,9 16,10 10,11 25,13 11,14 16,16 26,17 9,20 7,21 2,22 1,24 10,25 6,26 1,28 4,29 1,31 1,32 15,35 4,36 0.115,37 3,38 22,39 25.462,40 28.368,41 17.409,42 16.568,44 4.31}
{0 CHEMBL2332049,1 12.568,2 41.2,3 23.5,4 1.054,5 1.117,6 0.808,7 0.784,8 213.66,9 17.6,10 10,11 17,13 11,14 14,16 18,17 7,18 1,20 7,22 1,24 4,25 6,26 2,28 3,29 1,31 1,32 13,34 1,35 5.9,36 0.056,37 1,38 20,39 17.916,40 18.984,41 13.739,42 13.32,43 5.9,44 4.301}
{0 CHEMBL2332050,1 7.94,2 35.7,3 45.2,4 1.01,5 1.137,6 0.665,7 0.629,8 333.46,9 11.9,10 10,11 42,13 12,14 25,16 44,17 15,20 8,21 7,22 2,24 19,25 8,26 1,28 5,29 2,31 1,32 23,35 4.8,36 0.091,37 4,38 32,39 42.425,40 47.737,41 27.915,42 26.411,44 5.553}
{0 CHEMBL2332051,1 7.92,2 34.1,3 45.5,4 1.012,5 1.142,6 0.657,7 0.623,8 348.48,9 13.6,10 10,11 44,13 12,14 26,16 46,17 15,20 8,21 7,22 2,24 20,25 9,26 1,28 6,29 2,31 1,32 24,35 4.5,36 0.109,37 5,38 33,39 44.527,40 50.235,41 28.921,42 27.433,44 6.77}
{0 CHEMBL2332052,1 8.079,2 35.6,3 46.7,4 1.001,5 1.13,6 0.686,7 0.631,8 363.56,9 11.1,10 10,11 45,13 12,14 26,16 47,17 16,20 8,21 8,22 2,24 21,25 8,26 2,28 5,29 1,31 2,32 24,35 2.2,36 0.106,37 5,38 33,39 45.058,40 50.863,41 30.87,42 28.41,44 7.523}
{0 CHEMBL2332053,1 8.285,2 34.1,3 45.5,4 1.006,5 1.135,6 0.684,7 0.634,8 364.55,9 13.6,10 10,11 44,13 12,14 26,16 46,17 15,20 8,21 7,22 2,24 20,25 9,26 2,28 6,29 1,31 2,32 24,35 2.3,36 0.109,37 5,38 33,39 44.276,40 49.946,41 30.114,42 27.905,44 6.886}
{0 CHEMBL2332054,1 7.364,2 35.3,3 49,4 1.001,5 1.137,6 0.651,7 0.608,8 375.55,9 9.8,10 10,11 51,13 12,14 28,16 53,17 18,20 8,21 10,22 2,24 25,25 8,26 1,28 5,29 2,31 1,32 26,35 3.9,36 0.094,37 5,38 35,39 51.076,40 57.982,41 33.199,42 30.992,44 6.131}
{0 CHEMBL2332055,1 7.214,2 35.2,3 50,4 0.999,5 1.137,6 0.647,7 0.602,8 389.58,9 9.3,10 10,11 54,13 12,14 29,16 56,17 19,20 8,21 11,22 2,24 27,25 8,26 1,28 5,29 2,31 1,32 27,35 3.7,36 0.107,37 6,38 36,39 53.96,40 61.398,41 34.961,42 32.519,44 8}
{0 CHEMBL2333666,1 11.494,2 51.1,3 34,4 1.015,5 1.099,6 0.77,7 0.733,8 540.22,9 4.3,10 23,11 47,13 25,14 34,15 2,16 50,17 24,20 24,22 2,24 16,25 7,26 2,28 2,29 3,32 31,34 2,35 6.4,36 0.08,37 4,38 47.5,39 47.713,40 51.63,41 36.171,42 34.452,43 4.3,44 4.936}
{0 CHEMBL2338808,1 7.081,2 35.1,3 50.9,4 0.997,5 1.137,6 0.644,7 0.597,8 403.61,9 8.8,10 10,11 57,13 12,14 30,16 59,17 20,20 8,21 12,22 2,24 29,25 8,26 1,28 5,29 2,31 1,32 28,35 3.5,36 0.119,37 7,38 37,39 56.843,40 64.813,41 36.722,42 34.045,44 7.796}
{0 CHEMBL2338809,1 7.369,2 34,3 49.1,4 1.003,5 1.141,6 0.645,7 0.604,8 390.57,9 11.3,10 10,11 53,13 12,14 29,16 55,17 18,20 8,21 10,22 2,24 26,25 9,26 1,28 6,29 2,31 1,32 27,35 3.8,36 0.109,37 6,38 36,39 53.178,40 60.481,41 34.205,42 32.013,44 7.77}
{0 CHEMBL2338810,1 8.338,2 32.6,3 45.7,4 1.015,5 1.137,6 0.669,7 0.627,8 383.55,9 10.9,10 10,11 46,13 13,14 27,16 48,17 15,20 7,21 8,22 3,24 21,25 10,26 2,28 5,29 3,31 2,32 25,35 6.5,36 0.125,37 6,38 35,39 46.713,40 52.281,41 30.779,42 28.84,44 8.959}
{0 CHEMBL2338811,1 8.545,2 31.1,3 44.4,4 1.021,5 1.141,6 0.667,7 0.63,8 384.54,9 13.3,10 10,11 45,13 13,14 27,16 47,17 14,20 7,21 7,22 3,24 20,25 11,26 2,28 6,29 3,31 2,32 25,35 6.7,36 0.128,37 6,38 35,39 45.931,40 51.364,41 30.023,42 28.335,44 7.276}
{0 CHEMBL2338812,1 7.351,2 36.2,3 48.9,4 0.997,5 1.135,6 0.659,7 0.612,8 345.52,9 10.6,10 10,11 47,13 11,14 27,16 50,17 17,20 7,21 10,22 1,24 23,25 7,26 1,28 5,29 1,31 1,32 24,35 2.1,36 0.08,37 4,38 33,39 46.865,40 53.358,41 30.983,42 28.75,44 6.658}
{0 CHEMBL2338813,1 7.191,2 36,3 50,4 0.995,5 1.135,6 0.655,7 0.606,8 359.55,9 10,10 10,11 50,13 11,14 28,16 53,17 18,20 7,21 11,22 1,24 25,25 7,26 1,28 5,29 1,31 1,32 25,35 2,36 0.094,37 5,38 34,39 49.749,40 56.773,41 32.745,42 30.277,44 7.174}
{0 CHEMBL2338814,1 7.358,2 34.7,3 49,4 0.999,5 1.14,6 0.653,7 0.608,8 360.54,9 12.2,10 10,11 49,13 11,14 28,16 52,17 17,20 7,21 10,22 1,24 24,25 8,26 1,28 6,29 1,31 1,32 25,35 2,36 0.096,37 5,38 34,39 48.967,40 55.856,41 31.989,42 29.772,44 7.538}
{0 CHEMBL2338815,1 6.917,2 35.2,3 50,4 1.004,5 1.142,6 0.625,7 0.593,8 373.51,9 9.3,10 10,11 54,13 12,14 29,16 56,17 19,20 8,21 11,22 2,24 27,25 8,28 5,29 3,32 27,35 5.6,36 0.107,37 6,38 36,39 54.211,40 61.687,41 33.767,42 32.046,44 6.824}
{0 CHEMBL2338816,1 7.065,2 36.4,3 50.9,4 0.995,5 1.133,6 0.649,7 0.6,8 388.59,9 7.3,10 10,11 55,13 12,14 29,16 57,17 20,20 9,21 11,22 2,24 28,25 7,26 1,28 4,29 2,31 1,32 27,35 3.6,36 0.105,37 6,38 36,39 54.741,40 62.314,41 35.716,42 33.024,44 7.553}
{0 CHEMBL2338817,1 7.065,2 36.4,3 50.9,4 0.995,5 1.133,6 0.649,7 0.6,8 388.59,9 7.3,10 10,11 55,13 12,14 29,16 57,17 20,20 9,21 11,22 2,24 28,25 7,26 1,28 4,29 2,31 1,32 27,35 3.6,36 0.105,37 6,38 36,39 54.741,40 62.314,41 35.716,42 33.024,44 6.523}
{0 CHEMBL2338818,1 7.081,2 35.1,3 50.9,4 0.997,5 1.137,6 0.644,7 0.597,8 403.61,9 8.8,10 10,11 57,13 12,14 30,16 59,17 20,20 8,21 12,22 2,24 29,25 8,26 1,28 5,29 2,31 1,32 28,35 3.5,36 0.102,37 6,38 37,39 56.843,40 64.813,41 36.722,42 34.045,44 6.886}
{0 CHEMBL2338819,1 7.369,2 35.8,3 49.1,4 1.003,5 1.134,6 0.649,7 0.608,8 390.56,9 7.5,10 10,11 53,13 12,14 29,16 55,17 19,20 8,21 11,22 2,24 26,25 8,26 1,28 4,29 3,31 1,32 27,35 5.7,36 0.109,37 6,38 36,39 53.185,40 60.109,41 34.409,42 32.212,44 4.301}
{0 CHEMBL2338820,1 7.081,2 35.1,3 50.9,4 0.997,5 1.137,6 0.644,7 0.597,8 403.61,9 8.8,10 10,11 57,13 12,14 30,16 59,17 20,20 8,21 12,22 2,24 29,25 8,26 1,28 5,29 2,31 1,32 28,35 3.5,36 0.102,37 6,38 37,39 56.843,40 64.813,41 36.722,42 34.045,44 5}
{0 CHEMBL2338821,1 6.931,2 36,3 52,4 0.991,5 1.134,6 0.65,7 0.596,8 346.55,9 8,10 10,11 50,13 11,14 26,16 52,17 18,20 7,21 11,22 1,24 26,25 6,26 1,28 4,29 1,31 1,32 24,35 2,36 0.096,37 5,38 32,39 49.531,40 56.69,41 32.5,42 29.782,44 4.301}
{0 CHEMBL23832,1 7.898,2 48.1,3 40.7,4 1.006,5 1.111,6 0.693,7 0.67,8 213.25,9 3.7,10 12,11 27,13 13,14 17,16 28,17 13,20 13,22 1,24 11,25 3,28 1,29 2,32 16,35 7.4,36 0.107,37 3,38 24,39 27.174,40 29.993,41 18.722,42 18.085,44 4}
{0 CHEMBL242867,1 7.25,2 42.6,3 46.3,4 1,5 1.124,6 0.662,7 0.63,8 391.51,9 5.6,10 16,11 54,13 19,14 31,16 56,17 23,20 18,21 5,22 3,24 25,25 6,28 3,29 3,32 29,35 5.6,36 0.125,37 7,38 42,39 54.007,40 60.69,41 35.756,42 34.003,44 4.301}
{0 CHEMBL244160,1 7.16,2 43.8,3 46.6,4 0.995,5 1.121,6 0.669,7 0.632,8 522.7,9 5.5,10 22,11 73,13 25,14 43,16 77,17 32,20 24,21 8,22 3,24 34,25 7,28 4,29 3,32 39,35 4.1,36 0.13,37 10,38 57,39 72.643,40 81.849,41 48.807,42 46.132,44 4.201}
{0 CHEMBL245011,1 7.583,2 42.6,3 44.4,4 1.01,5 1.13,6 0.661,7 0.637,8 409.5,9 5.6,10 16,11 54,13 19,14 32,16 56,17 23,20 18,21 5,22 3,23 1,24 24,25 7,28 3,29 3,32 30,34 1,35 5.6,36 0.125,37 7,38 43,39 54.52,40 61.03,41 35.694,42 34.387,43 1.9,44 4.097}
{0 CHEMBL257991,1 8.239,2 43.9,3 40.4,4 1.003,5 1.122,6 0.706,7 0.671,8 469.62,9 12.3,10 26,11 57,13 27,14 39,16 62,17 25,20 20,21 5,22 1,24 23,25 9,26 1,28 7,29 1,31 1,32 34,35 1.8,36 0.081,37 5,38 53,39 57.185,40 63.939,41 40.233,42 38.266,44 4.432}
{0 CHEMBL261605,1 7.588,2 52.6,3 42.1,4 0.993,5 1.098,6 0.711,7 0.675,8 288.36,10 17,11 38,13 18,14 25,16 41,17 20,20 17,21 3,22 1,24 16,25 2,29 2,32 22,35 5.3,36 0.024,37 1,38 34.5,39 37.723,40 41.74,41 27,42 25.644,44 5.469}
{0 CHEMBL263467,1 7.698,2 44.6,3 43.2,4 1.01,5 1.123,6 0.671,7 0.648,8 569.68,9 4.1,10 20,11 74,13 23,14 49,16 81,17 33,20 20,21 13,22 3,23 1,24 32,25 9,28 3,29 5,32 42,34 1,35 6.8,36 0.012,37 1,38 62,39 74.709,40 83.11,41 49.648,42 47.923,43 1.4,44 4.682}
{0 CHEMBL265502,1 10.297,2 40.5,3 31.7,4 1.053,5 1.114,6 0.717,7 0.711,8 1297.39,9 4.8,10 46,11 126,13 63,14 93,16 133,17 51,20 49,21 2,22 17,24 40,25 35,26 6,28 6,29 23,31 6,32 86,35 18.3,36 0.12,37 16,38 133,39 132.618,40 140.384,41 90.318,42 89.647,44 5.94}
{0 CHEMBL266487,1 8.615,2 52.6,3 34.2,4 1.01,5 1.105,6 0.73,7 0.714,8 327.36,9 7.9,10 20,11 38,13 23,14 29,16 42,17 20,20 20,22 3,24 13,25 5,28 3,29 2,32 25,35 5.3,36 0.048,37 2,38 42,39 38.378,40 41.99,41 27.733,42 27.128,44 5.328}
{0 CHEMBL270075,1 12.346,2 54.3,3 34.3,4 1.009,5 1.086,6 0.798,7 0.748,8 432.11,10 17,11 35,13 18,14 26,15 2,16 38,17 19,20 17,21 2,22 1,24 12,25 4,26 2,29 2,32 23,34 2,35 5.7,36 0.026,37 1,38 35.5,39 35.298,40 38.008,41 27.943,42 26.168,43 5.7,44 4.996}
{0 CHEMBL270109,1 7.814,2 51.2,3 41.5,4 1.003,5 1.11,6 0.7,7 0.672,8 320.38,10 17,11 41,13 18,14 27,16 44,17 21,20 17,21 4,22 1,23 1,24 17,25 3,29 2,32 24,34 1,35 4.9,36 0.023,37 1,38 36.5,39 41.12,40 45.495,41 28.699,42 27.554,43 2.4,44 5.469}
{0 CHEMBL270110,1 7.375,2 51.2,3 43.9,4 0.99,5 1.101,6 0.702,7 0.663,8 302.39,10 17,11 41,13 18,14 26,16 44,17 21,20 17,21 4,22 1,24 18,25 2,29 2,32 23,35 4.9,36 0.023,37 1,38 35.5,39 40.607,40 45.156,41 28.762,42 27.171,44 6}
{0 CHEMBL270291,1 9.827,2 51.3,3 38.5,4 1.007,5 1.097,6 0.739,7 0.702,8 383.25,10 17,11 39,13 18,14 27,15 1,16 42,17 20,20 17,21 3,22 1,24 15,25 4,26 1,29 3,32 24,34 1,35 7.7,36 0.048,37 2,38 36.5,39 39.28,40 42.791,41 28.807,42 27.384,43 2.6,44 5.268}
{0 CHEMBL270292,1 10.092,2 54.3,3 37.1,4 1.002,5 1.09,6 0.76,7 0.718,8 353.22,10 17,11 35,13 18,14 25,15 1,16 38,17 19,20 17,21 2,22 1,24 13,25 3,26 1,29 2,32 22,34 1,35 5.7,36 0.026,37 1,38 34.5,39 35.069,40 38.167,41 26.591,42 25.142,43 2.9,44 5.284}
{0 CHEMBL270478,1 10.571,2 52.6,3 36.8,4 1.007,5 1.093,6 0.769,7 0.724,8 401.69,10 17,11 38,13 18,14 27,15 1,16 41,17 20,18 1,20 17,21 3,22 1,24 14,25 4,26 2,29 2,32 24,34 2,35 5.3,36 0.024,37 1,38 36.5,39 38.276,40 41.526,41 29.21,42 27.497,43 5.3,44 5.638}
{0 CHEMBL270905,1 11.435,2 54.3,3 37.1,4 0.997,5 1.087,6 0.797,7 0.727,8 400.22,10 17,11 35,13 18,14 25,16 38,17 19,20 17,21 2,22 1,24 13,25 3,26 1,27 1,29 2,32 22,34 1,35 5.7,36 0.026,37 1,38 34.5,39 34.909,40 38.046,41 27.898,42 25.434,43 2.9,44 4.71}
{0 CHEMBL271536,1 7.375,2 51.2,3 43.9,4 0.99,5 1.101,6 0.702,7 0.663,8 302.39,10 17,11 41,13 18,14 26,16 44,17 21,20 17,21 4,22 1,24 18,25 2,29 2,32 23,35 4.9,36 0.023,37 1,38 35.5,39 40.607,40 45.156,41 28.762,42 27.171,44 5.357}
{0 CHEMBL272461,1 11.12,2 54.3,3 31.4,4 1.031,5 1.11,6 0.756,7 0.74,8 389.2,10 17,11 35,13 18,14 27,15 1,16 38,17 19,20 17,21 2,22 1,23 2,24 11,25 5,26 1,29 2,32 24,34 3,35 5.7,36 0.026,37 1,38 36.5,39 36.094,40 38.846,41 26.466,42 25.909,43 8.6,44 4.706}
{0 CHEMBL273076,1 10.138,2 52.6,3 36.8,4 1.012,5 1.103,6 0.744,7 0.712,8 385.24,10 17,11 38,13 18,14 27,15 1,16 41,17 20,20 17,21 3,22 1,23 1,24 14,25 4,26 1,29 2,32 24,34 2,35 5.3,36 0.024,37 1,38 36.5,39 38.465,40 41.922,41 28.29,42 27.053,43 5.3,44 5.699}
{0 CHEMBL291725,1 8.327,2 51.2,3 36.6,4 1.006,5 1.107,6 0.719,7 0.699,8 341.39,9 7.3,10 20,11 41,13 23,14 30,16 45,17 21,20 20,21 1,22 3,24 15,25 5,28 3,29 2,32 26,35 4.9,36 0.044,37 2,38 43,39 41.262,40 45.405,41 29.495,42 28.655,44 4.481}
{0 CHEMBL296586,1 10.555,2 51.6,3 35.5,4 1.006,5 1.101,6 0.762,7 0.723,8 327.19,9 6.5,10 16,11 31,13 17,14 23,15 1,16 34,17 16,20 15,21 1,22 1,24 11,25 4,26 1,28 2,29 1,32 20,34 1,35 3.2,38 32,39 31.178,40 34.124,41 23.625,42 22.417,43 3.2,44 4}
{0 CHEMBL298346,1 8.186,2 52.9,3 37.3,4 1.001,5 1.103,6 0.726,7 0.7,8 417.49,9 5.9,10 26,11 51,13 29,14 37,16 56,17 27,20 26,21 1,22 3,24 19,25 5,28 3,29 2,32 32,35 3.9,36 0.071,37 4,38 53,39 51.029,40 56.235,41 37.017,42 35.708,44 4.398}
{0 CHEMBL302449,1 8.052,2 51.1,3 38.3,4 0.998,5 1.109,6 0.719,7 0.691,8 378.46,9 8.5,10 24,11 47,13 26,14 34,16 52,17 24,19 1,20 19,21 4,22 1,24 18,25 5,28 4,29 1,32 29,33 1,35 2.1,36 0.038,37 2,38 49,39 46.92,40 52.109,41 33.807,42 32.488,44 4}
{0 CHEMBL372375,1 7.587,2 50,3 42.3,4 0.994,5 1.107,6 0.703,7 0.668,8 394.5,9 3.8,10 23,11 52,13 25,14 33,16 55,17 26,20 24,21 2,22 2,24 22,25 4,28 2,29 2,32 30,35 3.8,36 0.091,37 5,38 46.5,39 51.694,40 57.567,41 36.534,42 34.74,44 4.556}
{0 CHEMBL373990,1 7.909,2 50,3 40,4 1.001,5 1.108,6 0.706,7 0.679,8 316.38,9 5,10 18,11 40,13 20,14 26,16 42,17 20,20 20,22 2,24 16,25 4,28 2,29 2,32 24,35 5,36 0.095,37 4,38 37,39 40.043,40 44.322,41 28.25,42 27.16,44 4.234}
{0 CHEMBL380797,1 7.587,2 50,3 42.3,4 0.994,5 1.107,6 0.703,7 0.668,8 394.5,9 3.8,10 23,11 52,13 25,14 33,16 55,17 26,20 24,21 2,22 2,24 22,25 4,28 2,29 2,32 30,35 3.8,36 0.091,37 5,38 46.5,39 51.694,40 57.567,41 36.534,42 34.74,44 4.338}
{0 CHEMBL384535,1 8.159,2 45,3 40,4 1.02,5 1.124,6 0.677,7 0.664,8 489.54,9 5,10 20,11 60,13 23,14 41,16 65,17 27,20 20,21 7,22 3,23 1,24 24,25 9,28 3,29 5,32 36,34 1,35 8.3,36 0.031,37 2,38 54,39 61.174,40 67.449,41 40.602,42 39.816,43 1.7,44 4.301}
{0 CHEMBL384899,1 7.786,2 52.2,3 40.3,4 0.993,5 1.103,6 0.717,7 0.684,8 521.65,9 4.5,10 32,11 67,13 35,14 46,16 73,17 35,20 32,21 3,22 3,24 27,25 5,28 3,29 2,32 40,35 3,36 0.082,37 6,38 65,39 66.563,40 73.896,41 48.063,42 45.815,44 4.106}
{0 CHEMBL386248,1 8.715,2 45.1,3 37.3,4 1.037,5 1.137,6 0.672,7 0.673,8 444.44,9 3.9,10 18,11 51,13 20,14 34,16 53,17 23,20 20,21 3,22 2,23 3,24 19,25 9,28 2,29 4,32 32,34 3,35 7.8,36 0.113,37 6,38 45,39 52.887,40 58.005,41 34.256,42 34.32,43 5.9,44 4.041}
{0 CHEMBL387119,1 6.704,2 41.2,3 50.6,4 0.992,5 1.125,6 0.648,7 0.605,8 569.81,9 3.5,10 20,11 85,13 23,14 46,16 89,17 35,20 20,21 15,22 3,24 43,25 7,28 3,29 4,32 42,35 4.7,36 0.18,37 16,38 59,39 84.287,40 95.637,41 55.063,42 51.459,44 4}
{0 CHEMBL390332,1 10.1,2 53.5,3 30.2,4 1.021,5 1.1,6 0.772,7 0.751,8 434.29,9 7,10 22,11 43,13 25,14 33,16 46,17 23,18 2,19 1,20 22,22 2,24 13,25 7,26 2,28 3,29 2,32 30,33 1,34 2,35 4.7,36 0.087,37 4,38 48,39 43.909,40 47.293,41 33.21,42 32.31,43 4.7,44 5}
{0 CHEMBL397044,1 7.115,2 42.1,3 47.4,4 0.998,5 1.125,6 0.658,7 0.623,8 405.54,9 5.3,10 16,11 57,13 19,14 32,16 59,17 24,20 18,21 6,22 3,24 27,25 6,28 3,29 3,32 30,35 5.3,36 0.136,37 8,38 43,39 56.891,40 64.106,41 37.517,42 35.53,44 4.004}
{0 CHEMBL402446,1 9.784,2 52.8,3 38.9,4 0.996,5 1.096,6 0.754,7 0.707,8 352.24,9 2.8,10 17,11 36,13 18,14 25,15 1,16 39,17 19,20 17,21 2,22 1,24 14,25 3,26 1,28 1,29 1,32 22,34 1,35 2.8,36 0.026,37 1,38 34.5,39 35.843,40 39.456,41 27.142,42 25.449,43 2.8,44 5.194}
{0 CHEMBL403988,1 7.588,2 52.6,3 42.1,4 0.993,5 1.098,6 0.711,7 0.675,8 288.36,10 17,11 38,13 18,14 25,16 41,17 20,20 17,21 3,22 1,24 16,25 2,29 2,32 22,35 5.3,36 0.024,37 1,38 34.5,39 37.723,40 41.74,41 27,42 25.644,44 4.975}
{0 CHEMBL405156,1 10.606,2 54.3,3 34.3,4 1.017,5 1.1,6 0.758,7 0.729,8 371.21,10 17,11 35,13 18,14 26,15 1,16 38,17 19,20 17,21 2,22 1,23 1,24 12,25 4,26 1,29 2,32 23,34 2,35 5.7,36 0.026,37 1,38 35.5,39 35.582,40 38.507,41 26.529,42 25.526,43 5.7,44 5.102}
{0 CHEMBL406803,1 7.89,2 50,3 40.5,4 1.004,5 1.106,6 0.701,7 0.676,8 331.39,9 2.4,10 17,11 42,13 19,14 28,16 45,17 21,20 18,21 3,22 2,24 17,25 4,28 1,29 3,32 25,35 7.1,36 0.044,37 2,38 38.5,39 42.153,40 46.448,41 29.46,42 28.38,44 4.699}
{0 CHEMBL407059,1 8.035,2 53.8,3 38.5,4 0.999,5 1.098,6 0.724,7 0.696,8 313.37,9 2.6,10 17,11 39,13 19,14 27,16 42,17 21,19 1,20 17,21 3,22 1,24 15,25 3,28 1,29 2,32 24,33 1,35 5.1,36 0.024,37 1,38 38.5,39 38.942,40 42.824,41 28.245,42 27.139,44 5.509}
{0 CHEMBL407321,1 7.375,2 51.2,3 43.9,4 0.99,5 1.101,6 0.702,7 0.663,8 302.39,10 17,11 41,13 18,14 26,16 44,17 21,20 17,21 4,22 1,24 18,25 2,29 2,32 23,35 4.9,36 0.023,37 1,38 35.5,39 40.607,40 45.156,41 28.762,42 27.171,44 5.824}
{0 CHEMBL407517,1 9.827,2 51.3,3 38.5,4 1.007,5 1.097,6 0.739,7 0.702,8 383.25,10 17,11 39,13 18,14 27,15 1,16 42,17 20,20 17,21 3,22 1,24 15,25 4,26 1,29 3,32 24,34 1,35 7.7,36 0.048,37 2,38 36.5,39 39.28,40 42.791,41 28.807,42 27.384,43 2.6,44 5.638}
{0 CHEMBL409006,1 10.606,2 54.3,3 34.3,4 1.017,5 1.1,6 0.758,7 0.729,8 371.21,10 17,11 35,13 18,14 26,15 1,16 38,17 19,20 17,21 2,22 1,23 1,24 12,25 4,26 1,29 2,32 23,34 2,35 5.7,36 0.026,37 1,38 35.5,39 35.582,40 38.507,41 26.529,42 25.526,43 5.7,44 5.495}
{0 CHEMBL413219,1 7.399,2 42.9,3 45.5,4 1.005,5 1.122,6 0.661,7 0.634,8 569.71,9 3.9,10 20,11 77,13 23,14 48,16 83,17 33,20 20,21 13,22 3,24 35,25 9,28 3,29 6,32 42,35 7.8,36 0.108,37 9,38 61,39 77.407,40 86.395,41 50.926,42 48.782,44 5.553}
{0 CHEMBL413376,1 10.297,2 40.5,3 31.7,4 1.053,5 1.114,6 0.717,7 0.711,8 1297.39,9 4.8,10 46,11 126,13 63,14 93,16 133,17 51,20 49,21 2,22 17,24 40,25 35,26 6,28 6,29 23,31 6,32 86,35 18.3,36 0.12,37 16,38 133,39 132.618,40 140.384,41 90.318,42 89.647,44 5.921}
{0 CHEMBL420311,1 8.291,2 43.3,3 43.3,4 1.005,5 1.121,6 0.696,7 0.658,8 248.73,9 6.7,10 10,11 30,13 11,14 19,16 32,17 13,18 1,20 9,21 4,22 1,24 13,25 4,26 1,28 2,29 1,32 17,34 1,35 3.3,36 0.031,37 1,38 25,39 30.156,40 33.641,41 20.892,42 19.746,43 3.3,44 4.704}
{0 CHEMBL425294,1 7.719,2 48.4,3 41.9,4 1.002,5 1.11,6 0.693,7 0.665,8 478.58,9 3.2,10 24,11 62,13 26,14 40,16 66,17 30,20 26,21 4,22 2,24 26,25 6,28 2,29 4,32 36,35 6.5,36 0.121,37 8,38 54,39 62.116,40 68.817,41 42.966,42 41.224,44 4.245}
{0 CHEMBL429433,1 9.664,2 52.6,3 39.5,4 0.999,5 1.094,6 0.746,7 0.702,8 367.25,10 17,11 38,13 18,14 26,15 1,16 41,17 20,20 17,21 3,22 1,24 15,25 3,26 1,29 2,32 23,34 1,35 5.3,36 0.024,37 1,38 35.5,39 37.953,40 41.582,41 28.353,42 26.669,43 2.6,44 5.009}
{0 CHEMBL438203,1 9.664,2 52.6,3 39.5,4 0.999,5 1.094,6 0.746,7 0.702,8 367.25,10 17,11 38,13 18,14 26,15 1,16 41,17 20,20 17,21 3,22 1,24 15,25 3,26 1,29 2,32 23,34 1,35 5.3,36 0.024,37 1,38 35.5,39 37.953,40 41.582,41 28.353,42 26.669,43 2.6,44 5.824}
{0 CHEMBL445405,1 7.402,2 43.1,3 45.1,4 1.002,5 1.123,6 0.667,7 0.637,8 377.48,9 5.9,10 16,11 51,13 19,14 30,16 53,17 22,20 18,21 4,22 3,24 23,25 6,28 3,29 3,32 28,35 5.9,36 0.132,37 7,38 41,39 51.123,40 57.275,41 33.995,42 32.477,44 4.328}
{0 CHEMBL446446,1 7.962,2 42.4,3 45.5,4 1.001,5 1.123,6 0.686,7 0.645,8 262.76,9 6.1,10 10,11 33,13 11,14 20,16 35,17 14,18 1,20 9,21 5,22 1,24 15,25 4,26 1,28 2,29 1,32 18,34 1,35 3,36 0.029,37 1,38 26,39 33.04,40 37.056,41 22.654,42 21.273,43 3,44 5.558}
{0 CHEMBL447677,1 6.933,2 30.1,3 53.4,4 1.003,5 1.147,6 0.617,7 0.573,8 714.09,9 8.7,10 5,11 103,13 11,14 48,16 103,17 31,20 9,21 22,22 6,24 55,25 17,26 2,28 9,29 6,31 2,32 48,35 5.8,36 0.243,37 25,38 56.5,39 103.356,40 118.131,41 63.586,42 58.972,44 5.194}
{0 CHEMBL447852,1 7.314,2 29.2,3 51.7,4 1.016,5 1.146,6 0.614,7 0.578,8 650.92,9 6.7,11 89,13 7,14 42,16 88,17 26,20 7,21 19,22 7,24 46,25 17,26 2,28 6,29 9,31 2,32 43,35 10.1,36 0.25,37 22,38 49,39 90.381,40 102.018,41 54.648,42 51.472,44 4.032}
{0 CHEMBL449883,1 6.812,2 30.2,3 53.1,4 1.005,5 1.15,6 0.608,7 0.57,8 653.96,9 9.4,10 5,11 96,13 11,14 45,16 96,17 29,20 9,21 20,22 6,24 51,25 16,26 1,28 9,29 6,31 1,32 45,35 6.3,36 0.229,37 22,38 53.5,39 96.512,40 110.38,41 58.415,42 54.731,44 4.478}
{0 CHEMBL452893,1 7.292,2 30.4,3 50,4 1.018,5 1.149,6 0.611,7 0.585,8 670.89,9 8.7,10 5,11 92,13 12,14 46,16 92,17 28,20 10,21 18,22 7,24 46,25 18,26 1,28 8,29 9,31 1,32 46,35 9.8,36 0.228,37 21,38 55.5,39 93.625,40 105.68,41 56.25,42 53.801,44 4.507}
{0 CHEMBL453807,1 7.141,2 30.4,3 52.2,4 1.007,5 1.146,6 0.623,7 0.58,8 656.98,9 8.7,10 5,11 92,13 11,14 44,16 92,17 28,20 9,21 19,22 6,24 48,25 16,26 2,28 8,29 6,31 2,32 44,35 6.5,36 0.228,37 21,38 52.5,39 92.603,40 105.387,41 57.296,42 53.37,44 4.783}
{0 CHEMBL466754,1 9.945,2 45.7,3 30.4,4 1.045,5 1.138,6 0.717,7 0.718,8 457.47,9 10.9,10 22,11 46,13 24,14 35,16 49,17 21,20 20,21 1,22 2,23 3,24 14,25 11,26 1,28 5,29 2,31 1,32 32,34 3,35 4.3,36 0.082,37 4,38 48,39 48.08,40 52.341,41 32.966,42 33.034,43 6.5,44 4.131}
{0 CHEMBL472515,1 7.085,2 43.4,3 47.2,4 0.994,5 1.122,6 0.666,7 0.628,8 375.51,9 5.7,10 16,11 53,13 19,14 30,16 55,17 23,20 18,21 5,22 3,24 25,25 5,28 3,29 2,32 28,35 3.8,36 0.127,37 7,38 41,39 52.68,40 59.481,41 35.302,42 33.289,44 4}
{0 CHEMBL474872,1 10.685,2 48,3 32,4 1.029,5 1.11,6 0.769,7 0.741,8 267.12,9 8,10 10,11 25,13 12,14 19,16 27,17 12,18 2,20 11,21 1,22 2,24 8,25 5,26 2,28 2,29 1,32 17,34 2,35 4,38 26,39 25.713,40 27.755,41 19.227,42 18.52,43 8,44 4.059}
{0 CHEMBL488685,1 7.116,2 43.9,3 47,4 0.995,5 1.12,6 0.667,7 0.63,8 469.63,9 4.5,10 22,11 66,13 24,14 38,16 69,17 29,20 22,21 7,22 2,24 31,25 6,28 3,29 3,32 35,35 4.5,36 0.159,37 11,38 51,39 65.658,40 73.936,41 44.04,42 41.584,44 4.066}
{0 CHEMBL490736,1 8.322,2 48.9,3 40,4 1,5 1.103,6 0.726,7 0.686,8 374.49,9 4.4,10 17,11 45,13 20,14 30,16 48,17 22,20 20,21 2,22 3,24 18,25 5,26 1,28 2,29 2,31 1,32 27,35 4.4,36 0.063,37 3,38 41.5,39 45.003,40 49.657,41 32.659,42 30.874,44 4.697}
{0 CHEMBL490905,1 9.102,2 54.1,3 35.1,4 1.013,5 1.094,6 0.745,7 0.721,8 336.78,10 17,11 37,13 19,14 27,16 40,17 20,18 1,20 18,21 2,22 2,24 13,25 4,26 1,29 3,32 24,34 1,35 8.1,36 0.05,37 2,38 37.5,39 37.491,40 40.479,41 27.551,42 26.66,43 2.7,44 5.027}
{0 CHEMBL491106,1 8.174,2 49,3 40.8,4 0.998,5 1.104,6 0.723,7 0.682,8 400.53,9 4.1,10 17,11 49,13 21,14 32,16 52,17 24,20 22,21 2,22 4,24 20,25 5,26 1,28 2,29 2,31 1,32 29,35 4.1,36 0.096,37 5,38 44.5,39 48.887,40 54.072,41 35.421,42 33.401,44 4.654}
{0 CHEMBL491960,1 8.582,2 50,3 38.1,4 1.003,5 1.101,6 0.736,7 0.699,8 360.46,9 4.8,10 17,11 42,13 20,14 29,16 45,17 21,20 20,21 1,22 3,24 16,25 5,26 1,28 2,29 2,31 1,32 26,35 4.8,36 0.067,37 3,38 40.5,39 42.12,40 46.242,41 30.898,42 29.347,44 4.348}
{0 CHEMBL492308,1 6.778,2 30.2,3 53.5,4 1.004,5 1.149,6 0.61,7 0.569,8 582.87,9 9.3,10 5,11 86,13 10,14 40,16 86,17 26,20 8,21 18,22 5,24 46,25 14,26 1,28 8,29 5,31 1,32 40,35 5.8,36 0.233,37 20,38 47.5,39 86.316,40 98.842,41 52.432,42 48.941,44 4.701}
{0 CHEMBL492521,1 7.516,2 28.6,3 49.4,4 1.027,5 1.151,6 0.603,7 0.583,8 578.73,9 7.8,11 77,13 7,14 38,16 76,17 22,20 7,21 15,22 7,24 38,25 17,26 1,28 6,29 10,31 1,32 39,35 13,36 0.237,37 18,38 45,39 79.098,40 88.647,41 46.409,42 44.892,44 4.073}
{0 CHEMBL492710,1 7.605,2 28.6,3 50,4 1.023,5 1.148,6 0.614,7 0.585,8 638.86,9 7.1,11 84,13 7,14 41,16 83,17 24,20 7,21 17,22 7,24 42,25 18,26 2,28 6,29 10,31 2,32 42,35 11.9,36 0.253,37 21,38 48,39 85.941,40 96.397,41 51.58,42 49.133,44 4.975}
{0 CHEMBL492741,1 11.956,2 50,3 33.3,4 1.02,5 1.1,6 0.772,7 0.736,8 502.17,9 4.8,10 18,11 42,13 20,14 31,15 2,16 45,17 21,20 20,21 1,22 2,24 14,25 7,26 2,28 2,29 3,32 28,34 2,35 7.1,36 0.067,37 3,38 42,39 42.829,40 46.214,41 32.409,42 30.925,43 4.8,44 4.783}
{0 CHEMBL492925,1 6.95,2 28.9,3 53,4 1.013,5 1.15,6 0.6,7 0.567,8 576.81,9 7.2,11 83,13 6,14 38,16 82,17 24,20 6,21 18,22 6,24 44,25 15,26 1,28 6,29 8,31 1,32 39,35 9.6,36 0.22,37 18,38 44,39 84.094,40 95.474,41 49.784,42 47.043,44 5.26}
{0 CHEMBL493159,1 7.577,2 28.4,3 49.3,4 1.028,5 1.151,6 0.603,7 0.584,8 507.64,9 7.5,11 67,13 6,14 33,16 66,17 19,20 6,21 13,22 6,24 33,25 15,26 1,28 5,29 9,31 1,32 34,35 13.4,36 0.242,37 16,38 39,39 68.902,40 77.109,41 40.426,42 39.102,44 4.357}
{0 CHEMBL493160,1 7.116,2 29.3,3 52,4 1.016,5 1.149,6 0.603,7 0.573,8 533.73,9 6.7,11 75,13 6,14 35,16 74,17 22,20 6,21 16,22 6,24 39,25 14,26 1,28 5,29 8,31 1,32 36,35 10.7,36 0.23,37 17,38 41,39 76.225,40 86.145,41 45.256,42 42.968,44 4.079}
{0 CHEMBL504310,1 7.149,2 29.8,3 52.1,4 1.007,5 1.148,6 0.62,7 0.579,8 672,9 9.6,10 5,11 94,13 11,14 45,16 94,17 28,20 9,21 19,22 6,24 49,25 17,26 2,28 9,29 6,31 2,32 45,35 6.4,36 0.245,37 23,38 53.5,39 94.705,40 107.885,41 58.302,42 54.392,44 5.42}
{0 CHEMBL504711,1 6.75,2 29.2,3 55.2,4 1.002,5 1.147,6 0.61,7 0.562,8 648.02,9 7.3,11 96,13 6,14 42,16 95,17 28,20 6,21 22,22 6,24 53,25 15,26 2,28 7,29 6,31 2,32 43,35 6.3,36 0.242,37 23,38 48,39 96.152,40 110.134,41 58.574,42 53.929,44 5.071}
{0 CHEMBL505399,1 6.744,2 28.7,3 54.3,4 1.009,5 1.151,6 0.597,7 0.56,8 633.92,9 7.4,11 94,13 6,14 42,16 93,17 27,20 6,21 21,22 6,24 51,25 16,26 1,28 7,29 8,31 1,32 43,35 8.5,36 0.237,37 22,38 48,39 94.847,40 108.218,41 56.074,42 52.645,44 5.161}
{0 CHEMBL507676,1 7.219,2 29.1,3 51.2,4 1.02,5 1.15,6 0.601,7 0.575,8 620.82,9 7,11 86,13 7,14 41,16 85,17 25,20 7,21 18,22 7,24 44,25 17,26 1,28 6,29 10,31 1,32 42,35 11.6,36 0.235,37 20,38 48,39 87.749,40 98.893,41 51.693,42 49.473,44 4.536}
{0 CHEMBL510904,1 6.84,2 30,3 53,4 1.007,5 1.15,6 0.606,7 0.57,8 683.99,9 9,10 5,11 100,13 11,14 47,16 100,17 30,20 9,21 21,22 6,24 53,25 17,26 1,28 9,29 7,31 1,32 47,35 7,36 0.23,37 23,38 55.5,39 100.723,40 115.005,41 60.631,42 56.973,44 5.119}
{0 CHEMBL512966,1 8.914,2 40.4,3 38.5,4 1.033,5 1.146,6 0.678,7 0.666,8 463.53,9 9.6,10 17,11 52,13 19,14 34,16 54,17 21,20 16,21 5,22 2,23 3,24 20,25 11,26 1,28 5,29 2,31 1,32 32,34 3,35 3.8,36 0.093,37 5,38 44.5,39 53.731,40 59.586,41 35.25,42 34.615,43 5.8,44 4.244}
{0 CHEMBL521799,1 10.461,2 50,3 35.7,4 1.008,5 1.097,6 0.768,7 0.723,8 439.35,9 4.8,10 17,11 42,13 20,14 30,15 1,16 45,17 21,20 20,21 1,22 3,24 15,25 6,26 2,28 2,29 2,31 1,32 27,34 1,35 4.8,36 0.067,37 3,38 41.5,39 42.349,40 46.083,41 32.25,42 30.372,43 2.4,44 4.046}
{0 CHEMBL521807,1 6.708,2 29.1,3 55.8,4 0.999,5 1.146,6 0.612,7 0.56,8 576.93,9 7,11 86,13 5,14 37,16 85,17 25,20 5,21 20,22 5,24 48,25 13,26 2,28 6,29 5,31 2,32 38,35 5.8,36 0.247,37 21,38 42,39 85.956,40 98.596,41 52.591,42 48.139,44 4.303}
{0 CHEMBL522620,1 7.714,2 46.3,3 44.4,4 0.994,5 1.109,6 0.703,7 0.657,8 416.58,9 3.7,10 17,11 54,13 20,14 33,16 57,17 25,20 20,21 5,22 3,24 24,25 5,26 1,28 2,29 2,31 1,32 30,35 3.7,36 0.105,37 6,38 44.5,39 53.654,40 59.903,41 37.943,42 35.454,44 6}
{0 CHEMBL522968,1 8.094,2 47.9,3 41.7,4 0.998,5 1.106,6 0.717,7 0.675,8 388.52,9 4.2,10 17,11 48,13 20,14 31,16 51,17 23,20 20,21 3,22 3,24 20,25 5,26 1,28 2,29 2,31 1,32 28,35 4.2,36 0.078,37 4,38 42.5,39 47.887,40 53.072,41 34.421,42 32.401,44 4.979}
{0 CHEMBL523498,1 7.205,2 29.3,3 51.2,4 1.019,5 1.15,6 0.603,7 0.576,8 590.79,9 7.3,11 82,13 7,14 39,16 81,17 24,20 7,21 17,22 7,24 42,25 16,26 1,28 6,29 9,31 1,32 40,35 11,36 0.235,37 19,38 46,39 83.538,40 94.268,41 49.478,42 47.231,44 4.138}
{0 CHEMBL523676,1 7.116,2 29.4,3 51.8,4 1.017,5 1.149,6 0.603,7 0.574,8 604.82,9 7.1,11 85,13 7,14 40,16 84,17 25,20 7,21 18,22 7,24 44,25 16,26 1,28 6,29 9,31 1,32 41,35 10.6,36 0.226,37 19,38 47,39 86.421,40 97.683,41 51.239,42 48.758,44 4.427}
{0 CHEMBL523988,1 7.893,2 47.1,3 43.1,4 0.996,5 1.108,6 0.709,7 0.665,8 402.55,9 3.9,10 17,11 51,13 20,14 32,16 54,17 24,20 20,21 4,22 3,24 22,25 5,26 1,28 2,29 2,31 1,32 29,35 3.9,36 0.093,37 5,38 43.5,39 50.771,40 56.487,41 36.182,42 33.928,44 5.319}
{0 CHEMBL540468,1 7.589,2 50,3 42.1,4 0.993,5 1.108,6 0.705,7 0.67,8 288.37,9 5.3,10 18,11 38,13 19,14 24,16 40,17 19,20 19,22 1,24 16,25 3,28 2,29 1,32 22,35 2.6,36 0.1,37 4,38 34,39 37.716,40 42.112,41 26.796,42 25.445,44 4.481}
{0 CHEMBL549853,1 7.804,2 48.7,3 41,4 1.001,5 1.111,6 0.699,7 0.671,8 304.37,9 5.1,10 18,11 39,13 19,14 25,16 41,17 19,20 19,22 1,24 16,25 4,28 2,29 2,32 23,35 5.1,36 0.122,37 5,38 35,39 39.043,40 43.322,41 27.25,42 26.16,44 4.602}
{0 CHEMBL551010,1 8.066,2 45.7,3 40,4 1.014,5 1.118,6 0.684,7 0.667,8 282.32,9 5.7,10 12,11 35,13 15,14 22,16 36,17 16,20 16,22 3,24 14,25 5,28 2,29 3,32 21,35 8.6,36 0.139,37 5,38 31,39 35.487,40 39.116,41 23.943,42 23.348,44 4}
{0 CHEMBL551610,1 8.493,2 48.1,3 40.7,4 0.997,5 1.1,6 0.738,7 0.687,8 229.32,9 3.7,10 12,11 27,13 13,14 17,16 28,17 13,20 13,22 1,24 11,25 3,26 1,28 1,29 1,31 1,32 16,35 3.7,36 0.107,37 3,38 24,39 26.924,40 29.704,41 19.915,42 18.557,44 4}
{0 CHEMBL558854,1 7.799,2 44.7,3 42.1,4 1.01,5 1.119,6 0.676,7 0.655,8 296.35,9 5.3,10 12,11 38,13 15,14 23,16 39,17 17,20 16,21 1,22 3,24 16,25 5,28 2,29 3,32 22,35 7.9,36 0.154,37 6,38 32,39 38.371,40 42.531,41 25.705,42 24.875,44 4.495}
{0 CHEMBL560337,1 7.3,2 45.2,3 45.2,4 0.995,5 1.119,6 0.679,7 0.643,8 226.3,9 6.5,10 12,11 31,13 13,14 18,16 32,17 14,20 13,21 1,22 1,24 14,25 3,28 2,29 1,32 17,35 3.2,36 0.094,37 3,38 25,39 30.833,40 34.697,41 21.034,42 19.918,44 4.143}
{0 CHEMBL561194,1 7.581,2 46.4,3 42.9,4 0.998,5 1.117,6 0.688,7 0.657,8 212.27,9 7.1,10 12,11 28,13 13,14 17,16 29,17 13,20 13,22 1,24 12,25 3,28 2,29 1,32 16,35 3.6,36 0.103,37 3,38 24,39 27.949,40 31.282,41 19.273,42 18.392,44 4}
{0 CHEMBL561596,1 7.572,2 43.8,3 43.8,4 1.005,5 1.122,6 0.672,7 0.645,8 242.3,9 6.3,10 12,11 32,13 13,14 19,16 33,17 14,20 13,21 1,22 1,24 14,25 4,28 2,29 2,32 18,35 6.3,36 0.121,37 4,38 26,39 32.16,40 35.907,41 21.489,42 20.633,44 4}
{0 CHEMBL562473,1 7.589,2 50,3 42.1,4 0.993,5 1.108,6 0.705,7 0.67,8 288.37,9 5.3,10 18,11 38,13 19,14 24,16 40,17 19,20 19,22 1,24 16,25 3,28 2,29 1,32 22,35 2.6,36 0.1,37 4,38 34,39 37.716,40 42.112,41 26.796,42 25.445,44 4}
{0 CHEMBL562474,1 7.804,2 48.7,3 41,4 1.001,5 1.111,6 0.699,7 0.671,8 304.37,9 5.1,10 18,11 39,13 19,14 25,16 41,17 19,20 19,22 1,24 16,25 4,28 2,29 2,32 23,35 5.1,36 0.122,37 5,38 35,39 39.043,40 43.322,41 27.25,42 26.16,44 4}
{0 CHEMBL569054,1 11.172,2 50,3 26.7,4 1.046,5 1.106,6 0.771,7 0.765,8 335.15,9 6.7,10 12,11 30,13 16,14 24,16 32,17 15,18 2,20 15,22 4,24 8,25 7,26 2,28 2,29 3,32 22,34 2,35 10,36 0.063,37 2,38 34,39 31.367,40 33.174,41 23.136,42 22.949,43 6.7,44 4.983}
{0 CHEMBL569449,1 15.998,2 51.7,3 24.1,4 1.044,5 1.088,6 0.867,7 0.82,8 463.93,9 3.4,10 12,11 29,13 14,14 24,15 2,16 31,17 15,18 2,20 15,22 2,24 7,25 7,26 4,28 1,29 2,32 22,34 4,35 6.9,36 0.032,37 1,38 32,39 30.28,40 31.564,41 25.142,42 23.79,43 13.8,44 4.55}
{0 CHEMBL570186,1 11.005,2 53.6,3 28.6,4 1.036,5 1.108,6 0.783,7 0.765,8 308.14,9 3.6,10 12,11 28,13 14,14 22,16 30,17 15,18 2,20 15,22 2,23 1,24 8,25 5,26 2,28 1,29 1,32 20,34 3,35 3.6,36 0.033,37 1,38 30,39 29.007,40 31.011,41 21.921,42 21.409,43 10.7,44 4.476}
{0 CHEMBL572123,1 7.324,2 42.9,3 45.7,4 1.001,5 1.123,6 0.664,7 0.633,8 256.33,9 5.7,10 12,11 35,13 13,14 20,16 36,17 15,20 13,21 2,22 1,24 16,25 4,28 2,29 2,32 19,35 5.7,36 0.139,37 5,38 27,39 35.043,40 39.322,41 23.25,42 22.16,44 4}
{0 CHEMBL584353,1 7.386,2 39.3,3 48.2,4 0.999,5 1.125,6 0.664,7 0.62,8 413.59,9 5.4,10 12,11 56,13 15,14 30,16 57,17 22,20 15,21 7,22 3,24 27,25 7,26 1,28 3,29 3,31 1,32 29,35 5.4,36 0.193,37 11,38 39,39 55.967,40 63.026,41 37.165,42 34.717,44 4.731}
{0 CHEMBL596655,1 8.124,2 47.2,3 41.5,4 1.002,5 1.107,6 0.71,7 0.672,8 430.56,9 3.8,10 23,11 53,13 26,14 34,16 56,17 25,20 23,21 2,22 3,24 22,25 6,26 1,28 2,29 3,31 1,32 31,35 5.7,36 0.107,37 6,38 48.5,39 53.098,40 58.697,41 37.637,42 35.642,44 4.646}
{0 CHEMBL596656,1 7.646,2 50,3 44.2,4 0.985,5 1.1,6 0.721,7 0.668,8 397.57,9 1.9,10 23,11 52,13 24,14 32,16 55,17 26,20 23,21 3,22 1,24 23,25 3,26 1,28 1,29 1,31 1,32 29,35 1.9,36 0.109,37 6,38 44.5,39 51.225,40 57.195,41 37.483,42 34.718,44 4.717}
{0 CHEMBL596657,1 8.957,2 55.3,3 31.6,4 1.016,5 1.097,6 0.742,7 0.732,8 340.35,9 5.3,10 17,11 38,13 21,14 30,16 42,17 21,20 21,22 4,24 12,25 5,28 2,29 3,32 26,35 7.9,36 0.024,37 1,38 42.5,39 38.604,40 41.701,41 28.182,42 27.821,44 4.91}
{0 CHEMBL597477,1 8.291,2 43.3,3 43.3,4 1.005,5 1.121,6 0.696,7 0.658,8 248.73,9 6.7,10 10,11 30,13 11,14 19,16 32,17 13,18 1,20 9,21 4,22 1,24 13,25 4,26 1,28 2,29 1,32 17,34 1,35 3.3,36 0.031,37 1,38 25,39 30.156,40 33.641,41 20.892,42 19.746,43 3.3,44 5}
{0 CHEMBL597845,1 7.587,2 50,3 42.3,4 0.994,5 1.107,6 0.703,7 0.668,8 394.5,9 3.8,10 23,11 52,13 25,14 33,16 55,17 26,20 24,21 2,22 2,24 22,25 4,28 2,29 2,32 30,35 3.8,36 0.091,37 5,38 46.5,39 51.694,40 57.567,41 36.534,42 34.74,44 4.602}
{0 CHEMBL6291,1 8.171,2 44.6,3 41.1,4 1.003,5 1.117,6 0.704,7 0.669,8 457.6,9 8.9,10 20,11 56,13 24,14 37,16 60,17 25,20 21,21 4,22 4,24 23,25 8,26 1,28 5,29 2,31 1,32 33,35 3.6,36 0.117,37 7,38 51,39 56.192,40 62.567,41 39.438,42 37.465,44 6.097}
{0 CHEMBL7463,1 7.501,2 45.5,3 43.6,4 0.998,5 1.119,6 0.683,7 0.651,8 412.53,9 7.3,10 20,11 55,13 23,14 35,16 59,17 25,20 20,21 5,22 3,24 24,25 6,28 4,29 2,32 31,35 3.6,36 0.102,37 6,38 48,39 54.898,40 61.564,41 37.546,42 35.783,44 5.137}
{0 CHEMBL99779,1 9.485,2 52.3,3 38.6,4 0.996,5 1.099,6 0.748,7 0.704,8 417.32,9 4.5,10 22,11 44,13 23,14 31,15 1,16 48,17 23,20 21,21 2,22 1,24 17,25 4,26 1,28 2,29 1,32 27,34 1,35 2.3,36 0.042,37 2,38 43,39 43.829,40 48.369,41 32.909,42 30.997,43 2.3,44 4.369}
