"molecule_id","AMW","C.","H.","Me","Mi","Mp","Mv","MW","N.","nAB","nAT","nB","nBM","nBO","nBR","nBT","nC","nCL","nCsp","nCsp2","nCsp3","nDB","nF","nH","nHet","nHM","nI","nN","nO","nP","nS","nSK","nTB","nX","O.","RBF","RBN","SCBO","Se","Si","Sp","Sv","X.","pXC50"
{1 9.692,2 34,3 36.2,4 1.048,5 1.134,6 0.682,7 0.673,8 455.52,9 10.6,10 5,11 47,13 11,14 32,16 49,17 16,20 10,21 6,22 6,24 17,25 14,26 2,28 5,29 7,31 2,32 30,35 14.9,36 0.163,37 8,38 40.5,39 49.255,40 53.289,41 32.074,42 31.646,44 3.102}
{0 CHEMBL1082,1 8.306,2 36.4,3 43.2,4 1.025,5 1.131,6 0.66,7 0.637,8 365.45,9 6.8,10 6,11 44,13 9,14 27,16 46,17 16,20 9,21 7,22 3,24 19,25 9,26 1,28 3,29 5,31 1,32 25,35 11.4,36 0.087,37 4,38 33,39 45.087,40 49.784,41 29.029,42 28.04,44 4.658}
{0 CHEMBL1436,1 9.432,2 35.6,3 35.6,4 1.053,5 1.135,6 0.664,7 0.67,8 424.43,9 8.9,10 5,11 45,13 11,14 31,16 47,17 16,20 11,21 5,22 6,24 16,25 13,26 1,28 4,29 8,31 1,32 29,35 17.8,36 0.17,37 8,38 39.5,39 47.404,40 51.08,41 29.875,42 30.152,44 3.979}
{0 CHEMBL1449,1 9.377,2 36.6,3 39,4 1.037,5 1.122,6 0.692,7 0.668,8 384.47,9 4.9,10 5,11 41,13 9,14 27,16 43,17 15,20 8,21 7,22 4,24 16,25 10,26 2,28 2,29 6,31 2,32 25,35 14.6,36 0.116,37 5,38 33.5,39 42.505,40 45.999,41 28.364,42 27.393,44 5.222}
{0 CHEMBL148,1 8.092,2 32.4,3 45.9,4 1.024,5 1.139,6 0.644,7 0.616,8 299.39,9 8.1,11 37,13 4,14 21,16 38,17 12,20 5,21 7,22 4,24 17,25 8,26 1,28 3,29 4,31 1,32 20,35 10.8,36 0.158,37 6,38 25,39 37.876,40 42.159,41 23.813,42 22.798,44 4.456}
{0 CHEMBL161,1 10.271,2 33.3,3 33.3,4 1.051,5 1.135,6 0.703,7 0.692,8 554.65,9 14.8,10 5,11 54,13 13,14 39,16 57,17 18,20 12,21 6,22 8,24 18,25 18,26 3,28 8,29 7,31 3,32 36,35 13,36 0.14,37 8,38 49.5,39 56.753,40 61.288,41 37.977,42 37.37,44 3.022}
{0 CHEMBL186,1 8.45,2 33.3,3 43.9,4 1.023,5 1.137,6 0.664,7 0.633,8 481.64,9 10.5,10 5,11 57,13 10,14 35,16 60,17 19,20 9,21 10,22 5,24 25,25 13,26 2,28 6,29 5,31 2,32 32,35 8.8,36 0.117,37 7,38 42.5,39 58.294,40 64.821,41 37.835,42 36.081,44 3}
{0 CHEMBL29,1 8.157,2 39,3 43.9,4 1.016,5 1.124,6 0.672,7 0.642,8 334.43,9 4.9,10 6,11 41,13 9,14 25,16 43,17 16,20 9,21 7,22 3,24 18,25 7,26 1,28 2,29 4,31 1,32 23,35 9.8,36 0.093,37 4,38 31,39 41.658,40 46.076,41 27.568,42 26.304,44 4.921}
{0 CHEMBL316157,1 9.055,2 41.3,3 39.1,4 1.019,5 1.115,6 0.714,7 0.679,8 416.54,9 6.5,10 11,11 46,13 15,14 31,16 49,17 19,20 14,21 5,22 4,24 18,25 9,26 2,28 3,29 4,31 2,32 28,35 8.7,36 0.122,37 6,38 40.5,39 46.894,40 51.287,41 32.841,42 31.249,44 4.347}
{0 CHEMBL403,1 8.972,2 30.8,3 42.3,4 1.047,5 1.136,6 0.644,7 0.631,8 233.27,9 3.8,11 26,13 4,14 16,16 27,17 8,20 2,21 6,22 4,24 11,25 7,26 1,28 1,29 5,31 1,32 15,35 19.2,36 0.037,37 1,38 20,39 27.233,40 29.541,41 16.733,42 16.417,44 7.125}
{0 CHEMBL404,1 9.385,2 31.3,3 37.5,4 1.052,5 1.144,6 0.656,7 0.655,8 300.33,9 12.5,10 5,11 32,13 9,14 22,16 34,17 10,20 4,21 6,22 4,24 12,25 10,26 1,28 4,29 5,31 1,32 20,35 15.6,36 0.088,37 3,38 28.5,39 33.655,40 36.621,41 20.989,42 20.954,44 8.398}
{0 CHEMBL44354,1 9.127,2 36.7,3 38.3,4 1.034,5 1.13,6 0.683,7 0.666,8 547.65,9 10,10 11,11 60,13 17,14 40,16 63,17 22,20 15,21 7,22 6,24 23,25 15,26 2,28 6,29 7,31 2,32 37,35 11.7,36 0.143,37 9,38 51.5,39 62.065,40 67.825,41 40.983,42 39.984,44 3}
{0 CHEMBL617,1 9.44,2 38.1,3 38.1,4 1.036,5 1.119,6 0.699,7 0.676,8 396.48,9 4.8,10 5,11 42,13 10,14 28,16 44,17 16,20 10,21 6,22 5,24 16,25 10,26 2,28 2,29 6,31 2,32 26,35 14.3,36 0.159,37 7,38 35.5,39 43.505,40 46.999,41 29.364,42 28.393,44 4.824}
{0 CHEMBL65794,1 8.891,2 37.9,3 39.7,4 1.024,5 1.128,6 0.691,7 0.665,8 515.65,9 10.3,10 11,11 58,13 16,14 39,16 62,17 22,20 14,21 8,22 5,24 23,25 13,26 2,28 6,29 5,31 2,32 35,35 8.6,36 0.113,37 7,38 49.5,39 59.411,40 65.406,41 40.074,42 38.554,44 3.866}
{0 CHEMBL702,1 8.216,2 36.5,3 42.9,4 1.025,5 1.134,6 0.654,7 0.636,8 517.62,9 7.9,10 6,11 63,13 12,14 39,16 66,17 23,20 12,21 11,22 6,24 27,25 13,26 1,28 5,29 7,31 1,32 36,35 11.1,36 0.091,37 6,38 48,39 64.596,40 71.445,41 41.233,42 40.092,44 4.678}
{0 CHEMBL777,1 8.66,2 34.8,3 39.1,4 1.055,5 1.139,6 0.623,7 0.639,8 199.18,9 4.3,11 23,13 3,14 15,16 24,17 8,20 4,21 4,22 3,24 9,25 6,28 1,29 5,32 14,35 21.7,36 0.083,37 2,38 18,39 24.273,40 26.206,41 14.324,42 14.703,44 7.071}
{0 CHEMBL996,1 9.5,2 35.6,3 37.8,4 1.043,5 1.127,6 0.685,7 0.67,8 427.5,9 6.7,10 5,11 45,13 10,14 30,16 47,17 16,20 10,21 6,22 5,24 17,25 12,26 2,28 3,29 7,31 2,32 28,35 15.6,36 0.17,37 8,38 37.5,39 46.935,40 50.707,41 30.824,42 30.13,44 8}
