{
  "data_features": {
    "feature": [
      {
        "data_type": "nominal",
        "index": "0",
        "is_ignore": "false",
        "is_row_identifier": "true",
        "is_target": "false",
        "name": "molecule_id",
        "nominal_value": [
          "CHEMBL1076708",
          "CHEMBL1076723",
          "CHEMBL1076734",
          "CHEMBL1076743",
          "CHEMBL1077288",
          "CHEMBL1080382",
          "CHEMBL1080383",
          "CHEMBL1080384",
          "CHEMBL1080684",
          "CHEMBL1080685",
          "CHEMBL1080748",
          "CHEMBL1080863",
          "CHEMBL1080864",
          "CHEMBL1080865",
          "CHEMBL1080880",
          "CHEMBL1080881",
          "CHEMBL1081079",
          "CHEMBL1081080",
          "CHEMBL1081081",
          "CHEMBL1081101",
          "CHEMBL1081268",
          "CHEMBL1081269",
          "CHEMBL1081270",
          "CHEMBL1081271",
          "CHEMBL1081645",
          "CHEMBL1081646",
          "CHEMBL1081654",
          "CHEMBL1081655",
          "CHEMBL1082868",
          "CHEMBL1082869",
          "CHEMBL1083828",
          "CHEMBL1083841",
          "CHEMBL1084929",
          "CHEMBL1084930",
          "CHEMBL1085191",
          "CHEMBL1086157",
          "CHEMBL1086158",
          "CHEMBL1086170",
          "CHEMBL1086171",
          "CHEMBL1086172",
          "CHEMBL1087139",
          "CHEMBL1087140",
          "CHEMBL1087141",
          "CHEMBL1087142",
          "CHEMBL1087282",
          "CHEMBL1087651",
          "CHEMBL1087652",
          "CHEMBL1087664",
          "CHEMBL1087770",
          "CHEMBL1087771",
          "CHEMBL1087785",
          "CHEMBL1087909",
          "CHEMBL1087910",
          "CHEMBL1087911",
          "CHEMBL1088176",
          "CHEMBL1088177",
          "CHEMBL1088178",
          "CHEMBL1088819",
          "CHEMBL1088820",
          "CHEMBL1089004",
          "CHEMBL1089005",
          "CHEMBL1089127",
          "CHEMBL1089475",
          "CHEMBL1089557",
          "CHEMBL1089558",
          "CHEMBL1089564",
          "CHEMBL1089809",
          "CHEMBL1089810",
          "CHEMBL1090065",
          "CHEMBL1090066",
          "CHEMBL1090223",
          "CHEMBL1090422",
          "CHEMBL1090423",
          "CHEMBL1090673",
          "CHEMBL1090758",
          "CHEMBL1090782",
          "CHEMBL1090796",
          "CHEMBL1090819",
          "CHEMBL1090828",
          "CHEMBL1090829",
          "CHEMBL1091103",
          "CHEMBL1091630",
          "CHEMBL1092190",
          "CHEMBL1092191",
          "CHEMBL1092272",
          "CHEMBL1092284",
          "CHEMBL1092285",
          "CHEMBL1092286",
          "CHEMBL1092577",
          "CHEMBL1093424",
          "CHEMBL1093429",
          "CHEMBL1093573",
          "CHEMBL1093574",
          "CHEMBL1093686",
          "CHEMBL1093823",
          "CHEMBL1094192",
          "CHEMBL1094193",
          "CHEMBL1094213",
          "CHEMBL1094246",
          "CHEMBL1094247",
          "CHEMBL1094248",
          "CHEMBL1094491",
          "CHEMBL1094501",
          "CHEMBL1094502",
          "CHEMBL1094503",
          "CHEMBL1094699",
          "CHEMBL1094831",
          "CHEMBL1094834",
          "CHEMBL1094885",
          "CHEMBL1095152",
          "CHEMBL1095153",
          "CHEMBL1095833",
          "CHEMBL1095889",
          "CHEMBL1095987",
          "CHEMBL1095995",
          "CHEMBL1096146",
          "CHEMBL1096210",
          "CHEMBL1096211",
          "CHEMBL1096340",
          "CHEMBL1096478",
          "CHEMBL1096541",
          "CHEMBL1096542",
          "CHEMBL1096676",
          "CHEMBL1096786",
          "CHEMBL1096787",
          "CHEMBL1096788",
          "CHEMBL1096872",
          "CHEMBL1096873",
          "CHEMBL1097103",
          "CHEMBL1097182",
          "CHEMBL1097183",
          "CHEMBL1097184",
          "CHEMBL1097526",
          "CHEMBL1097527",
          "CHEMBL1097528",
          "CHEMBL1097529",
          "CHEMBL1097535",
          "CHEMBL1097536",
          "CHEMBL1097537",
          "CHEMBL1097800",
          "CHEMBL1097801",
          "CHEMBL1097802",
          "CHEMBL1097803",
          "CHEMBL1097807",
          "CHEMBL1097808",
          "CHEMBL1097809",
          "CHEMBL1097843",
          "CHEMBL1098013",
          "CHEMBL1098142",
          "CHEMBL1098143",
          "CHEMBL1098144",
          "CHEMBL1098200",
          "CHEMBL1098201",
          "CHEMBL1098202",
          "CHEMBL1098203",
          "CHEMBL1098356",
          "CHEMBL1098447",
          "CHEMBL1098448",
          "CHEMBL1098449",
          "CHEMBL1098450",
          "CHEMBL1098467",
          "CHEMBL1098484",
          "CHEMBL1098770",
          "CHEMBL1098771",
          "CHEMBL1098772",
          "CHEMBL1098811",
          "CHEMBL1099016",
          "CHEMBL112655",
          "CHEMBL113344",
          "CHEMBL114031",
          "CHEMBL114584",
          "CHEMBL114606",
          "CHEMBL114976",
          "CHEMBL115131",
          "CHEMBL115344",
          "CHEMBL115505",
          "CHEMBL115554",
          "CHEMBL115713",
          "CHEMBL115714",
          "CHEMBL115738",
          "CHEMBL115970",
          "CHEMBL1160958",
          "CHEMBL116140",
          "CHEMBL1161691",
          "CHEMBL1162057",
          "CHEMBL116953",
          "CHEMBL116981",
          "CHEMBL117007",
          "CHEMBL117031",
          "CHEMBL117130",
          "CHEMBL117403",
          "CHEMBL117569",
          "CHEMBL117715",
          "CHEMBL117723",
          "CHEMBL117910",
          "CHEMBL117973",
          "CHEMBL118068",
          "CHEMBL118265",
          "CHEMBL118508",
          "CHEMBL118783",
          "CHEMBL118815",
          "CHEMBL118860",
          "CHEMBL119110",
          "CHEMBL119116",
          "CHEMBL119233",
          "CHEMBL119239",
          "CHEMBL119256",
          "CHEMBL119257",
          "CHEMBL119349",
          "CHEMBL119354",
          "CHEMBL119382",
          "CHEMBL119413",
          "CHEMBL119440",
          "CHEMBL119516",
          "CHEMBL119562",
          "CHEMBL119760",
          "CHEMBL119873",
          "CHEMBL1221649",
          "CHEMBL1221650",
          "CHEMBL1299526",
          "CHEMBL1300662",
          "CHEMBL1301125",
          "CHEMBL1303810",
          "CHEMBL1309232",
          "CHEMBL131037",
          "CHEMBL1316334",
          "CHEMBL1319154",
          "CHEMBL1320243",
          "CHEMBL1331049",
          "CHEMBL1332070",
          "CHEMBL1332881",
          "CHEMBL1333510",
          "CHEMBL1334062",
          "CHEMBL1334984",
          "CHEMBL1337227",
          "CHEMBL1340619",
          "CHEMBL1340713",
          "CHEMBL1341200",
          "CHEMBL1341981",
          "CHEMBL1342332",
          "CHEMBL1343392",
          "CHEMBL1344225",
          "CHEMBL1349615",
          "CHEMBL1351890",
          "CHEMBL1354080",
          "CHEMBL1354895",
          "CHEMBL1361821",
          "CHEMBL1362307",
          "CHEMBL1362503",
          "CHEMBL1363676",
          "CHEMBL1364999",
          "CHEMBL1365696",
          "CHEMBL1367316",
          "CHEMBL1369594",
          "CHEMBL1369655",
          "CHEMBL1370681",
          "CHEMBL1370884",
          "CHEMBL1374788",
          "CHEMBL1375375",
          "CHEMBL1375597",
          "CHEMBL1377446",
          "CHEMBL1382558",
          "CHEMBL1384911",
          "CHEMBL1385784",
          "CHEMBL1390139",
          "CHEMBL1393906",
          "CHEMBL1393993",
          "CHEMBL1395016",
          "CHEMBL1396471",
          "CHEMBL1397874",
          "CHEMBL1402796",
          "CHEMBL1403642",
          "CHEMBL1409828",
          "CHEMBL1410897",
          "CHEMBL1412583",
          "CHEMBL1413076",
          "CHEMBL1413680",
          "CHEMBL1415555",
          "CHEMBL1419577",
          "CHEMBL1419836",
          "CHEMBL1419909",
          "CHEMBL1422092",
          "CHEMBL1423626",
          "CHEMBL1424562",
          "CHEMBL1424697",
          "CHEMBL1425921",
          "CHEMBL1426792",
          "CHEMBL1427987",
          "CHEMBL1429929",
          "CHEMBL1430895",
          "CHEMBL1432251",
          "CHEMBL1434471",
          "CHEMBL1436066",
          "CHEMBL1438636",
          "CHEMBL1439384",
          "CHEMBL1440300",
          "CHEMBL1442207",
          "CHEMBL1446971",
          "CHEMBL1447076",
          "CHEMBL1447306",
          "CHEMBL1449794",
          "CHEMBL1450393",
          "CHEMBL1451470",
          "CHEMBL1452694",
          "CHEMBL1455786",
          "CHEMBL1456255",
          "CHEMBL1459145",
          "CHEMBL1465592",
          "CHEMBL1467763",
          "CHEMBL1468847",
          "CHEMBL1472539",
          "CHEMBL1473443",
          "CHEMBL1480031",
          "CHEMBL1485010",
          "CHEMBL1485168",
          "CHEMBL1486546",
          "CHEMBL1486934",
          "CHEMBL1487635",
          "CHEMBL1492648",
          "CHEMBL1493442",
          "CHEMBL1496231",
          "CHEMBL1500227",
          "CHEMBL1501839",
          "CHEMBL1502358",
          "CHEMBL1503105",
          "CHEMBL1503962",
          "CHEMBL1507537",
          "CHEMBL1511831",
          "CHEMBL1511839",
          "CHEMBL1514981",
          "CHEMBL1521989",
          "CHEMBL1526855",
          "CHEMBL1529115",
          "CHEMBL1529188",
          "CHEMBL153064",
          "CHEMBL1530797",
          "CHEMBL1531320",
          "CHEMBL1533279",
          "CHEMBL1533401",
          "CHEMBL1535546",
          "CHEMBL1537481",
          "CHEMBL1537489",
          "CHEMBL1537907",
          "CHEMBL1539075",
          "CHEMBL1540377",
          "CHEMBL1540682",
          "CHEMBL1543295",
          "CHEMBL1544423",
          "CHEMBL1547643",
          "CHEMBL1550998",
          "CHEMBL1553396",
          "CHEMBL1558021",
          "CHEMBL1562579",
          "CHEMBL1563483",
          "CHEMBL1565208",
          "CHEMBL1566808",
          "CHEMBL1569585",
          "CHEMBL1570751",
          "CHEMBL1572001",
          "CHEMBL1576157",
          "CHEMBL1577139",
          "CHEMBL1580856",
          "CHEMBL1585527",
          "CHEMBL1589684",
          "CHEMBL1592119",
          "CHEMBL1592813",
          "CHEMBL1595015",
          "CHEMBL1595424",
          "CHEMBL1603615",
          "CHEMBL1604216",
          "CHEMBL1604434",
          "CHEMBL1605463",
          "CHEMBL1605956",
          "CHEMBL1607677",
          "CHEMBL1608392",
          "CHEMBL1610831",
          "CHEMBL1613578",
          "CHEMBL1651700",
          "CHEMBL1651701",
          "CHEMBL1651702",
          "CHEMBL1651703",
          "CHEMBL1651704",
          "CHEMBL1651705",
          "CHEMBL1651706",
          "CHEMBL1651707",
          "CHEMBL1651708",
          "CHEMBL1651709",
          "CHEMBL1651710",
          "CHEMBL1651711",
          "CHEMBL1651712",
          "CHEMBL1651713",
          "CHEMBL1651714",
          "CHEMBL1651715",
          "CHEMBL1651716",
          "CHEMBL1651717",
          "CHEMBL1651718",
          "CHEMBL1651719",
          "CHEMBL1651720",
          "CHEMBL1651850",
          "CHEMBL1651851",
          "CHEMBL1651852",
          "CHEMBL1651853",
          "CHEMBL1651854",
          "CHEMBL1651855",
          "CHEMBL1651856",
          "CHEMBL1651857",
          "CHEMBL1651858",
          "CHEMBL1651859",
          "CHEMBL1651860",
          "CHEMBL1651861",
          "CHEMBL1651862",
          "CHEMBL1651863",
          "CHEMBL1651864",
          "CHEMBL1651865",
          "CHEMBL1672550",
          "CHEMBL1672551",
          "CHEMBL1672552",
          "CHEMBL1672553",
          "CHEMBL1672554",
          "CHEMBL1672555",
          "CHEMBL1672556",
          "CHEMBL1672557",
          "CHEMBL1672558",
          "CHEMBL1672559",
          "CHEMBL1672560",
          "CHEMBL1672561",
          "CHEMBL1672562",
          "CHEMBL1672563",
          "CHEMBL1672564",
          "CHEMBL1672565",
          "CHEMBL1672566",
          "CHEMBL1672567",
          "CHEMBL1672568",
          "CHEMBL1672569",
          "CHEMBL1683041",
          "CHEMBL1683042",
          "CHEMBL1683043",
          "CHEMBL1683044",
          "CHEMBL1683045",
          "CHEMBL1683046",
          "CHEMBL1683047",
          "CHEMBL1683048",
          "CHEMBL1683049",
          "CHEMBL1683050",
          "CHEMBL1683051",
          "CHEMBL1720563",
          "CHEMBL1722064",
          "CHEMBL1723233",
          "CHEMBL1732549",
          "CHEMBL1734070",
          "CHEMBL1779732",
          "CHEMBL1779895",
          "CHEMBL1779911",
          "CHEMBL1797414",
          "CHEMBL1797499",
          "CHEMBL1797500",
          "CHEMBL1797501",
          "CHEMBL1797502",
          "CHEMBL1797503",
          "CHEMBL1797504",
          "CHEMBL1797505",
          "CHEMBL1797506",
          "CHEMBL1797507",
          "CHEMBL1797508",
          "CHEMBL1797509",
          "CHEMBL1797510",
          "CHEMBL181597",
          "CHEMBL1836169",
          "CHEMBL1836170",
          "CHEMBL1836171",
          "CHEMBL1836172",
          "CHEMBL1836212",
          "CHEMBL1836213",
          "CHEMBL1836214",
          "CHEMBL1836215",
          "CHEMBL183688",
          "CHEMBL183888",
          "CHEMBL183894",
          "CHEMBL184237",
          "CHEMBL184349",
          "CHEMBL184591",
          "CHEMBL184879",
          "CHEMBL185066",
          "CHEMBL185100",
          "CHEMBL185447",
          "CHEMBL185491",
          "CHEMBL186815",
          "CHEMBL186921",
          "CHEMBL187061",
          "CHEMBL187588",
          "CHEMBL187645",
          "CHEMBL187692",
          "CHEMBL187712",
          "CHEMBL188826",
          "CHEMBL188881",
          "CHEMBL190006",
          "CHEMBL190529",
          "CHEMBL190865",
          "CHEMBL1910653",
          "CHEMBL1910654",
          "CHEMBL1910655",
          "CHEMBL1910662",
          "CHEMBL1910674",
          "CHEMBL1910678",
          "CHEMBL1910680",
          "CHEMBL1910681",
          "CHEMBL1910687",
          "CHEMBL1910688",
          "CHEMBL1910689",
          "CHEMBL1910690",
          "CHEMBL1910691",
          "CHEMBL1910800",
          "CHEMBL1910803",
          "CHEMBL1916399",
          "CHEMBL1916400",
          "CHEMBL1916401",
          "CHEMBL1916402",
          "CHEMBL1916403",
          "CHEMBL1916404",
          "CHEMBL1916405",
          "CHEMBL1916406",
          "CHEMBL1916407",
          "CHEMBL1916408",
          "CHEMBL1916409",
          "CHEMBL1916410",
          "CHEMBL1916411",
          "CHEMBL1916553",
          "CHEMBL1916554",
          "CHEMBL1916555",
          "CHEMBL1916556",
          "CHEMBL1916557",
          "CHEMBL1916558",
          "CHEMBL1916559",
          "CHEMBL1916560",
          "CHEMBL1916561",
          "CHEMBL1916562",
          "CHEMBL1916563",
          "CHEMBL1916564",
          "CHEMBL1916565",
          "CHEMBL1916566",
          "CHEMBL1916567",
          "CHEMBL1916568",
          "CHEMBL1916569",
          "CHEMBL1916570",
          "CHEMBL1916571",
          "CHEMBL1916572",
          "CHEMBL1916573",
          "CHEMBL1916574",
          "CHEMBL1916575",
          "CHEMBL1916576",
          "CHEMBL1916577",
          "CHEMBL1916578",
          "CHEMBL1916579",
          "CHEMBL1916580",
          "CHEMBL1935575",
          "CHEMBL1935576",
          "CHEMBL1935577",
          "CHEMBL1935578",
          "CHEMBL1935579",
          "CHEMBL1935580",
          "CHEMBL1935581",
          "CHEMBL1935582",
          "CHEMBL1935583",
          "CHEMBL1935584",
          "CHEMBL1935585",
          "CHEMBL1935586",
          "CHEMBL1935587",
          "CHEMBL1935662",
          "CHEMBL1935663",
          "CHEMBL1935664",
          "CHEMBL1935665",
          "CHEMBL1935666",
          "CHEMBL193789",
          "CHEMBL1938922",
          "CHEMBL1938923",
          "CHEMBL1938924",
          "CHEMBL1938925",
          "CHEMBL1938926",
          "CHEMBL1938927",
          "CHEMBL1938928",
          "CHEMBL1938929",
          "CHEMBL1938930",
          "CHEMBL1938931",
          "CHEMBL1938932",
          "CHEMBL1938933",
          "CHEMBL1938934",
          "CHEMBL1938935",
          "CHEMBL1938936",
          "CHEMBL1938937",
          "CHEMBL1938938",
          "CHEMBL1938939",
          "CHEMBL1938940",
          "CHEMBL1938941",
          "CHEMBL1938942",
          "CHEMBL1938943",
          "CHEMBL1938944",
          "CHEMBL1938945",
          "CHEMBL1938946",
          "CHEMBL1938947",
          "CHEMBL1938948",
          "CHEMBL1938949",
          "CHEMBL1938950",
          "CHEMBL1938951",
          "CHEMBL1938952",
          "CHEMBL194419",
          "CHEMBL194578",
          "CHEMBL194898",
          "CHEMBL1949690",
          "CHEMBL195014",
          "CHEMBL195025",
          "CHEMBL1950480",
          "CHEMBL1950481",
          "CHEMBL1950482",
          "CHEMBL1950483",
          "CHEMBL1950484",
          "CHEMBL1950556",
          "CHEMBL1950557",
          "CHEMBL1950558",
          "CHEMBL1950559",
          "CHEMBL1950560",
          "CHEMBL1950561",
          "CHEMBL1950562",
          "CHEMBL1950563",
          "CHEMBL1950564",
          "CHEMBL1950565",
          "CHEMBL1950566",
          "CHEMBL1950567",
          "CHEMBL1950568",
          "CHEMBL1950569",
          "CHEMBL1950570",
          "CHEMBL1950571",
          "CHEMBL1950572",
          "CHEMBL1950573",
          "CHEMBL1950574",
          "CHEMBL1950575",
          "CHEMBL1951147",
          "CHEMBL1951148",
          "CHEMBL1951149",
          "CHEMBL1951150",
          "CHEMBL1951151",
          "CHEMBL1951152",
          "CHEMBL1951153",
          "CHEMBL1951154",
          "CHEMBL1951155",
          "CHEMBL1951156",
          "CHEMBL1951157",
          "CHEMBL1951158",
          "CHEMBL1951159",
          "CHEMBL1951303",
          "CHEMBL1951304",
          "CHEMBL1951305",
          "CHEMBL1951306",
          "CHEMBL1951307",
          "CHEMBL1951308",
          "CHEMBL1951309",
          "CHEMBL1951310",
          "CHEMBL1951311",
          "CHEMBL1951312",
          "CHEMBL1951313",
          "CHEMBL1951314",
          "CHEMBL1951315",
          "CHEMBL1951316",
          "CHEMBL1951317",
          "CHEMBL1951318",
          "CHEMBL1951319",
          "CHEMBL195141",
          "CHEMBL1951588",
          "CHEMBL196149",
          "CHEMBL196357",
          "CHEMBL196534",
          "CHEMBL197502",
          "CHEMBL1979747",
          "CHEMBL1981103",
          "CHEMBL1982477",
          "CHEMBL198415",
          "CHEMBL198976",
          "CHEMBL1993778",
          "CHEMBL199754",
          "CHEMBL199791",
          "CHEMBL1999049",
          "CHEMBL2000517",
          "CHEMBL2010813",
          "CHEMBL2011708",
          "CHEMBL2011709",
          "CHEMBL2011710",
          "CHEMBL2011711",
          "CHEMBL2011712",
          "CHEMBL2011713",
          "CHEMBL2011714",
          "CHEMBL2011715",
          "CHEMBL2011716",
          "CHEMBL2011717",
          "CHEMBL2011718",
          "CHEMBL2011719",
          "CHEMBL2011720",
          "CHEMBL2011721",
          "CHEMBL2011722",
          "CHEMBL2011723",
          "CHEMBL2011724",
          "CHEMBL2011725",
          "CHEMBL2011726",
          "CHEMBL2011727",
          "CHEMBL2011728",
          "CHEMBL2011729",
          "CHEMBL2011730",
          "CHEMBL2011731",
          "CHEMBL2011732",
          "CHEMBL2011733",
          "CHEMBL2011734",
          "CHEMBL2011735",
          "CHEMBL2011736",
          "CHEMBL2011737",
          "CHEMBL2011738",
          "CHEMBL2011739",
          "CHEMBL2011740",
          "CHEMBL2011741",
          "CHEMBL2011742",
          "CHEMBL2011743",
          "CHEMBL2011744",
          "CHEMBL2011745",
          "CHEMBL2011746",
          "CHEMBL2011747",
          "CHEMBL2011748",
          "CHEMBL2016597",
          "CHEMBL2017803",
          "CHEMBL2017804",
          "CHEMBL2017805",
          "CHEMBL2017806",
          "CHEMBL2017807",
          "CHEMBL2017808",
          "CHEMBL2017809",
          "CHEMBL2017810",
          "CHEMBL2017811",
          "CHEMBL2018174",
          "CHEMBL2018175",
          "CHEMBL2018176",
          "CHEMBL2018177",
          "CHEMBL2018178",
          "CHEMBL2018179",
          "CHEMBL2018306",
          "CHEMBL2018307",
          "CHEMBL2018308",
          "CHEMBL2018309",
          "CHEMBL2018310",
          "CHEMBL2018311",
          "CHEMBL2018312",
          "CHEMBL2018313",
          "CHEMBL2018314",
          "CHEMBL2018315",
          "CHEMBL2018316",
          "CHEMBL2018317",
          "CHEMBL2018318",
          "CHEMBL2018319",
          "CHEMBL2018320",
          "CHEMBL2018321",
          "CHEMBL2018322",
          "CHEMBL2018324",
          "CHEMBL2018325",
          "CHEMBL2018326",
          "CHEMBL2018327",
          "CHEMBL2018328",
          "CHEMBL2018329",
          "CHEMBL2018330",
          "CHEMBL2018454",
          "CHEMBL2018455",
          "CHEMBL2018456",
          "CHEMBL2018457",
          "CHEMBL2018458",
          "CHEMBL2018459",
          "CHEMBL2018460",
          "CHEMBL2018461",
          "CHEMBL2018462",
          "CHEMBL2018463",
          "CHEMBL2018464",
          "CHEMBL2018465",
          "CHEMBL2018466",
          "CHEMBL2018467",
          "CHEMBL2018468",
          "CHEMBL2018469",
          "CHEMBL2018470",
          "CHEMBL2018471",
          "CHEMBL2018472",
          "CHEMBL2018473",
          "CHEMBL2018474",
          "CHEMBL2018475",
          "CHEMBL2018476",
          "CHEMBL2018477",
          "CHEMBL2018478",
          "CHEMBL2018479",
          "CHEMBL2018480",
          "CHEMBL2018481",
          "CHEMBL2018482",
          "CHEMBL2018483",
          "CHEMBL2018484",
          "CHEMBL2018485",
          "CHEMBL2018486",
          "CHEMBL2018571",
          "CHEMBL2018572",
          "CHEMBL2018573",
          "CHEMBL2022704",
          "CHEMBL2022705",
          "CHEMBL2022706",
          "CHEMBL2022707",
          "CHEMBL2022708",
          "CHEMBL2022899",
          "CHEMBL2022900",
          "CHEMBL2022901",
          "CHEMBL2022902",
          "CHEMBL2022903",
          "CHEMBL2022904",
          "CHEMBL2022905",
          "CHEMBL2022906",
          "CHEMBL2022907",
          "CHEMBL2022908",
          "CHEMBL2022909",
          "CHEMBL2022910",
          "CHEMBL2022911",
          "CHEMBL2022912",
          "CHEMBL2022913",
          "CHEMBL2022914",
          "CHEMBL2022915",
          "CHEMBL2022916",
          "CHEMBL2022917",
          "CHEMBL2032300",
          "CHEMBL2032301",
          "CHEMBL2032302",
          "CHEMBL2032303",
          "CHEMBL2032304",
          "CHEMBL2032305",
          "CHEMBL2032306",
          "CHEMBL2032307",
          "CHEMBL2032308",
          "CHEMBL2032309",
          "CHEMBL2032310",
          "CHEMBL2032311",
          "CHEMBL2032312",
          "CHEMBL2032313",
          "CHEMBL2032314",
          "CHEMBL2032315",
          "CHEMBL2032316",
          "CHEMBL2032317",
          "CHEMBL2032318",
          "CHEMBL2032428",
          "CHEMBL2032429",
          "CHEMBL2032430",
          "CHEMBL2032431",
          "CHEMBL2032432",
          "CHEMBL2032433",
          "CHEMBL2032434",
          "CHEMBL2032435",
          "CHEMBL2032436",
          "CHEMBL2032437",
          "CHEMBL2032438",
          "CHEMBL2032439",
          "CHEMBL2032440",
          "CHEMBL2032441",
          "CHEMBL203475",
          "CHEMBL2037118",
          "CHEMBL2037119",
          "CHEMBL2037120",
          "CHEMBL2037121",
          "CHEMBL2037122",
          "CHEMBL2037123",
          "CHEMBL2037124",
          "CHEMBL2037125",
          "CHEMBL2037126",
          "CHEMBL2037127",
          "CHEMBL2037128",
          "CHEMBL2037129",
          "CHEMBL2037130",
          "CHEMBL2037131",
          "CHEMBL2037132",
          "CHEMBL2048287",
          "CHEMBL2048288",
          "CHEMBL2048289",
          "CHEMBL2048290",
          "CHEMBL2048291",
          "CHEMBL2048292",
          "CHEMBL2048293",
          "CHEMBL2048294",
          "CHEMBL2048295",
          "CHEMBL2048296",
          "CHEMBL2048297",
          "CHEMBL2048298",
          "CHEMBL2057232",
          "CHEMBL2057282",
          "CHEMBL2057283",
          "CHEMBL2057284",
          "CHEMBL2057285",
          "CHEMBL2057286",
          "CHEMBL2057287",
          "CHEMBL2057288",
          "CHEMBL2059515",
          "CHEMBL2059516",
          "CHEMBL2059517",
          "CHEMBL2059518",
          "CHEMBL2059519",
          "CHEMBL2059520",
          "CHEMBL2059521",
          "CHEMBL2059522",
          "CHEMBL2059523",
          "CHEMBL2059524",
          "CHEMBL2059525",
          "CHEMBL2059526",
          "CHEMBL2059527",
          "CHEMBL2059528",
          "CHEMBL2059529",
          "CHEMBL2059663",
          "CHEMBL2059664",
          "CHEMBL2059665",
          "CHEMBL2059666",
          "CHEMBL2059667",
          "CHEMBL2059668",
          "CHEMBL2059669",
          "CHEMBL2059670",
          "CHEMBL2059671",
          "CHEMBL2059672",
          "CHEMBL2059673",
          "CHEMBL2059674",
          "CHEMBL2059675",
          "CHEMBL2059676",
          "CHEMBL2059677",
          "CHEMBL2059678",
          "CHEMBL2059679",
          "CHEMBL2059680",
          "CHEMBL2059681",
          "CHEMBL2059682",
          "CHEMBL2059683",
          "CHEMBL2059684",
          "CHEMBL2059685",
          "CHEMBL2059686",
          "CHEMBL2059687",
          "CHEMBL2059688",
          "CHEMBL2059689",
          "CHEMBL206939",
          "CHEMBL206940",
          "CHEMBL2070836",
          "CHEMBL2070837",
          "CHEMBL207275",
          "CHEMBL207580",
          "CHEMBL207716",
          "CHEMBL207881",
          "CHEMBL208168",
          "CHEMBL208224",
          "CHEMBL208648",
          "CHEMBL208682",
          "CHEMBL208718",
          "CHEMBL208786",
          "CHEMBL208838",
          "CHEMBL208875",
          "CHEMBL208897",
          "CHEMBL208898",
          "CHEMBL208924",
          "CHEMBL209003",
          "CHEMBL209008",
          "CHEMBL209076",
          "CHEMBL209484",
          "CHEMBL209536",
          "CHEMBL209566",
          "CHEMBL209567",
          "CHEMBL209778",
          "CHEMBL209988",
          "CHEMBL210038",
          "CHEMBL210224",
          "CHEMBL210257",
          "CHEMBL210301",
          "CHEMBL210316",
          "CHEMBL210345",
          "CHEMBL210352",
          "CHEMBL210468",
          "CHEMBL210520",
          "CHEMBL210694",
          "CHEMBL210695",
          "CHEMBL210782",
          "CHEMBL210785",
          "CHEMBL210797",
          "CHEMBL210841",
          "CHEMBL210855",
          "CHEMBL210936",
          "CHEMBL210942",
          "CHEMBL211006",
          "CHEMBL211046",
          "CHEMBL211081",
          "CHEMBL211199",
          "CHEMBL211228",
          "CHEMBL211255",
          "CHEMBL2113260",
          "CHEMBL211407",
          "CHEMBL211505",
          "CHEMBL211689",
          "CHEMBL211806",
          "CHEMBL211826",
          "CHEMBL212266",
          "CHEMBL212420",
          "CHEMBL212580",
          "CHEMBL213580",
          "CHEMBL2178809",
          "CHEMBL2178810",
          "CHEMBL2178811",
          "CHEMBL2178812",
          "CHEMBL2178813",
          "CHEMBL2178814",
          "CHEMBL2178815",
          "CHEMBL218445",
          "CHEMBL218446",
          "CHEMBL2207769",
          "CHEMBL2207770",
          "CHEMBL2207771",
          "CHEMBL2207773",
          "CHEMBL2207774",
          "CHEMBL2207775",
          "CHEMBL2207776",
          "CHEMBL2207777",
          "CHEMBL2207778",
          "CHEMBL2207779",
          "CHEMBL2207780",
          "CHEMBL2207781",
          "CHEMBL2207782",
          "CHEMBL2207783",
          "CHEMBL2207784",
          "CHEMBL2207785",
          "CHEMBL2207786",
          "CHEMBL2207787",
          "CHEMBL2207788",
          "CHEMBL2207790",
          "CHEMBL2207791",
          "CHEMBL2207792",
          "CHEMBL2207793",
          "CHEMBL224005",
          "CHEMBL224549",
          "CHEMBL224571",
          "CHEMBL224599",
          "CHEMBL224623",
          "CHEMBL224703",
          "CHEMBL224720",
          "CHEMBL224799",
          "CHEMBL224800",
          "CHEMBL224853",
          "CHEMBL225155",
          "CHEMBL225575",
          "CHEMBL226612",
          "CHEMBL227371",
          "CHEMBL227530",
          "CHEMBL227851",
          "CHEMBL228049",
          "CHEMBL228102",
          "CHEMBL228103",
          "CHEMBL228137",
          "CHEMBL228138",
          "CHEMBL228139",
          "CHEMBL2311582",
          "CHEMBL2315814",
          "CHEMBL2315815",
          "CHEMBL2315816",
          "CHEMBL2315817",
          "CHEMBL2315818",
          "CHEMBL2315819",
          "CHEMBL2315820",
          "CHEMBL2315821",
          "CHEMBL2315822",
          "CHEMBL2336061",
          "CHEMBL2336062",
          "CHEMBL2336063",
          "CHEMBL2336064",
          "CHEMBL2336065",
          "CHEMBL2336066",
          "CHEMBL2336067",
          "CHEMBL2336068",
          "CHEMBL2336069",
          "CHEMBL2336070",
          "CHEMBL2336071",
          "CHEMBL2336072",
          "CHEMBL2336073",
          "CHEMBL2336074",
          "CHEMBL2336075",
          "CHEMBL2336076",
          "CHEMBL2336077",
          "CHEMBL2336078",
          "CHEMBL2336079",
          "CHEMBL2336080",
          "CHEMBL2336081",
          "CHEMBL2336082",
          "CHEMBL2336083",
          "CHEMBL2336084",
          "CHEMBL2336085",
          "CHEMBL2336086",
          "CHEMBL2336087",
          "CHEMBL2336088",
          "CHEMBL2336089",
          "CHEMBL2336090",
          "CHEMBL2336091",
          "CHEMBL239650",
          "CHEMBL239653",
          "CHEMBL239659",
          "CHEMBL239867",
          "CHEMBL239868",
          "CHEMBL239873",
          "CHEMBL239874",
          "CHEMBL239876",
          "CHEMBL240078",
          "CHEMBL240079",
          "CHEMBL241050",
          "CHEMBL241052",
          "CHEMBL241104",
          "CHEMBL241147",
          "CHEMBL247698",
          "CHEMBL247699",
          "CHEMBL247766",
          "CHEMBL247901",
          "CHEMBL277377",
          "CHEMBL314854",
          "CHEMBL323617",
          "CHEMBL324358",
          "CHEMBL324820",
          "CHEMBL325050",
          "CHEMBL325193",
          "CHEMBL325198",
          "CHEMBL325247",
          "CHEMBL325408",
          "CHEMBL326346",
          "CHEMBL331054",
          "CHEMBL332050",
          "CHEMBL332373",
          "CHEMBL332472",
          "CHEMBL332667",
          "CHEMBL333335",
          "CHEMBL334038",
          "CHEMBL334144",
          "CHEMBL334213",
          "CHEMBL334955",
          "CHEMBL358644",
          "CHEMBL359762",
          "CHEMBL361915",
          "CHEMBL363008",
          "CHEMBL363076",
          "CHEMBL364899",
          "CHEMBL364950",
          "CHEMBL366181",
          "CHEMBL366208",
          "CHEMBL371670",
          "CHEMBL371743",
          "CHEMBL371758",
          "CHEMBL371985",
          "CHEMBL372066",
          "CHEMBL374614",
          "CHEMBL375488",
          "CHEMBL377181",
          "CHEMBL377339",
          "CHEMBL377637",
          "CHEMBL377767",
          "CHEMBL377828",
          "CHEMBL377855",
          "CHEMBL377968",
          "CHEMBL378054",
          "CHEMBL378061",
          "CHEMBL378300",
          "CHEMBL378436",
          "CHEMBL378562",
          "CHEMBL378970",
          "CHEMBL379310",
          "CHEMBL379380",
          "CHEMBL379556",
          "CHEMBL379589",
          "CHEMBL379612",
          "CHEMBL379660",
          "CHEMBL380040",
          "CHEMBL380235",
          "CHEMBL380253",
          "CHEMBL381872",
          "CHEMBL382739",
          "CHEMBL389012",
          "CHEMBL389033",
          "CHEMBL389880",
          "CHEMBL391581",
          "CHEMBL391869",
          "CHEMBL391870",
          "CHEMBL392155",
          "CHEMBL393055",
          "CHEMBL396365",
          "CHEMBL396846",
          "CHEMBL396847",
          "CHEMBL397080",
          "CHEMBL397081",
          "CHEMBL399392",
          "CHEMBL421234",
          "CHEMBL422074",
          "CHEMBL423691",
          "CHEMBL424254",
          "CHEMBL425058",
          "CHEMBL425428",
          "CHEMBL425563",
          "CHEMBL425602",
          "CHEMBL426191",
          "CHEMBL426688",
          "CHEMBL427221",
          "CHEMBL429810",
          "CHEMBL432067",
          "CHEMBL432632",
          "CHEMBL432809",
          "CHEMBL432813",
          "CHEMBL433593",
          "CHEMBL441826",
          "CHEMBL444799",
          "CHEMBL46874",
          "CHEMBL470511",
          "CHEMBL473016",
          "CHEMBL473156",
          "CHEMBL473237",
          "CHEMBL473238",
          "CHEMBL473269",
          "CHEMBL473360",
          "CHEMBL473562",
          "CHEMBL473563",
          "CHEMBL474407",
          "CHEMBL474418",
          "CHEMBL474688",
          "CHEMBL474689",
          "CHEMBL475247",
          "CHEMBL475253",
          "CHEMBL475405",
          "CHEMBL475495",
          "CHEMBL514170",
          "CHEMBL514189",
          "CHEMBL514302",
          "CHEMBL515603",
          "CHEMBL515917",
          "CHEMBL515921",
          "CHEMBL516035",
          "CHEMBL516380",
          "CHEMBL518292",
          "CHEMBL51931",
          "CHEMBL537632",
          "CHEMBL537849",
          "CHEMBL541890",
          "CHEMBL544665",
          "CHEMBL579318",
          "CHEMBL582739",
          "CHEMBL586135",
          "CHEMBL589402",
          "CHEMBL589403",
          "CHEMBL590134",
          "CHEMBL590135",
          "CHEMBL590383",
          "CHEMBL590384",
          "CHEMBL591102",
          "CHEMBL596052",
          "CHEMBL596053",
          "CHEMBL600762",
          "CHEMBL601062",
          "CHEMBL601701",
          "CHEMBL603441",
          "CHEMBL603442",
          "CHEMBL607829",
          "CHEMBL610198",
          "CHEMBL91283"
        ],
        "number_of_missing_values": "0"
      },
      {
        "data_type": "numeric",
        "index": "1",
        "is_ignore": "false",
        "is_row_identifier": "false",
        "is_target": "false",
        "name": "AMW",
        "number_of_missing_values": "0"
      },
      {
        "data_type": "numeric",
        "index": "2",
        "is_ignore": "false",
        "is_row_identifier": "false",
        "is_target": "false",
        "name": "C.",
        "number_of_missing_values": "0"
      },
      {
        "data_type": "numeric",
        "index": "3",
        "is_ignore": "false",
        "is_row_identifier": "false",
        "is_target": "false",
        "name": "H.",
        "number_of_missing_values": "0"
      },
      {
        "data_type": "numeric",
        "index": "4",
        "is_ignore": "false",
        "is_row_identifier": "false",
        "is_target": "false",
        "name": "Me",
        "number_of_missing_values": "0"
      },
      {
        "data_type": "numeric",
        "index": "5",
        "is_ignore": "false",
        "is_row_identifier": "false",
        "is_target": "false",
        "name": "Mi",
        "number_of_missing_values": "0"
      },
      {
        "data_type": "numeric",
        "index": "6",
        "is_ignore": "false",
        "is_row_identifier": "false",
        "is_target": "false",
        "name": "Mp",
        "number_of_missing_values": "0"
      },
      {
        "data_type": "numeric",
        "index": "7",
        "is_ignore": "false",
        "is_row_identifier": "false",
        "is_target": "false",
        "name": "Mv",
        "number_of_missing_values": "0"
      },
      {
        "data_type": "numeric",
        "index": "8",
        "is_ignore": "false",
        "is_row_identifier": "false",
        "is_target": "false",
        "name": "MW",
        "number_of_missing_values": "0"
      },
      {
        "data_type": "numeric",
        "index": "9",
        "is_ignore": "false",
        "is_row_identifier": "false",
        "is_target": "false",
        "name": "N.",
        "number_of_missing_values": "0"
      },
      {
        "data_type": "string",
        "index": "10",
        "is_ignore": "false",
        "is_row_identifier": "false",
        "is_target": "false",
        "name": "nAB",
        "number_of_missing_values": "0"
      },
      {
        "data_type": "string",
        "index": "11",
        "is_ignore": "false",
        "is_row_identifier": "false",
        "is_target": "false",
        "name": "nAT",
        "number_of_missing_values": "0"
      },
      {
        "data_type": "string",
        "index": "12",
        "is_ignore": "false",
        "is_row_identifier": "false",
        "is_target": "false",
        "name": "nB",
        "number_of_missing_values": "0"
      },
      {
        "data_type": "string",
        "index": "13",
        "is_ignore": "false",
        "is_row_identifier": "false",
        "is_target": "false",
        "name": "nBM",
        "number_of_missing_values": "0"
      },
      {
        "data_type": "string",
        "index": "14",
        "is_ignore": "false",
        "is_row_identifier": "false",
        "is_target": "false",
        "name": "nBO",
        "number_of_missing_values": "0"
      },
      {
        "data_type": "string",
        "index": "15",
        "is_ignore": "false",
        "is_row_identifier": "false",
        "is_target": "false",
        "name": "nBR",
        "number_of_missing_values": "0"
      },
      {
        "data_type": "string",
        "index": "16",
        "is_ignore": "false",
        "is_row_identifier": "false",
        "is_target": "false",
        "name": "nBT",
        "number_of_missing_values": "0"
      },
      {
        "data_type": "string",
        "index": "17",
        "is_ignore": "false",
        "is_row_identifier": "false",
        "is_target": "false",
        "name": "nC",
        "number_of_missing_values": "0"
      },
      {
        "data_type": "string",
        "index": "18",
        "is_ignore": "false",
        "is_row_identifier": "false",
        "is_target": "false",
        "name": "nCL",
        "number_of_missing_values": "0"
      },
      {
        "data_type": "string",
        "index": "19",
        "is_ignore": "false",
        "is_row_identifier": "false",
        "is_target": "false",
        "name": "nCsp",
        "number_of_missing_values": "0"
      },
      {
        "data_type": "string",
        "index": "20",
        "is_ignore": "false",
        "is_row_identifier": "false",
        "is_target": "false",
        "name": "nCsp2",
        "number_of_missing_values": "0"
      },
      {
        "data_type": "string",
        "index": "21",
        "is_ignore": "false",
        "is_row_identifier": "false",
        "is_target": "false",
        "name": "nCsp3",
        "number_of_missing_values": "0"
      },
      {
        "data_type": "string",
        "index": "22",
        "is_ignore": "false",
        "is_row_identifier": "false",
        "is_target": "false",
        "name": "nDB",
        "number_of_missing_values": "0"
      },
      {
        "data_type": "string",
        "index": "23",
        "is_ignore": "false",
        "is_row_identifier": "false",
        "is_target": "false",
        "name": "nF",
        "number_of_missing_values": "0"
      },
      {
        "data_type": "string",
        "index": "24",
        "is_ignore": "false",
        "is_row_identifier": "false",
        "is_target": "false",
        "name": "nH",
        "number_of_missing_values": "0"
      },
      {
        "data_type": "string",
        "index": "25",
        "is_ignore": "false",
        "is_row_identifier": "false",
        "is_target": "false",
        "name": "nHet",
        "number_of_missing_values": "0"
      },
      {
        "data_type": "string",
        "index": "26",
        "is_ignore": "false",
        "is_row_identifier": "false",
        "is_target": "false",
        "name": "nHM",
        "number_of_missing_values": "0"
      },
      {
        "data_type": "string",
        "index": "27",
        "is_ignore": "false",
        "is_row_identifier": "false",
        "is_target": "false",
        "name": "nI",
        "number_of_missing_values": "0"
      },
      {
        "data_type": "string",
        "index": "28",
        "is_ignore": "false",
        "is_row_identifier": "false",
        "is_target": "false",
        "name": "nN",
        "number_of_missing_values": "0"
      },
      {
        "data_type": "string",
        "index": "29",
        "is_ignore": "false",
        "is_row_identifier": "false",
        "is_target": "false",
        "name": "nO",
        "number_of_missing_values": "0"
      },
      {
        "data_type": "string",
        "index": "30",
        "is_ignore": "false",
        "is_row_identifier": "false",
        "is_target": "false",
        "name": "nP",
        "number_of_missing_values": "0"
      },
      {
        "data_type": "string",
        "index": "31",
        "is_ignore": "false",
        "is_row_identifier": "false",
        "is_target": "false",
        "name": "nS",
        "number_of_missing_values": "0"
      },
      {
        "data_type": "string",
        "index": "32",
        "is_ignore": "false",
        "is_row_identifier": "false",
        "is_target": "false",
        "name": "nSK",
        "number_of_missing_values": "0"
      },
      {
        "data_type": "string",
        "index": "33",
        "is_ignore": "false",
        "is_row_identifier": "false",
        "is_target": "false",
        "name": "nTB",
        "number_of_missing_values": "0"
      },
      {
        "data_type": "string",
        "index": "34",
        "is_ignore": "false",
        "is_row_identifier": "false",
        "is_target": "false",
        "name": "nX",
        "number_of_missing_values": "0"
      },
      {
        "data_type": "numeric",
        "index": "35",
        "is_ignore": "false",
        "is_row_identifier": "false",
        "is_target": "false",
        "name": "O.",
        "number_of_missing_values": "0"
      },
      {
        "data_type": "numeric",
        "index": "36",
        "is_ignore": "false",
        "is_row_identifier": "false",
        "is_target": "false",
        "name": "RBF",
        "number_of_missing_values": "0"
      },
      {
        "data_type": "string",
        "index": "37",
        "is_ignore": "false",
        "is_row_identifier": "false",
        "is_target": "false",
        "name": "RBN",
        "number_of_missing_values": "0"
      },
      {
        "data_type": "numeric",
        "index": "38",
        "is_ignore": "false",
        "is_row_identifier": "false",
        "is_target": "false",
        "name": "SCBO",
        "number_of_missing_values": "0"
      },
      {
        "data_type": "numeric",
        "index": "39",
        "is_ignore": "false",
        "is_row_identifier": "false",
        "is_target": "false",
        "name": "Se",
        "number_of_missing_values": "0"
      },
      {
        "data_type": "numeric",
        "index": "40",
        "is_ignore": "false",
        "is_row_identifier": "false",
        "is_target": "false",
        "name": "Si",
        "number_of_missing_values": "0"
      },
      {
        "data_type": "numeric",
        "index": "41",
        "is_ignore": "false",
        "is_row_identifier": "false",
        "is_target": "false",
        "name": "Sp",
        "number_of_missing_values": "0"
      },
      {
        "data_type": "numeric",
        "index": "42",
        "is_ignore": "false",
        "is_row_identifier": "false",
        "is_target": "false",
        "name": "Sv",
        "number_of_missing_values": "0"
      },
      {
        "data_type": "numeric",
        "index": "43",
        "is_ignore": "false",
        "is_row_identifier": "false",
        "is_target": "false",
        "name": "X.",
        "number_of_missing_values": "0"
      },
      {
        "data_type": "numeric",
        "index": "44",
        "is_ignore": "false",
        "is_row_identifier": "false",
        "is_target": "true",
        "name": "pXC50",
        "number_of_missing_values": "0"
      }
    ]
  }
}