"molecule_id","O.","RBF","pXC50"
{1 9.3,2 0.111,3 6.857}
{0 CHEMBL159325,1 12.8,2 0.122,3 7.432}
{0 CHEMBL163614,1 12.8,2 0.122,3 5.963}
{0 CHEMBL164409,1 8.9,2 0.106,3 5.252}
{0 CHEMBL1790051,1 5,2 0.071,3 5.921}
{0 CHEMBL269538,1 3.6,2 0.033,3 5}
{0 CHEMBL295234,3 5}
{0 CHEMBL302855,1 4.8,2 0.068,3 6.717}
{0 CHEMBL338115,1 3.3,2 0.031,3 5}
{0 CHEMBL348799,1 8.5,2 0.102,3 4.199}
{0 CHEMBL350155,1 8.5,2 0.102,3 5.684}
{0 CHEMBL60609,1 9.5,2 0.091,3 6.768}
{0 CHEMBL62608,1 13.6,2 0.109,3 4.959}
