{
  "data_set_description": {
    "collection_date": "November 2013",
    "creator": "Dr Jeremy Besnard, Dr Ivan Olier, Dr Noureddin Sadawi, Dr Larisa Soldatova, Dr Crina Grosan, Prof Ross King, Dr Richard Bickerton, Prof Andrew Hopkins and Dr Willem van Hoorn",
    "default_target_attribute": "pXC50",
    "description": "This dataset contains QSAR data (from ChEMBL version 17) showing activity values (unit is pseudo-pCI50) of several compounds on drug target ChEMBL_ID: CHEMBL342 (TID: 17142), and it has 20 rows and 43 features (not including molecule IDs and class feature: molecule_id and pXC50). The features represent Basic Molecular Descriptors which were generated from SMILES strings.  Missing value imputation was applied to this dataset (By choosing the Median).",
    "description_version": "1",
    "file_id": "3627535",
    "format": "ARFF",
    "id": "38044",
    "licence": "Public",
    "md5_checksum": "1f2edbd5921eb8a3f865cfd377e00925",
    "minio_url": "https://data.openml.org/datasets/0003/38044/dataset_38044.pq",
    "name": "QSAR-DATASET-FOR-DRUG-TARGET-CHEMBL342",
    "original_data_url": "https://www.ebi.ac.uk/chembl/target/inspect/CHEMBL342",
    "parquet_url": "https://data.openml.org/datasets/0003/38044/dataset_38044.pq",
    "processing_date": "2018-10-04 05:48:06",
    "row_id_attribute": "molecule_id",
    "status": "deactivated",
    "tag": [
      "MetaQSAR",
      "study_13"
    ],
    "upload_date": "2016-07-16T02:44:52",
    "url": "https://api.openml.org/data/v1/download/3627535/QSAR-DATASET-FOR-DRUG-TARGET-CHEMBL342.arff",
    "version": "11",
    "visibility": "public"
  }
}