"molecule_id","AMW","C.","H.","Me","Mi","Mp","Mv","MW","N.","nAB","nAT","nB","nBM","nBO","nBR","nBT","nC","nCL","nCsp","nCsp2","nCsp3","nDB","nF","nH","nHet","nHM","nI","nN","nO","nP","nS","nSK","nTB","nX","O.","RBF","RBN","SCBO","Se","Si","Sp","Sv","X.","pXC50"
{1 5.324,2 25.7,3 62.9,4 0.982,5 1.164,6 0.568,7 0.509,8 186.35,9 11.4,11 35,13 1,14 12,16 34,17 9,20 1,21 8,22 1,24 22,25 4,28 4,32 13,36 0.235,37 8,38 13,39 34.36,40 40.73,41 19.875,42 17.827,44 6.26}
{0 CHEMBL101802,1 5.336,2 25.6,3 62.8,4 0.982,5 1.164,6 0.568,7 0.509,8 229.43,9 11.6,11 43,13 1,14 15,16 42,17 11,20 1,21 10,22 1,24 27,25 5,28 5,32 16,36 0.262,37 11,38 16,39 42.229,40 50.059,41 24.404,42 21.902,44 4}
{0 CHEMBL101996,1 6.01,2 22.6,3 58.1,4 0.997,5 1.177,6 0.568,7 0.525,8 186.31,9 19.4,11 31,13 2,14 12,16 30,17 7,20 2,21 5,22 2,24 18,25 6,28 6,32 13,36 0.267,37 8,38 14,39 30.912,40 36.481,41 17.603,42 16.289,44 5.167}
{0 CHEMBL102276,1 5.389,2 27.3,3 62.1,4 0.981,5 1.16,6 0.576,7 0.517,8 355.66,9 10.6,11 66,13 2,14 24,16 65,17 18,20 2,21 16,22 2,24 41,25 7,28 7,32 25,36 0.308,37 20,38 26,39 64.734,40 76.547,41 37.984,42 34.105,44 5.456}
{0 CHEMBL102323,1 5.273,2 26.3,3 63.2,4 0.98,5 1.162,6 0.569,7 0.509,8 200.38,9 10.5,11 38,13 1,14 13,16 37,17 10,20 1,21 9,22 1,24 24,25 4,28 4,32 14,36 0.243,37 9,38 14,39 37.243,40 44.145,41 21.637,42 19.354,44 5.046}
{0 CHEMBL102329,1 5.796,2 23.8,3 59.5,4 0.992,5 1.172,6 0.569,7 0.521,8 243.42,9 16.7,11 42,13 2,14 16,16 41,17 10,20 2,21 8,22 2,24 25,25 7,28 7,32 17,36 0.293,37 12,38 18,39 41.665,40 49.225,41 23.893,42 21.891,44 5.495}
{0 CHEMBL102487,1 5.794,2 24.3,3 59.5,4 0.991,5 1.171,6 0.571,7 0.523,8 214.37,9 16.2,11 37,13 2,14 14,16 36,17 9,20 2,21 7,22 2,24 22,25 6,28 6,32 15,36 0.278,37 10,38 16,39 36.68,40 43.311,41 21.125,42 19.343,44 5.469}
{0 CHEMBL102924,1 5.779,2 28.2,3 59,4 0.986,5 1.16,6 0.587,7 0.535,8 225.39,9 12.8,11 39,13 2,14 15,16 38,17 11,19 1,20 1,21 9,22 1,24 23,25 5,28 5,32 16,33 1,36 0.289,37 11,38 18,39 38.461,40 45.228,41 22.881,42 20.848,44 4.018}
{0 CHEMBL102939,1 5.192,2 27.3,3 63.6,4 0.978,5 1.159,6 0.572,7 0.509,8 285.55,9 9.1,11 55,13 1,14 19,16 54,17 15,20 1,21 14,22 1,24 35,25 5,28 5,32 20,36 0.278,37 15,38 20,39 53.763,40 63.72,41 31.45,42 28.009,44 6.523}
{0 CHEMBL102951,1 5.656,2 25,3 60.4,4 0.988,5 1.168,6 0.571,7 0.52,8 271.48,9 14.6,11 48,13 2,14 18,16 47,17 12,20 2,21 10,22 2,24 29,25 7,28 7,32 19,36 0.298,37 14,38 20,39 47.432,40 56.055,41 27.415,42 24.945,44 4.42}
{0 CHEMBL103266,1 5.255,2 26.5,3 63.3,4 0.98,5 1.161,6 0.57,7 0.509,8 257.49,9 10.2,11 49,13 1,14 17,16 48,17 13,20 1,21 12,22 1,24 31,25 5,28 5,32 18,36 0.271,37 13,38 18,39 47.996,40 56.889,41 27.927,42 24.955,44 4.131}
{0 CHEMBL103489,1 5.548,2 23.1,3 61.5,4 0.989,5 1.172,6 0.561,7 0.509,8 144.26,9 15.4,11 26,13 1,14 9,16 25,17 6,20 1,21 5,22 1,24 16,25 4,28 4,32 10,36 0.2,37 5,38 10,39 25.709,40 30.484,41 14.591,42 13.246,44 4.538}
{0 CHEMBL103613,1 5.442,2 24.3,3 62.2,4 0.985,5 1.168,6 0.564,7 0.509,8 201.37,9 13.5,11 37,13 1,14 13,16 36,17 9,20 1,21 8,22 1,24 23,25 5,28 5,32 14,36 0.25,37 9,38 14,39 36.461,40 43.228,41 20.881,42 18.848,44 6.796}
{0 CHEMBL103941,1 5.46,2 26.7,3 61.7,4 0.983,5 1.162,6 0.574,7 0.518,8 327.6,9 11.7,11 60,13 2,14 22,16 59,17 16,20 2,21 14,22 2,24 37,25 7,28 7,32 23,36 0.305,37 18,38 24,39 58.967,40 69.716,41 34.461,42 31.052,44 7.097}
{0 CHEMBL105338,1 5.141,2 27.9,3 63.9,4 0.976,5 1.157,6 0.573,7 0.509,8 313.61,9 8.2,11 61,13 1,14 21,16 60,17 17,20 1,21 16,22 1,24 39,25 5,28 5,32 22,36 0.283,37 17,38 22,39 59.53,40 70.55,41 34.972,42 31.063,44 4.886}
{0 CHEMBL105647,1 6.181,2 22.9,3 57.1,4 1.004,5 1.174,6 0.566,7 0.529,8 216.34,9 17.1,11 35,13 2,14 14,16 34,17 8,20 2,21 6,22 2,24 20,25 7,28 6,29 1,32 15,35 2.9,36 0.294,37 10,38 16,39 35.123,40 41.106,41 19.819,42 18.531,44 5.097}
{0 CHEMBL105951,1 5.81,2 23.3,3 60,4 0.997,5 1.17,6 0.56,7 0.516,8 174.29,9 13.3,11 30,13 1,14 11,16 29,17 7,20 1,21 6,22 1,24 18,25 5,28 4,29 1,32 12,35 3.3,36 0.241,37 7,38 12,39 29.92,40 35.109,41 16.807,42 15.488,44 6.155}
{0 CHEMBL106009,1 6.64,2 22.9,3 57.1,4 0.996,5 1.166,6 0.6,7 0.543,8 232.41,9 17.1,11 35,13 2,14 14,16 34,17 8,20 2,21 6,22 2,24 20,25 7,26 1,28 6,31 1,32 15,36 0.294,37 10,38 16,39 34.872,40 40.816,41 21.012,42 19.003,44 4.678}
{0 CHEMBL106117,1 6.485,2 23.7,3 57.9,4 0.994,5 1.164,6 0.599,7 0.54,8 246.44,9 15.8,11 38,13 2,14 15,16 37,17 9,20 2,21 7,22 2,24 22,25 7,26 1,28 6,31 1,32 16,36 0.297,37 11,38 17,39 37.756,40 44.231,41 22.773,42 20.53,44 4.319}
{0 CHEMBL229457,1 5.385,2 25,3 62.5,4 0.984,5 1.166,6 0.566,7 0.509,8 172.32,9 12.5,11 32,13 1,14 11,16 31,17 8,20 1,21 7,22 1,24 20,25 4,28 4,32 12,36 0.226,37 7,38 12,39 31.476,40 37.315,41 18.114,42 16.3,44 7.523}
{0 CHEMBL280222,1 5.591,2 22.6,3 61.3,4 0.99,5 1.174,6 0.56,7 0.51,8 173.31,9 16.1,11 31,13 1,14 11,16 30,17 7,20 1,21 6,22 1,24 19,25 5,28 5,32 12,36 0.233,37 7,38 12,39 30.694,40 36.398,41 17.358,42 15.795,44 5.921}
{0 CHEMBL28743,1 5.048,2 23.1,3 65.4,4 0.98,5 1.169,6 0.552,7 0.49,8 131.26,9 11.5,11 26,14 8,16 25,17 6,21 6,24 17,25 3,28 3,32 9,36 0.24,37 6,38 8,39 25.491,40 30.401,41 14.347,42 12.752,44 4.387}
{0 CHEMBL29299,1 5.932,2 24,3 64,4 0.979,5 1.153,6 0.6,7 0.517,8 148.31,9 8,11 25,14 8,16 24,17 6,21 6,24 16,25 3,26 1,28 2,31 1,32 9,36 0.25,37 6,38 8,39 24.465,40 28.823,41 14.989,42 12.918,44 4.081}
{0 CHEMBL29910,1 5.29,2 24,3 64,4 0.989,5 1.164,6 0.552,7 0.498,8 132.24,9 8,11 25,14 8,16 24,17 6,21 6,24 16,25 3,28 2,29 1,32 9,35 4,36 0.25,37 6,38 8,39 24.716,40 29.112,41 13.796,42 12.445,44 4.886}
{0 CHEMBL317697,1 5.547,2 25.9,3 61.1,4 0.985,5 1.165,6 0.573,7 0.518,8 299.54,9 13,11 54,13 2,14 20,16 53,17 14,20 2,21 12,22 2,24 33,25 7,28 7,32 21,36 0.302,37 16,38 22,39 53.199,40 62.886,41 30.938,42 27.998,44 4.398}
{0 CHEMBL321347,1 6.345,2 23.3,3 60,4 0.989,5 1.161,6 0.6,7 0.532,8 190.36,9 13.3,11 30,13 1,14 11,16 29,17 7,20 1,21 6,22 1,24 18,25 5,26 1,28 4,31 1,32 12,36 0.241,37 7,38 12,39 29.669,40 34.82,41 18,42 15.96,44 5.721}
{0 CHEMBL322423,1 4.87,2 28,3 66,4 0.971,5 1.154,6 0.569,7 0.499,8 243.5,9 6,11 50,14 16,16 49,17 14,21 14,24 33,25 3,28 3,32 17,36 0.286,37 14,38 16,39 48.559,40 57.723,41 28.438,42 24.966,44 4.201}
{0 CHEMBL73634,1 5.71,2 25,3 60,4 0.989,5 1.168,6 0.572,7 0.522,8 228.4,9 15,11 40,13 2,14 15,16 39,17 10,20 2,21 8,22 2,24 24,25 6,28 6,32 16,36 0.282,37 11,38 17,39 39.563,40 46.727,41 22.887,42 20.87,44 4.793}
